<?xml version="1.0" encoding="utf-8"?>
<svg width="312" height="39" xmlns="http://www.w3.org/2000/svg">
  <g fill-rule="nonzero" fill="none">
    <path d="M13.255 11.963c-7.093 0-12.843 5.75-12.843 12.843s5.75 12.842 12.843 12.842c7.092 0 12.842-5.75 12.842-12.842a12.842 12.842 0 0 0-12.842-12.843zm0 19.704a6.86 6.86 0 1 1 6.86-6.861 6.86 6.86 0 0 1-6.86 6.852v.009z" fill="#7EC13D"/>
    <path d="M13.255 0v6.003a18.807 18.807 0 0 1 16.083 28.571l4.999 3.308A24.806 24.806 0 0 0 13.255 0z" fill="#7EC13D"/>
  </g>
</svg>