[
  [
    {
      "fields": {
        "calamari.request.query_string": [
          "stats=occupation-name&q=undersk%C3%B6terska&offset=0&limit=0&sort=relevance"
        ]
      }
    },
    {
      "fields": {
        "calamari.request.query_string": [
          "stats=occupation-name&q=grundl%C3%A4rare&offset=0&limit=0&sort=relevance"
        ]
      }
    },
    {
      "fields": {
        "calamari.request.query_string": [
          "stats=occupation-name&q=programmerare&offset=0&limit=0&sort=relevance"
        ]
      }
    },
    {
      "fields": {
        "calamari.request.query_string": [
          "municipality=viCA_36P_pQp&published-after=2024-07-01T06:09:00&published-before=2024-07-02T02:06:00&offset=0&limit=0&sort=relevance"
        ]
      }
    },
    {
      "fields": {
        "calamari.request.query_string": [
          "stats=occupation-name&q=s%C3%A4ljare&offset=0&limit=0&sort=relevance"
        ]
      }
    },
    {
      "fields": {
        "calamari.request.query_string": [
          "stats=occupation-name&q=st%C3%A4dare&offset=0&limit=0&sort=relevance"
        ]
      }
    },
    {
      "fields": {
        "calamari.request.query_string": [
          "stats=occupation-name&q=sjuksk%C3%B6terskor&offset=0&limit=0&sort=relevance"
        ]
      }
    },
    {
      "fields": {
        "calamari.request.query_string": [
          "stats=occupation-name&q=f%C3%B6rs%C3%A4ljare&offset=0&limit=0&sort=relevance"
        ]
      }
    },
    {
      "fields": {
        "calamari.request.query_string": [
          "stats=occupation-name&q=f%C3%A4lts%C3%A4ljare&offset=0&limit=0&sort=relevance"
        ]
      }
    },
    {
      "fields": {
        "calamari.request.query_string": [
          "stats=occupation-name&q=kundtj%C3%A4nstmedarbetare&offset=0&limit=0&sort=relevance"
        ]
      }
    }
  ],
  [
    {
      "fields": {
        "calamari.request.query_string": [
          "employment-type=Jh8f_q9J_pbJ&q=stockholms+l%C3%A4n&region=CifL_Rzy_Mku&published-before=2024-07-02T03:12:00&offset=25&limit=25&sort=relevance"
        ]
      }
    },
    {
      "fields": {
        "calamari.request.query_string": [
          "municipality=muSY_tsR_vDZ&municipality=oYPt_yRA_Smm&published-before=2024-07-02T03:24:00&offset=100&limit=25&sort=pubdate-desc"
        ]
      }
    },
    {
      "fields": {
        "calamari.request.query_string": [
          "q=undersk%C3%B6terska&municipality=5ohg_WJU_Ktn&municipality=naG4_AUS_z2v&municipality=muSY_tsR_vDZ&municipality=vBrj_bov_KEX&published-before=2024-07-02T03:27:00&offset=0&limit=25&sort=relevance"
        ]
      }
    },
    {
      "fields": {
        "calamari.request.query_string": [
          "employment-type=Jh8f_q9J_pbJ&q=stockholms+l%C3%A4n&region=CifL_Rzy_Mku&published-before=2024-07-02T03:12:00&offset=0&limit=25&sort=relevance"
        ]
      }
    },
    {
      "fields": {
        "calamari.request.query_string": [
          "stats=occupation-name&q=undersk%C3%B6terska&offset=0&limit=0&sort=relevance"
        ]
      }
    },
    {
      "fields": {
        "calamari.request.query_string": [
          "stats=occupation-name&q=kock&offset=0&limit=0&sort=relevance"
        ]
      }
    },
    {
      "fields": {
        "calamari.request.query_string": [
          "stats=occupation-name&q=mjukvaruutvecklare&offset=0&limit=0&sort=relevance"
        ]
      }
    },
    {
      "fields": {
        "calamari.request.query_string": [
          "q=28623887&municipality=qj3q_oXH_MGR&published-after=2024-03-18T13:12:00&published-before=2024-07-02T03:21:00&offset=0&limit=0&sort=relevance"
        ]
      }
    },
    {
      "fields": {
        "calamari.request.query_string": [
          "occupation-group=shkw_ojo_UL2&published-after=2024-02-29T23:03:00&published-before=2024-07-02T03:27:00&offset=0&limit=0&sort=relevance"
        ]
      }
    }
  ],
  [
    {
      "fields": {
        "calamari.request.query_string": [
          "stats=occupation-name&q=s%C3%A4ljare&offset=0&limit=0&sort=relevance"
        ]
      }
    },
    {
      "fields": {
        "calamari.request.query_string": [
          "stats=occupation-name&q=%C3%A4mnesl%C3%A4rare&offset=0&limit=0&sort=relevance"
        ]
      }
    },
    {
      "fields": {
        "calamari.request.query_string": [
          "stats=occupation-name&q=s%C3%A4ljare&offset=0&limit=0&sort=relevance"
        ]
      }
    },
    {
      "fields": {
        "calamari.request.query_string": [
          "stats=occupation-name&q=st%C3%A4dare&offset=0&limit=0&sort=relevance"
        ]
      }
    },
    {
      "fields": {
        "calamari.request.query_string": [
          "stats=occupation-name&q=utes%C3%A4ljare&offset=0&limit=0&sort=relevance"
        ]
      }
    },
    {
      "fields": {
        "calamari.request.query_string": [
          "occupation-group=FiDm_2S8_gx7&published-before=2024-07-02T04:11:00&offset=0&limit=25&sort=applydate-asc"
        ]
      }
    },
    {
      "fields": {
        "calamari.request.query_string": [
          "q=katrineholm&published-after=2024-06-22T03:22:00&published-before=2024-07-02T04:04:00&offset=0&limit=0&sort=relevance"
        ]
      }
    },
    {
      "fields": {
        "calamari.request.query_string": [
          "stats=occupation-name&q=grundl%C3%A4rare&offset=0&limit=0&sort=relevance"
        ]
      }
    },
    {
      "fields": {
        "calamari.request.query_string": [
          "published-before=2024-07-02T04:11:00&offset=0&limit=25&sort=relevance&employer=5569989683"
        ]
      }
    },
    {
      "fields": {
        "calamari.request.query_string": [
          "published-before=2024-07-02T04:11:00&offset=0&limit=25&sort=applydate-asc"
        ]
      }
    },
    {
      "fields": {
        "calamari.request.query_string": [
          "stats=occupation-name&q=projektledare&offset=0&limit=0&sort=relevance"
        ]
      }
    },
    {
      "fields": {
        "calamari.request.query_string": [
          "stats=occupation-name&q=systemutvecklare&offset=0&limit=0&sort=relevance"
        ]
      }
    },
    {
      "fields": {
        "calamari.request.query_string": [
          "stats=occupation-name&q=sjuksk%C3%B6terska&offset=0&limit=0&sort=relevance"
        ]
      }
    },
    {
      "fields": {
        "calamari.request.query_string": [
          "q=controller&region=zdoY_6u5_Krt&offset=0&limit=7&sort=pubdate-desc&published-after=2024-07-01T05:21:05.166171"
        ]
      }
    }
  ],
  [
    {
      "fields": {
        "calamari.request.query_string": [
          "stats=occupation-name&q=%C3%A4mnesl%C3%A4rare&offset=0&limit=0&sort=relevance"
        ]
      }
    },
    {
      "fields": {
        "calamari.request.query_string": [
          "stats=occupation-name&q=personlig+assistent&offset=0&limit=0&sort=relevance"
        ]
      }
    },
    {
      "fields": {
        "calamari.request.query_string": [
          "q=deltidsarbete+link%C3%B6ping&offset=0&limit=7&sort=pubdate-desc&published-after=2024-06-21T05:24:58.682875"
        ]
      }
    },
    {
      "fields": {
        "calamari.request.query_string": [
          "worktime-extent=947z_JGS_Uk2&experience=false&driving-license-required=false&municipality=bm2x_1mr_Qhx&q=link%C3%B6ping&offset=0&limit=7&sort=pubdate-desc&published-after=2024-06-30T05:20:04.802318"
        ]
      }
    },
    {
      "fields": {
        "calamari.request.query_string": [
          "municipality=4KBw_CPU_VQv&published-before=2024-07-02T05:24:00&offset=0&limit=25&sort=relevance"
        ]
      }
    }
  ],
  [
    {
      "fields": {
        "calamari.request.query_string": [
          "stats=occupation-name&q=butikss%C3%A4ljare&offset=0&limit=0&sort=relevance"
        ]
      }
    },
    {
      "fields": {
        "calamari.request.query_string": [
          "stats=occupation-name&q=st%C3%A4dare&offset=0&limit=0&sort=relevance"
        ]
      }
    },
    {
      "fields": {
        "calamari.request.query_string": [
          "q=f%C3%B6rs%C3%A4ljare&region=CifL_Rzy_Mku&published-after=2024-06-24T09:00:00&published-before=2024-07-02T05:24:00&offset=0&limit=0&sort=relevance"
        ]
      }
    },
    {
      "fields": {
        "calamari.request.query_string": [
          "q=forskningssjuksk%C3%B6terska&region=CaRE_1nn_cSU&offset=0&limit=7&sort=pubdate-desc&published-after=2024-06-20T05:25:13.760272"
        ]
      }
    },
    {
      "fields": {
        "calamari.request.query_string": [
          "stats=occupation-name&q=programmerare&offset=0&limit=0&sort=relevance&employer=8406142383"
        ]
      }
    },
    {
      "fields": {
        "calamari.request.query_string": [
          "q=Sommarjobb&municipality=muSY_tsR_vDZ&municipality=oYPt_yRA_Smm&municipality=STvk_dra_M1X&municipality=Tcog_5sH_b46&offset=0&limit=7&sort=pubdate-desc&published-after=2024-07-01T06:19:32.676711"
        ]
      }
    },
    {
      "fields": {
        "calamari.request.query_string": [
          "q=kommunv%C3%A4gledarw&municipality=xJqx_SLC_415&municipality=AEQD_1RT_vM9&municipality=a7hJ_zwv_2FR&published-after=2024-06-26T13:17:00&published-before=2024-07-02T06:36:00&offset=0&limit=0&sort=pubdate-desc"
        ]
      }
    },
    {
      "fields": {
        "calamari.request.query_string": [
          "q=r%C3%A4ttsvetenskap&published-after=2024-02-29T10:00:00&published-before=2024-07-02T06:36:00&offset=0&limit=0&sort=pubdate-desc"
        ]
      }
    },
    {
      "fields": {
        "calamari.request.query_string": [
          "municipality=xJqx_SLC_415&municipality=AEQD_1RT_vM9&municipality=a7hJ_zwv_2FR&published-before=2024-07-02T06:36:00&offset=0&limit=25&sort=pubdate-desc"
        ]
      }
    },
    {
      "fields": {
        "calamari.request.query_string": [
          "stats=occupation-name&q=personlig+assistent&offset=0&limit=0&sort=relevance"
        ]
      }
    },
    {
      "fields": {
        "calamari.request.query_string": [
          "stats=occupation-name&q=projektledare&offset=0&limit=0&sort=relevance"
        ]
      }
    },
    {
      "fields": {
        "calamari.request.query_string": [
          "occupation-group=sq3e_WVv_Fjd&occupation-group=7pz9_eY9_D2s&occupation-group=n6iX_f2z_XfE&q=%C3%B6ster%C3%A5ker&municipality=E4CV_a5E_ucX&municipality=btgf_fS7_sKG&municipality=onpA_B5a_zfv&municipality=K4az_Bm6_hRV&municipality=9aAJ_j6L_DST&municipality=8gKt_ZsV_PGj&offset=0&limit=7&sort=pubdate-desc&published-after=2024-06-19T06:33:02.672701"
        ]
      }
    }
  ],
  [
    {
      "fields": {
        "calamari.request.query_string": [
          "q=abf&published-after=2024-06-05T13:28:00&published-before=2024-07-02T07:01:00&offset=0&limit=0&sort=pubdate-desc"
        ]
      }
    },
    {
      "fields": {
        "calamari.request.query_string": [
          "q=k%C3%A4hrs&region=9QUH_2bb_6Np&published-after=2024-06-26T10:40:00&published-before=2024-07-02T07:01:00&offset=0&limit=0&sort=pubdate-desc"
        ]
      }
    },
    {
      "fields": {
        "calamari.request.query_string": [
          "region=9QUH_2bb_6Np&published-before=2024-07-02T07:01:00&offset=0&limit=25&sort=pubdate-desc"
        ]
      }
    },
    {
      "fields": {
        "calamari.request.query_string": [
          "q=orderplockare%20j%25C3%25B6nk%25C3%25B6ping&offset=0&limit=100"
        ]
      }
    },
    {
      "fields": {
        "calamari.request.query_string": [
          "region=xTCk_nT5_Zjm&published-before=2024-07-02T07:01:00&offset=175&limit=25&sort=pubdate-desc"
        ]
      }
    },
    {
      "fields": {
        "calamari.request.query_string": [
          "q=lager&offset=100&limit=100"
        ]
      }
    },
    {
      "fields": {
        "calamari.request.query_string": [
          "municipality=TpRZ_bFL_jhL&published-after=2024-07-01T22:55:00&published-before=2024-07-02T07:01:00&offset=0&limit=0&sort=relevance"
        ]
      }
    },
    {
      "fields": {
        "calamari.request.query_string": [
          "region=xTCk_nT5_Zjm&published-after=2024-07-01T22:08:00&published-before=2024-07-02T07:01:00&offset=0&limit=0&sort=pubdate-desc"
        ]
      }
    },
    {
      "fields": {
        "calamari.request.query_string": [
          "occupation-group=kLyY_rwr_aJr&municipality=E4CV_a5E_ucX&municipality=Z5Cq_SgB_dsB&municipality=zHxw_uJZ_NJ8&municipality=AvNB_uwa_6n6&municipality=UTJZ_zHH_mJm&municipality=onpA_B5a_zfv&municipality=XWKY_c49_5nv&municipality=K4az_Bm6_hRV&municipality=9aAJ_j6L_DST&municipality=8gKt_ZsV_PGj&offset=0&limit=7&sort=pubdate-desc&published-after=2024-06-30T06:34:57.078551"
        ]
      }
    },
    {
      "fields": {
        "calamari.request.query_string": [
          "q=l%C3%A4rare&published-after=2024-06-20T17:01:00&published-before=2024-07-02T08:00:00&offset=0&limit=0&sort=pubdate-desc"
        ]
      }
    },
    {
      "fields": {
        "calamari.request.query_string": [
          "q=socialpedagog&region=CifL_Rzy_Mku&offset=0&limit=7&sort=pubdate-desc&published-after=2024-06-29T07:02:07.047003"
        ]
      }
    }
  ],
  [
    {
      "fields": {
        "calamari.request.query_string": [
          "stats=occupation-name&q=programmerare&offset=0&limit=0&sort=relevance"
        ]
      }
    },
    {
      "fields": {
        "calamari.request.query_string": [
          "stats=occupation-name&q=systemutvecklare&offset=0&limit=0&sort=relevance"
        ]
      }
    },
    {
      "fields": {
        "calamari.request.query_string": [
          "stats=occupation-name&q=programmerare&offset=0&limit=0&sort=relevance"
        ]
      }
    },
    {
      "fields": {
        "calamari.request.query_string": [
          "stats=occupation-name&q=civilingenj%C3%B6r&offset=0&limit=0&sort=relevance"
        ]
      }
    },
    {
      "fields": {
        "calamari.request.query_string": [
          "stats=occupation-name&q=systemutvecklare&offset=0&limit=0&sort=relevance"
        ]
      }
    },
    {
      "fields": {
        "calamari.request.query_string": [
          "stats=occupation-name&q=civilingenj%C3%B6r&offset=0&limit=0&sort=relevance"
        ]
      }
    },
    {
      "fields": {
        "calamari.request.query_string": [
          "municipality=MMph_wmN_esc&published-after=2024-07-01T13:14:00&published-before=2024-07-02T08:00:00&offset=0&limit=0&sort=relevance"
        ]
      }
    },
    {
      "fields": {
        "calamari.request.query_string": [
          "q=it+pedagogik&published-after=2024-07-01T23:02:00&published-before=2024-07-02T08:00:00&offset=0&limit=0&sort=pubdate-desc"
        ]
      }
    },
    {
      "fields": {
        "calamari.request.query_string": [
          "q=j%25C3%25B6nk%25C3%25B6pings%20l%25C3%25A4n&offset=200&limit=100"
        ]
      }
    }
  ],
  [
    {
      "fields": {
        "calamari.request.query_string": [
          "q=m%C3%B6lndal+l%C3%A4rare&published-after=2024-07-01T21:25:00&published-before=2024-07-02T09:09:00&offset=0&limit=0&sort=relevance"
        ]
      }
    },
    {
      "fields": {
        "calamari.request.query_string": [
          "stats=occupation-name&q=f%C3%B6rs%C3%A4ljare&offset=0&limit=0&sort=relevance"
        ]
      }
    },
    {
      "fields": {
        "calamari.request.query_string": [
          "q=post+kungsbacka&published-after=2024-02-27T15:24:00&published-before=2024-07-02T09:09:00&offset=0&limit=0&sort=relevance"
        ]
      }
    },
    {
      "fields": {
        "calamari.request.query_string": [
          "stats=occupation-name&q=kock&offset=0&limit=0&sort=relevance"
        ]
      }
    },
    {
      "fields": {
        "calamari.request.query_string": [
          "stats=occupation-name&q=grundl%C3%A4rare&offset=0&limit=0&sort=relevance"
        ]
      }
    },
    {
      "fields": {
        "calamari.request.query_string": [
          "stats=occupation-name&q=f%C3%B6rs%C3%A4ljare&offset=0&limit=0&sort=relevance"
        ]
      }
    },
    {
      "fields": {
        "calamari.request.query_string": [
          "stats=occupation-name&q=sjuksk%C3%B6terskor&offset=0&limit=0&sort=relevance"
        ]
      }
    },
    {
      "fields": {
        "calamari.request.query_string": [
          "published-before=2024-07-02T09:09:00&offset=0&limit=25&sort=pubdate-desc"
        ]
      }
    },
    {
      "fields": {
        "calamari.request.query_string": [
          "q=Halmstad&published-before=2024-07-02T09:07:00&offset=75&limit=25&sort=relevance"
        ]
      }
    },
    {
      "fields": {
        "calamari.request.query_string": [
          "stats=occupation-name&q=s%C3%A4ljare&offset=0&limit=0&sort=relevance"
        ]
      }
    },
    {
      "fields": {
        "calamari.request.query_string": [
          "stats=occupation-name&q=civilingenj%C3%B6r&offset=0&limit=0&sort=relevance"
        ]
      }
    },
    {
      "fields": {
        "calamari.request.query_string": [
          "q=boplats&published-after=2024-05-14T12:35:00&published-before=2024-07-02T10:01:00&offset=0&limit=0&sort=relevance"
        ]
      }
    },
    {
      "fields": {
        "calamari.request.query_string": [
          "q=psykolog+varberg&published-after=2024-04-09T20:58:00&published-before=2024-07-02T10:01:00&offset=0&limit=0&sort=relevance"
        ]
      }
    },
    {
      "fields": {
        "calamari.request.query_string": [
          "published-before=2024-07-02T10:01:00&offset=0&limit=100&sort=relevance"
        ]
      }
    },
    {
      "fields": {
        "calamari.request.query_string": [
          "occupation-group=wVfo_Njx_1rB&occupation-group=CSUf_ZVM_a7Z&occupation-group=xuSE_mtB_Mir&region=CifL_Rzy_Mku&published-before=2024-07-02T10:01:00&offset=0&limit=25&sort=relevance"
        ]
      }
    }
  ],
  [
    {
      "fields": {
        "calamari.request.query_string": [
          "stats=occupation-name&q=projektledare&offset=0&limit=0&sort=relevance"
        ]
      }
    },
    {
      "fields": {
        "calamari.request.query_string": [
          "q=Marks+kommun&published-after=2024-05-22T10:08:00&published-before=2024-07-02T10:01:00&offset=0&limit=0&sort=relevance"
        ]
      }
    },
    {
      "fields": {
        "calamari.request.query_string": [
          "worktime-extent=947z_JGS_Uk2&q=G%C3%B6teborg&published-after=2024-06-16T17:25:00&published-before=2024-07-02T10:01:00&offset=0&limit=0&sort=relevance"
        ]
      }
    },
    {
      "fields": {
        "calamari.request.query_string": [
          "stats=occupation-name&q=systemutvecklare&offset=0&limit=0&sort=relevance"
        ]
      }
    },
    {
      "fields": {
        "calamari.request.query_string": [
          "occupation-name=BK8D_hZe_dtk&limit=0"
        ]
      }
    }
  ],
  [
    {
      "fields": {
        "calamari.request.query_string": [
          "stats=occupation-name&q=personlig+assistent&offset=0&limit=0&sort=relevance"
        ]
      }
    },
    {
      "fields": {
        "calamari.request.query_string": [
          "stats=occupation-name&q=undersk%C3%B6terska&offset=0&limit=0&sort=relevance"
        ]
      }
    },
    {
      "fields": {
        "calamari.request.query_string": [
          "stats=occupation-name&q=f%C3%A4lts%C3%A4ljare&offset=0&limit=0&sort=relevance"
        ]
      }
    },
    {
      "fields": {
        "calamari.request.query_string": [
          "stats=occupation-name&q=kundtj%C3%A4nstmedarbetare&offset=0&limit=0&sort=relevance"
        ]
      }
    },
    {
      "fields": {
        "calamari.request.query_string": [
          "stats=occupation-name&q=civilingenj%C3%B6r&offset=0&limit=0&sort=relevance"
        ]
      }
    },
    {
      "fields": {
        "calamari.request.query_string": [
          "stats=occupation-name&q=projektledare&offset=0&limit=0&sort=relevance"
        ]
      }
    },
    {
      "fields": {
        "calamari.request.query_string": [
          "employer=034043"
        ]
      }
    },
    {
      "fields": {
        "calamari.request.query_string": [
          "q=Ystad&published-before=2024-07-02T10:58:00&offset=75&limit=25&sort=relevance"
        ]
      }
    },
    {
      "fields": {
        "calamari.request.query_string": [
          "stats=occupation-name&q=utes%C3%A4ljare&offset=0&limit=0&sort=relevance"
        ]
      }
    },
    {
      "fields": {
        "calamari.request.query_string": [
          "stats=occupation-name&q=programmerare&offset=0&limit=0&sort=relevance"
        ]
      }
    }
  ],
  [
    {
      "fields": {
        "calamari.request.query_string": [
          "published-before=2024-07-02T12:00:00&offset=0&limit=25&sort=relevance"
        ]
      }
    },
    {
      "fields": {
        "calamari.request.query_string": [
          "stats=occupation-name&q=personlig+assistent&offset=0&limit=0&sort=relevance"
        ]
      }
    },
    {
      "fields": {
        "calamari.request.query_string": [
          "stats=occupation-name&q=st%C3%A4dare&offset=0&limit=0&sort=relevance"
        ]
      }
    },
    {
      "fields": {
        "calamari.request.query_string": [
          "stats=occupation-name&q=grundl%C3%A4rare&offset=0&limit=0&sort=relevance"
        ]
      }
    },
    {
      "fields": {
        "calamari.request.query_string": [
          "stats=occupation-name&q=f%C3%A4lts%C3%A4ljare&offset=0&limit=0&sort=relevance"
        ]
      }
    },
    {
      "fields": {
        "calamari.request.query_string": [
          "stats=occupation-name&q=undersk%C3%B6terska&offset=0&limit=0&sort=relevance"
        ]
      }
    },
    {
      "fields": {
        "calamari.request.query_string": [
          "stats=occupation-name&q=projektledare&offset=0&limit=0&sort=relevance"
        ]
      }
    },
    {
      "fields": {
        "calamari.request.query_string": [
          "stats=occupation-name&q=sjuksk%C3%B6terskor&offset=0&limit=0&sort=relevance"
        ]
      }
    },
    {
      "fields": {
        "calamari.request.query_string": [
          "stats=occupation-name&q=programmerare&offset=0&limit=0&sort=relevance"
        ]
      }
    },
    {
      "fields": {
        "calamari.request.query_string": [
          "stats=occupation-name&q=systemutvecklare&offset=0&limit=0&sort=relevance"
        ]
      }
    }
  ],
  [
    {
      "fields": {
        "calamari.request.query_string": [
          "stats=occupation-name&q=l%C3%A4rare&offset=0&limit=0&sort=relevance"
        ]
      }
    },
    {
      "fields": {
        "calamari.request.query_string": [
          "stats=occupation-name&q=f%C3%A4lts%C3%A4ljare&offset=0&limit=0&sort=relevance"
        ]
      }
    },
    {
      "fields": {
        "calamari.request.query_string": [
          "occupation-field=MVqp_eS8_kDZ&q=park+skolan&municipality=y9HE_XD7_WaD&municipality=VacK_WF6_XVg&municipality=KURg_KJF_Lwc&municipality=KfXT_ySA_do2&published-after=2024-06-24T21:07:00&published-before=2024-07-02T13:01:00&offset=0&limit=0&sort=relevance"
        ]
      }
    },
    {
      "fields": {
        "calamari.request.query_string": [
          "stats=occupation-name&q=l%C3%A4rare&offset=0&limit=0&sort=relevance"
        ]
      }
    },
    {
      "fields": {
        "calamari.request.query_string": [
          "municipality=y9HE_XD7_WaD&municipality=VacK_WF6_XVg&municipality=KURg_KJF_Lwc&municipality=KfXT_ySA_do2&municipality=L1cX_MjM_y8W&municipality=xJqx_SLC_415&published-after=2024-07-02T10:05:00&published-before=2024-07-02T13:01:00&offset=0&limit=0&sort=relevance"
        ]
      }
    },
    {
      "fields": {
        "calamari.request.query_string": [
          "stats=occupation-name&q=f%C3%A4lts%C3%A4ljare&offset=0&limit=0&sort=relevance"
        ]
      }
    },
    {
      "fields": {
        "calamari.request.query_string": [
          "q=personlig+assistent&region=wjee_qH2_yb6&published-after=2024-06-10T13:52:00&published-before=2024-07-02T13:01:00&offset=0&limit=0&sort=relevance"
        ]
      }
    },
    {
      "fields": {
        "calamari.request.query_string": [
          "q=Budbilschauff%25C3%25B6r%2520Chauff%25C3%25B6r%2520Chauff%25C3%25B6rer%2520Paketbilsf%25C3%25B6rare%2520Pakethantering%2520Paketbilschauff%25C3%25B6r%2520Paketsortering%2520Paketering%2520Budbilschauff%25C3%25B6rer%2520Budbils-chauff%25C3%25B6r%2520Distributionsf%25C3%25B6rare%2520Distribution%2520Distribut%25C3%25B6r%2520Distribut%25C3%25B6rer%2520Distributionschauff%25C3%25B6r%2520Distributionsk%25C3%25B6rning%2520Post%2520Reklam%2520K%25C3%25B6rning%2520%25C3%2596sterg%25C3%25B6tland%2520Norrk%25C3%25B6ping%2520S%25C3%25B6derk%25C3%25B6ping%2520Link%25C3%25B6ping%2520Valdemarsvik%2520%25C3%2585by%2520Ljunga%2520budbilsf%25C3%25B6rare&offset=100&limit=100"
        ]
      }
    },
    {
      "fields": {
        "calamari.request.query_string": [
          "stats=occupation-name&q=undersk%C3%B6terska&offset=0&limit=0&sort=relevance"
        ]
      }
    },
    {
      "fields": {
        "calamari.request.query_string": [
          "stats=occupation-name&q=kock&offset=0&limit=0&sort=relevance"
        ]
      }
    }
  ],
  [
    {
      "fields": {
        "calamari.request.query_string": [
          "stats=occupation-name&q=civilingenj%C3%B6r&offset=0&limit=0&sort=relevance"
        ]
      }
    },
    {
      "fields": {
        "calamari.request.query_string": [
          "stats=occupation-name&q=kock&offset=0&limit=0&sort=relevance"
        ]
      }
    },
    {
      "fields": {
        "calamari.request.query_string": [
          "stats=occupation-name&q=programmerare&offset=0&limit=0&sort=relevance"
        ]
      }
    },
    {
      "fields": {
        "calamari.request.query_string": [
          "municipality=AvNB_uwa_6n6&published-before=2024-07-02T14:08:00&offset=75&limit=25&sort=relevance"
        ]
      }
    },
    {
      "fields": {
        "calamari.request.query_string": [
          "stats=occupation-name&q=mjukvaruutvecklare&offset=0&limit=0&sort=relevance"
        ]
      }
    },
    {
      "fields": {
        "calamari.request.query_string": [
          "q=lokalv%C3%A5rdare&region=CifL_Rzy_Mku&published-after=2024-01-30T11:27:00&published-before=2024-07-02T14:02:00&offset=0&limit=0&sort=relevance"
        ]
      }
    },
    {
      "fields": {
        "calamari.request.query_string": [
          "stats=occupation-name&q=st%C3%A4dare&offset=0&limit=0&sort=relevance"
        ]
      }
    },
    {
      "fields": {
        "calamari.request.query_string": [
          "stats=occupation-name&q=programmerare&offset=0&limit=0&sort=relevance"
        ]
      }
    },
    {
      "fields": {
        "calamari.request.query_string": [
          "stats=occupation-name&q=utes%C3%A4ljare&offset=0&limit=0&sort=relevance"
        ]
      }
    },
    {
      "fields": {
        "calamari.request.query_string": [
          "stats=occupation-name&q=projektledare&offset=0&limit=0&sort=relevance"
        ]
      }
    },
    {
      "fields": {
        "calamari.request.query_string": [
          "q=hudiksvall+st%C3%B6dass&published-after=2024-04-03T10:42:00&published-before=2024-07-02T15:00:00&offset=0&limit=0&sort=pubdate-desc"
        ]
      }
    },
    {
      "fields": {
        "calamari.request.query_string": [
          "stats=occupation-name&q=mjukvaruutvecklare&offset=0&limit=0&sort=relevance"
        ]
      }
    }
  ],
  [
    {
      "fields": {
        "calamari.request.query_string": [
          "stats=occupation-name&q=f%C3%A4lts%C3%A4ljare&offset=0&limit=0&sort=relevance"
        ]
      }
    },
    {
      "fields": {
        "calamari.request.query_string": [
          "q=gymnasiel%C3%A4rare+samh%C3%A4llskunskap&published-after=2024-05-23T18:24:00&published-before=2024-07-02T15:00:00&offset=0&limit=0&sort=relevance"
        ]
      }
    },
    {
      "fields": {
        "calamari.request.query_string": [
          "stats=occupation-name&q=utes%C3%A4ljare&offset=0&limit=0&sort=relevance"
        ]
      }
    },
    {
      "fields": {
        "calamari.request.query_string": [
          "stats=occupation-name&q=%C3%A4mnesl%C3%A4rare&offset=0&limit=0&sort=relevance"
        ]
      }
    },
    {
      "fields": {
        "calamari.request.query_string": [
          "stats=occupation-name&q=kock&offset=0&limit=0&sort=relevance"
        ]
      }
    },
    {
      "fields": {
        "calamari.request.query_string": [
          "q=speciall%C3%A4rare&region=CifL_Rzy_Mku&published-before=2024-07-02T15:00:00&offset=0&limit=25&sort=relevance"
        ]
      }
    },
    {
      "fields": {
        "calamari.request.query_string": [
          "q=g%C3%A4vleborg&published-before=2024-07-02T15:00:00&offset=25&limit=25&sort=relevance"
        ]
      }
    },
    {
      "fields": {
        "calamari.request.query_string": [
          "stats=occupation-name&q=systemutvecklare&offset=0&limit=0&sort=relevance"
        ]
      }
    }
  ],
  [
    {
      "fields": {
        "calamari.request.query_string": [
          "stats=occupation-name&q=mjukvaruutvecklare&offset=0&limit=0&sort=relevance"
        ]
      }
    },
    {
      "fields": {
        "calamari.request.query_string": [
          "stats=occupation-name&q=civilingenj%C3%B6r&offset=0&limit=0&sort=relevance"
        ]
      }
    },
    {
      "fields": {
        "calamari.request.query_string": [
          "stats=occupation-name&q=kundtj%C3%A4nstmedarbetare&offset=0&limit=0&sort=relevance"
        ]
      }
    },
    {
      "fields": {
        "calamari.request.query_string": [
          "q=grundskoll%C3%A4rare&published-after=2024-06-20T16:42:00&published-before=2024-07-02T16:01:00&offset=0&limit=0&sort=pubdate-desc"
        ]
      }
    },
    {
      "fields": {
        "calamari.request.query_string": [
          "driving-license-required=false&region=CifL_Rzy_Mku&occupation-collection=UdVa_jRr_9DE&published-before=2024-07-02T16:00:00&offset=0&limit=25&sort=pubdate-desc"
        ]
      }
    },
    {
      "fields": {
        "calamari.request.query_string": [
          "stats=occupation-name&q=f%C3%A4lts%C3%A4ljare&offset=0&limit=0&sort=relevance"
        ]
      }
    },
    {
      "fields": {
        "calamari.request.query_string": [
          "stats=occupation-name&q=l%C3%A4rare&offset=0&limit=0&sort=relevance"
        ]
      }
    },
    {
      "fields": {
        "calamari.request.query_string": [
          "stats=occupation-name&q=st%C3%A4dare&offset=0&limit=0&sort=relevance"
        ]
      }
    },
    {
      "fields": {
        "calamari.request.query_string": [
          "q=l%C3%A4rare+h%C3%B6gan%C3%A4s&region=CaRE_1nn_cSU&published-after=2024-06-26T06:53:00&published-before=2024-07-02T16:01:00&offset=0&limit=0&sort=pubdate-desc"
        ]
      }
    },
    {
      "fields": {
        "calamari.request.query_string": [
          "employment-type=PFZr_Syz_cUq&q=l%C3%A4rare+4-6&region=CaRE_1nn_cSU&municipality=c1iL_rqh_Zja&published-after=2024-06-13T07:53:00&published-before=2024-07-02T16:01:00&offset=0&limit=0&sort=pubdate-desc"
        ]
      }
    }
  ],
  [
    {
      "fields": {
        "calamari.request.query_string": [
          "q=undersk%C3%B6terska&municipality=zBmE_n6s_MnQ&published-after=2024-06-30T13:38:00&published-before=2024-07-02T17:02:00&offset=0&limit=0&sort=relevance"
        ]
      }
    },
    {
      "fields": {
        "calamari.request.query_string": [
          "stats=occupation-name&q=kundtj%C3%A4nstmedarbetare&offset=0&limit=0&sort=relevance"
        ]
      }
    },
    {
      "fields": {
        "calamari.request.query_string": [
          "stats=occupation-name&q=personlig+assistent&offset=0&limit=0&sort=relevance"
        ]
      }
    },
    {
      "fields": {
        "calamari.request.query_string": [
          "stats=occupation-name&q=kundtj%C3%A4nstmedarbetare&offset=0&limit=0&sort=relevance"
        ]
      }
    },
    {
      "fields": {
        "calamari.request.query_string": [
          "stats=occupation-name&q=f%C3%A4lts%C3%A4ljare&offset=0&limit=0&sort=relevance"
        ]
      }
    },
    {
      "fields": {
        "calamari.request.query_string": [
          "stats=occupation-name&q=%C3%A4mnesl%C3%A4rare&offset=0&limit=0&sort=relevance"
        ]
      }
    },
    {
      "fields": {
        "calamari.request.query_string": [
          "stats=occupation-name&q=kock&offset=0&limit=0&sort=relevance"
        ]
      }
    },
    {
      "fields": {
        "calamari.request.query_string": [
          "stats=occupation-name&q=kock&offset=0&limit=0&sort=relevance"
        ]
      }
    },
    {
      "fields": {
        "calamari.request.query_string": [
          "published-before=2024-07-02T17:02:00&offset=0&limit=25&sort=pubdate-desc"
        ]
      }
    },
    {
      "fields": {
        "calamari.request.query_string": [
          "stats=occupation-name&q=f%C3%B6rs%C3%A4ljare&offset=0&limit=0&sort=relevance"
        ]
      }
    },
    {
      "fields": {
        "calamari.request.query_string": [
          "q=%C3%B6rebro&published-before=2024-07-02T17:02:00&offset=0&limit=25&sort=pubdate-desc"
        ]
      }
    }
  ],
  [
    {
      "fields": {
        "calamari.request.query_string": [
          "published-before=2024-07-02T18:59:00&offset=0&limit=25&sort=relevance"
        ]
      }
    },
    {
      "fields": {
        "calamari.request.query_string": [
          "stats=occupation-name&q=utes%C3%A4ljare&offset=0&limit=0&sort=relevance"
        ]
      }
    },
    {
      "fields": {
        "calamari.request.query_string": [
          "region=9QUH_2bb_6Np&published-before=2024-07-02T18:59:00&offset=0&limit=25&sort=relevance"
        ]
      }
    },
    {
      "fields": {
        "calamari.request.query_string": [
          "stats=occupation-name&q=l%C3%A4rare&offset=0&limit=0&sort=relevance"
        ]
      }
    },
    {
      "fields": {
        "calamari.request.query_string": [
          "q=personlig+assistent&municipality=CCVZ_JA7_d3y&municipality=Q7gp_9dT_k2F&municipality=g1Gc_aXK_EKu&municipality=qm5H_jsD_fUF&municipality=aYA7_PpG_BqP&municipality=4KBw_CPU_VQv&municipality=8ryy_X54_xJj&municipality=Z5Cq_SgB_dsB&municipality=zHxw_uJZ_NJ8&municipality=AvNB_uwa_6n6&municipality=UTJZ_zHH_mJm&municipality=sTPc_k2B_SqV&municipality=onpA_B5a_zfv&municipality=XWKY_c49_5nv&municipality=w6yq_CGR_Fiv&municipality=K4az_Bm6_hRV&municipality=9aAJ_j6L_DST&published-before=2024-07-02T18:58:00&offset=150&limit=25&sort=relevance"
        ]
      }
    },
    {
      "fields": {
        "calamari.request.query_string": [
          "stats=occupation-name&q=st%C3%A4dare&offset=0&limit=0&sort=relevance"
        ]
      }
    },
    {
      "fields": {
        "calamari.request.query_string": [
          "stats=occupation-name&q=f%C3%B6rs%C3%A4ljare&offset=0&limit=0&sort=relevance"
        ]
      }
    },
    {
      "fields": {
        "calamari.request.query_string": [
          "q=lager+stockholms+l%C3%A4n&published-before=2024-07-02T18:59:00&offset=0&limit=25&sort=relevance"
        ]
      }
    }
  ],
  [
    {
      "fields": {
        "calamari.request.query_string": [
          "q=m%C3%B6lndal&published-after=2024-07-02T13:10:00&published-before=2024-07-02T18:59:00&offset=0&limit=0&sort=pubdate-desc"
        ]
      }
    },
    {
      "fields": {
        "calamari.request.query_string": [
          "q=v%C3%A4rnamo&published-after=2024-07-01T23:07:00&published-before=2024-07-02T19:09:00&offset=0&limit=0&sort=pubdate-desc"
        ]
      }
    },
    {
      "fields": {
        "calamari.request.query_string": [
          "region=zupA_8Nt_xcD&municipality=N1wJ_Cuu_7Cs&municipality=sD2e_1Tr_4WZ&municipality=K8A2_JBa_e6e&municipality=otaF_bQY_4ZD&municipality=cbyw_9aK_Cni&q=elevcoach&offset=0&limit=1&sort=pubdate-desc"
        ]
      }
    },
    {
      "fields": {
        "calamari.request.query_string": [
          "q=vilhelmina&published-before=2024-07-02T19:09:00&offset=0&limit=25&sort=relevance"
        ]
      }
    },
    {
      "fields": {
        "calamari.request.query_string": [
          "stats=occupation-name&q=systemutvecklare&offset=0&limit=0&sort=relevance"
        ]
      }
    },
    {
      "fields": {
        "calamari.request.query_string": [
          "stats=occupation-name&q=projektledare&offset=0&limit=0&sort=relevance"
        ]
      }
    },
    {
      "fields": {
        "calamari.request.query_string": [
          "employment-type=PFZr_Syz_cUq&employment-type=Jh8f_q9J_pbJ&occupation-field=ASGV_zcE_bWf&region=CifL_Rzy_Mku&published-after=2024-07-02T14:37:00&published-before=2024-07-02T19:09:00&offset=0&limit=0&sort=pubdate-desc"
        ]
      }
    },
    {
      "fields": {
        "calamari.request.query_string": [
          "q=phd+remote+sensing&published-after=2024-02-17T08:00:00&published-before=2024-07-02T19:09:00&offset=0&limit=0&sort=pubdate-desc"
        ]
      }
    },
    {
      "fields": {
        "calamari.request.query_string": [
          "stats=occupation-name&q=utes%C3%A4ljare&offset=0&limit=0&sort=relevance"
        ]
      }
    },
    {
      "fields": {
        "calamari.request.query_string": [
          "stats=occupation-name&q=s%C3%A4ljare&offset=0&limit=0&sort=relevance"
        ]
      }
    },
    {
      "fields": {
        "calamari.request.query_string": [
          "stats=occupation-name&q=projektledare&offset=0&limit=0&sort=relevance"
        ]
      }
    },
    {
      "fields": {
        "calamari.request.query_string": [
          "stats=occupation-name&q=civilingenj%C3%B6r&offset=0&limit=0&sort=relevance"
        ]
      }
    }
  ],
  [
    {
      "fields": {
        "calamari.request.query_string": [
          "stats=occupation-name&q=systemutvecklare&offset=0&limit=0&sort=relevance"
        ]
      }
    },
    {
      "fields": {
        "calamari.request.query_string": [
          "stats=occupation-name&q=butikss%C3%A4ljare&offset=0&limit=0&sort=relevance"
        ]
      }
    },
    {
      "fields": {
        "calamari.request.query_string": [
          "q=%C3%84lvdalen&region=oDpK_oZ2_WYt&published-after=2024-02-11T09:31:00&published-before=2024-07-02T20:37:00&offset=0&limit=0&sort=relevance"
        ]
      }
    },
    {
      "fields": {
        "calamari.request.query_string": [
          "stats=occupation-name&q=sjuksk%C3%B6terska&offset=0&limit=0&sort=relevance"
        ]
      }
    },
    {
      "fields": {
        "calamari.request.query_string": [
          "stats=occupation-name&q=f%C3%A4lts%C3%A4ljare&offset=0&limit=0&sort=relevance"
        ]
      }
    },
    {
      "fields": {
        "calamari.request.query_string": [
          "q=dalarnas+l%C3%A4n&region=oDpK_oZ2_WYt&published-after=2024-06-19T13:37:00&published-before=2024-07-02T20:37:00&offset=0&limit=0&sort=pubdate-desc"
        ]
      }
    },
    {
      "fields": {
        "calamari.request.query_string": [
          "stats=occupation-name&q=sjuksk%C3%B6terska&offset=0&limit=0&sort=relevance"
        ]
      }
    },
    {
      "fields": {
        "calamari.request.query_string": [
          "region=oDpK_oZ2_WYt&published-after=2024-07-02T19:03:00&published-before=2024-07-02T20:37:00&offset=0&limit=0&sort=pubdate-desc"
        ]
      }
    },
    {
      "fields": {
        "calamari.request.query_string": [
          "offset=0&limit=0&sort=pubdate-desc&resdet=brief&q=optiker%20j%C3%B6nk%C3%B6pings%20l%C3%A4n&published-after=2024-06-19T07:52:31"
        ]
      }
    }
  ],
  [
    {
      "fields": {
        "calamari.request.query_string": [
          "q=gunnilse&published-before=2024-07-02T21:29:00&offset=0&limit=25&sort=relevance"
        ]
      }
    },
    {
      "fields": {
        "calamari.request.query_string": [
          "stats=occupation-name&q=systemutvecklare&offset=0&limit=0&sort=relevance"
        ]
      }
    },
    {
      "fields": {
        "calamari.request.query_string": [
          "q=kamera%C3%B6vervakning&published-after=2024-07-02T17:29:00&published-before=2024-07-02T21:29:00&offset=0&limit=0&sort=relevance"
        ]
      }
    },
    {
      "fields": {
        "calamari.request.query_string": [
          "occupation-group=BWwk_fYX_S5B&occupation-group=aA2Z_9XX_R1v&municipality=UQ75_1eU_jaC&municipality=ypAQ_vTD_KLU&municipality=TpRZ_bFL_jhL&municipality=yHV7_2Y6_zQx&municipality=7HAb_9or_eFM&municipality=mc45_ki9_Bv3&municipality=CCiR_sXa_BVW&municipality=rZWC_pXf_ySZ&municipality=SEje_LdC_9qN&municipality=an4a_8t2_Zpd&published-before=2024-07-02T21:29:00&offset=0&limit=25&sort=relevance"
        ]
      }
    },
    {
      "fields": {
        "calamari.request.query_string": [
          "q=k%C3%B6k&region=CifL_Rzy_Mku&published-after=2024-01-24T13:52:00&published-before=2024-07-02T21:29:00&offset=0&limit=0&sort=relevance"
        ]
      }
    },
    {
      "fields": {
        "calamari.request.query_string": [
          "stats=occupation-name&q=systemutvecklare&offset=0&limit=0&sort=relevance"
        ]
      }
    },
    {
      "fields": {
        "calamari.request.query_string": [
          "q=traktamente&published-after=2024-06-26T12:50:00&published-before=2024-07-02T21:29:00&offset=0&limit=0&sort=pubdate-desc"
        ]
      }
    },
    {
      "fields": {
        "calamari.request.query_string": [
          "occupation-group=k3R3_UkC_nK2&occupation-group=2xQ4_4kh_kTZ&published-before=2024-07-02T21:29:00&offset=0&limit=25&sort=relevance"
        ]
      }
    },
    {
      "fields": {
        "calamari.request.query_string": [
          "q=juniorkonsult+g%C3%B6teborg&published-after=2024-05-26T17:37:00&published-before=2024-07-02T21:29:00&offset=0&limit=0&sort=relevance"
        ]
      }
    },
    {
      "fields": {
        "calamari.request.query_string": [
          "stats=occupation-name&q=%C3%A4mnesl%C3%A4rare&offset=0&limit=0&sort=relevance"
        ]
      }
    }
  ],
  [
    {
      "fields": {
        "calamari.request.query_string": [
          "q=helsingborg&published-after=2024-07-01T18:44:00&published-before=2024-07-02T22:01:00&offset=0&limit=0&sort=pubdate-desc"
        ]
      }
    },
    {
      "fields": {
        "calamari.request.query_string": [
          "stats=occupation-name&q=projektledare&offset=0&limit=0&sort=relevance"
        ]
      }
    },
    {
      "fields": {
        "calamari.request.query_string": [
          "stats=occupation-name&q=civilingenj%C3%B6r&offset=0&limit=0&sort=relevance"
        ]
      }
    },
    {
      "fields": {
        "calamari.request.query_string": [
          "q=n%C3%A4ringslivsutveckling&published-after=2024-07-02T10:39:00&published-before=2024-07-02T22:01:00&offset=0&limit=0&sort=pubdate-desc"
        ]
      }
    },
    {
      "fields": {
        "calamari.request.query_string": [
          "stats=occupation-name&q=grundl%C3%A4rare&offset=0&limit=0&sort=relevance"
        ]
      }
    },
    {
      "fields": {
        "calamari.request.query_string": [
          "q=n%C3%A4ringslivschef&published-after=2024-07-02T10:39:00&published-before=2024-07-02T22:01:00&offset=0&limit=0&sort=pubdate-desc"
        ]
      }
    },
    {
      "fields": {
        "calamari.request.query_string": [
          "stats=occupation-name&q=kock&offset=0&limit=0&sort=relevance"
        ]
      }
    },
    {
      "fields": {
        "calamari.request.query_string": [
          "stats=occupation-name&q=f%C3%B6rs%C3%A4ljare&offset=0&limit=0&sort=relevance"
        ]
      }
    },
    {
      "fields": {
        "calamari.request.query_string": [
          "stats=occupation-name&q=f%C3%A4lts%C3%A4ljare&offset=0&limit=0&sort=relevance"
        ]
      }
    },
    {
      "fields": {
        "calamari.request.query_string": [
          "stats=occupation-name&q=f%C3%A4lts%C3%A4ljare&offset=0&limit=0&sort=relevance"
        ]
      }
    }
  ],
  [
    {
      "fields": {
        "calamari.request.query_string": [
          "stats=occupation-name&q=sjuksk%C3%B6terskor&offset=0&limit=0&sort=relevance"
        ]
      }
    },
    {
      "fields": {
        "calamari.request.query_string": [
          "stats=occupation-name&q=f%C3%A4lts%C3%A4ljare&offset=0&limit=0&sort=relevance"
        ]
      }
    },
    {
      "fields": {
        "calamari.request.query_string": [
          "q=resurs&region=CaRE_1nn_cSU&published-after=2024-05-20T18:01:00&published-before=2024-07-02T23:05:00&offset=0&limit=0&sort=relevance"
        ]
      }
    },
    {
      "fields": {
        "calamari.request.query_string": [
          "occupation-field=bh3H_Y3h_5eD&occupation-field=6Hq3_tKo_V57&q=interim&published-after=2023-11-29T21:20:00&published-before=2024-07-02T23:05:00&offset=0&limit=0&sort=relevance"
        ]
      }
    },
    {
      "fields": {
        "calamari.request.query_string": [
          "stats=occupation-name&q=%C3%A4mnesl%C3%A4rare&offset=0&limit=0&sort=relevance"
        ]
      }
    },
    {
      "fields": {
        "calamari.request.query_string": [
          "municipality=fqAy_4ji_Lz2&published-before=2024-07-02T23:05:00&offset=50&limit=25&sort=relevance"
        ]
      }
    },
    {
      "fields": {
        "calamari.request.query_string": [
          "stats=occupation-name&q=%C3%A4mnesl%C3%A4rare&offset=0&limit=0&sort=relevance"
        ]
      }
    },
    {
      "fields": {
        "calamari.request.query_string": [
          "stats=occupation-name&q=undersk%C3%B6terska&offset=0&limit=0&sort=relevance"
        ]
      }
    },
    {
      "fields": {
        "calamari.request.query_string": [
          "q=lagerarbetare&offset=0&limit=100"
        ]
      }
    },
    {
      "fields": {
        "calamari.request.query_string": [
          "worktime-extent=947z_JGS_Uk2&q=Stockholm&published-before=2024-07-02T23:02:00&offset=25&limit=25&sort=relevance"
        ]
      }
    }
  ],
  [
    {
      "fields": {
        "calamari.request.query_string": [
          "q=V%C3%A4stra+G%C3%B6talands+1+jun&published-before=2024-07-02T23:46:00&offset=950&limit=25&sort=relevance"
        ]
      }
    },
    {
      "fields": {
        "calamari.request.query_string": [
          "stats=occupation-name&q=f%C3%A4lts%C3%A4ljare&offset=0&limit=0&sort=relevance"
        ]
      }
    },
    {
      "fields": {
        "calamari.request.query_string": [
          "stats=occupation-name&q=personlig+assistent&offset=0&limit=0&sort=relevance"
        ]
      }
    },
    {
      "fields": {
        "calamari.request.query_string": [
          "stats=occupation-name&q=utes%C3%A4ljare&offset=0&limit=0&sort=relevance"
        ]
      }
    },
    {
      "fields": {
        "calamari.request.query_string": [
          "stats=occupation-name&q=civilingenj%C3%B6r&offset=0&limit=0&sort=relevance"
        ]
      }
    },
    {
      "fields": {
        "calamari.request.query_string": [
          "published-before=2024-07-03T00:29:00&offset=0&limit=25&sort=relevance"
        ]
      }
    },
    {
      "fields": {
        "calamari.request.query_string": [
          "q=halmstad&municipality=3XMe_nGt_RcU&published-before=2024-07-03T00:29:00&offset=0&limit=25&sort=relevance"
        ]
      }
    },
    {
      "fields": {
        "calamari.request.query_string": [
          "stats=occupation-name&q=projektledare&offset=0&limit=0&sort=relevance"
        ]
      }
    },
    {
      "fields": {
        "calamari.request.query_string": [
          "stats=occupation-name&q=sjuksk%C3%B6terska&offset=0&limit=0&sort=relevance"
        ]
      }
    },
    {
      "fields": {
        "calamari.request.query_string": [
          "stats=occupation-name&q=systemutvecklare&offset=0&limit=0&sort=relevance"
        ]
      }
    }
  ],
  [
    {
      "fields": {
        "calamari.request.query_string": [
          "q=Ragunda&published-before=2024-07-03T01:21:00&offset=0&limit=25&sort=relevance"
        ]
      }
    },
    {
      "fields": {
        "calamari.request.query_string": [
          "q=stockholms+l%C3%A4n&published-after=2024-04-23T16:42:00&published-before=2024-07-03T01:21:00&offset=0&limit=0&sort=relevance"
        ]
      }
    },
    {
      "fields": {
        "calamari.request.query_string": [
          "stats=occupation-name&q=grundl%C3%A4rare&offset=0&limit=0&sort=relevance"
        ]
      }
    },
    {
      "fields": {
        "calamari.request.query_string": [
          "driving-license-required=false&q=lagerarbetare&municipality=PVZL_BQT_XtL&municipality=CCiR_sXa_BVW&published-after=2024-07-03T00:59:00&published-before=2024-07-03T01:21:00&offset=0&limit=0&sort=relevance"
        ]
      }
    },
    {
      "fields": {
        "calamari.request.query_string": [
          "q=bvc-sjuksk%C3%B6terska&published-after=2024-07-03T01:04:00&published-before=2024-07-03T01:21:00&offset=0&limit=0&sort=relevance"
        ]
      }
    },
    {
      "fields": {
        "calamari.request.query_string": [
          "stats=occupation-name&q=s%C3%A4ljare&offset=0&limit=0&sort=relevance"
        ]
      }
    },
    {
      "fields": {
        "calamari.request.query_string": [
          "stats=occupation-name&q=st%C3%A4dare&offset=0&limit=0&sort=relevance"
        ]
      }
    },
    {
      "fields": {
        "calamari.request.query_string": [
          "q=natt+med+k%C3%B6rkort+stockholms+l%C3%A4n&published-after=2024-06-08T09:41:00&published-before=2024-07-03T01:21:00&offset=0&limit=0&sort=relevance"
        ]
      }
    },
    {
      "fields": {
        "calamari.request.query_string": [
          "q=nattarbete&region=CifL_Rzy_Mku&published-after=2024-06-30T23:25:00&published-before=2024-07-03T01:21:00&offset=0&limit=0&sort=relevance"
        ]
      }
    },
    {
      "fields": {
        "calamari.request.query_string": [
          "q=G%C3%B6teborg&occupation-collection=UdVa_jRr_9DE&published-after=2024-07-03T01:21:00&published-before=2024-07-03T01:21:00&offset=0&limit=0&sort=pubdate-desc"
        ]
      }
    }
  ]
]