@startuml

skinparam roundCorner 10

autonumber

actor User
participant "Data Consumer" as DC


participant "User Control Panel" as UCP
participant "OpenID Provider" as IdP
participant "Data Provider" as DP
participant "Notification Service" as NS

participant "Pod server" as RS
database "User Pod" as RS_USER
database "DC Pod" as RS_DC
database "DP Pod" as RS_DP

User -> DC: Visits
activate DC #66ff66
DC -> UCP: Redirect
deactivate DC
activate UCP #66ff66
User <- UCP: Present data processing information
User -> UCP: Agree & continue

==User authentication==

group #transparent Authentication
UCP -> IdP: Redirect
deactivate UCP
activate IdP #66ff66
User <- IdP: Present authentication prompt
User -> IdP: Credentials
UCP <- IdP: Redirect
deactivate IdP
activate UCP #66ff66
UCP -> IdP: Request tokens
activate IdP
UCP <- IdP: Tokens
deactivate IdP
note over UCP
Authenticated session
end note
end

@enduml