{
    "@context": "https://linkedsoftwaredependencies.org/bundles/npm/@solid/community-server/^2.0.0/components/context.jsonld",
    "import": [
      "files-scs:config/app/main/default.json",
      "files-scs:config/app/init/initialize-prefilled-root.json",
      "files-scs:config/app/setup/optional.json",
      "files-scs:config/http/handler/notification.json",
      "files-scs:config/http/middleware/websockets.json",
      "files-scs:config/http/server-factory/websockets.json",
      "files-scs:config/http/static/default.json",
      "files-scs:config/identity/access/public.json",
      "files-scs:config/identity/email/default.json",
      "identity/handler/provider-factory/identity-oak.json",
      "identity/handler/default-oak.json",
      "files-scs:config/identity/ownership/token.json",
      "identity/pod/static-oak.json",
      "files-scs:config/identity/registration/enabled.json",
      "files-scs:config/ldp/authentication/dpop-bearer.json",
      "files-scs:config/ldp/authorization/webacl.json",
      "files-scs:config/ldp/handler/default.json",
      "files-scs:config/ldp/metadata-parser/default.json",
      "files-scs:config/ldp/metadata-writer/default.json",
      "files-scs:config/ldp/modes/default.json",
      "notification/default.json",
      "files-scs:config/storage/backend/memory.json",
      "files-scs:config/storage/key-value/resource-store.json",
      "files-scs:config/storage/middleware/default.json",
      "files-scs:config/util/auxiliary/acl.json",
      "files-scs:config/util/identifiers/suffix.json",
      "files-scs:config/util/index/default.json",
      "files-scs:config/util/logging/winston.json",
      "files-scs:config/util/representation-conversion/default.json",
      "files-scs:config/util/resource-locker/memory.json",
      "files-scs:config/util/variables/default.json"
    ],
    "@graph": [
      {
        "comment": "A single-pod server that stores its resources in memory."
      }
    ]
  }