{
  "@context": [
    "https://linkedsoftwaredependencies.org/bundles/npm/egendata-identity-provider/^0.0.0/components/context.jsonld",
    "https://linkedsoftwaredependencies.org/bundles/npm/@solid/community-server/^3.0.0/components/context.jsonld"
  ],
  "import": [
    "files-scs:config/identity/handler/account-store/default.json",
    "files-scs:config/identity/handler/adapter-factory/webid.json",
    "identity/handler/interaction/routes.json",
    "files-scs:config/identity/handler/provider-factory/identity.json"
  ],
  "@graph": [
    {
      "comment": "Routes all IDP related requests to the relevant handlers.",
      "@id": "urn:solid-server:default:IdentityProviderHandler",
      "@type": "RouterHandler",
      "args_baseUrl": { "@id": "urn:solid-server:default:variable:baseUrl" },
      "args_targetExtractor": { "@id": "urn:solid-server:default:TargetExtractor" },
      "args_allowedMethods": [ "*" ],
      "args_allowedPathNames": [ "^/idp/.*" ],
      "args_handler": { "@id": "urn:solid-server:default:IdentityProviderParsingHandler" }
    },
    {
      "comment": "Handles IDP input parsing.",
      "@id": "urn:solid-server:default:IdentityProviderParsingHandler",
      "@type": "ParsingHttpHandler",
      "args_requestParser": { "@id": "urn:solid-server:default:RequestParser" },
      "args_metadataCollector": { "@id": "urn:solid-server:default:OperationMetadataCollector" },
      "args_errorHandler": { "@id": "urn:solid-server:default:ErrorHandler" },
      "args_responseWriter": { "@id": "urn:solid-server:default:ResponseWriter" },
      "args_operationHandler": {
        "comment": "Handles IDP input authorization. Permission reader should be set to allow all if no authorization is needed.",
        "@type": "AuthorizingHttpHandler",
        "@id": "urn:solid-server:default:IdentityProviderAuthorizingHandler",
        "args_credentialsExtractor": { "@id": "urn:solid-server:default:CredentialsExtractor" },
        "args_modesExtractor": { "@id": "urn:solid-server:default:ModesExtractor" },
        "args_authorizer": { "@id": "urn:solid-server:default:Authorizer" },
        "args_operationHandler": { "@id": "urn:solid-server:default:IdentityProviderHttpHandler" }
      }
    },
    {
      "comment": "Handles IDP handler behaviour.",
      "@id": "urn:solid-server:default:IdentityProviderHttpHandler",
      "@type": "IdentityProviderHttpHandler",
      "args_providerFactory": { "@id": "urn:solid-server:default:IdentityProviderFactory" },
      "args_converter": { "@id": "urn:solid-server:default:RepresentationConverter" },
      "args_handler": { "@id": "urn:solid-server:default:InteractionHandler" }
    }
  ]
}
