"id","name","start_date","af_office","case_worker","application_status","employer_id:id","applicant_id:id","auto_suggestion_approval","approval"
"application_1","Internship Name 1","2021-12-01","HK","zzzaa","waiting","employer_1","applicant_1",examine,rejected
"application_2","Internship Name 2","2022-01-01","HK","zzzaa","waiting","employer_2","applicant_2",examine,eligible
"application_3","Internship Name 3","2022-02-01","HK","zzzaa","waiting","employer_3","applicant_3",examine,--
"application_4","Internship Name 4","2022-03-01","HK","zzzaa","waiting","employer_4","applicant_4",eligible,eligible
"application_5","Internship Name 5","2022-04-01","HK","zzzaa","waiting","employer_3","applicant_4",examine,--
