id,name,model_id:id,group_id:id,perm_read,perm_write,perm_create,perm_unlink
access_auth_saml_provider,auth_saml_provider,model_auth_saml_provider,base.group_system,1,1,1,1
auth_saml_provider_erp_manager_access,auth_saml_provider_erp_manager_access,model_auth_saml_provider,base.group_erp_manager,1,0,0,0
