name,type,description,note,legal_text,eligible
"AC","Active","Väpnad konflikt, alternativt skyddsbehövande","Uppehållstillstånd med stöd av 5 kap. 1 § UtlL grundat på skäl enligt 4 kap. 2 § UtlL","4 kap. 2 § samt 5 kap. 1 § UtlL",True
"AF","Active","Flykting","Uppehållstillstånd med stöd av 5 kap. 1 § UtlL grundat på skäl enligt 4 kap. 1 § UtlL","4 kap. 1 § samt 5 kap. 1 § UtlL",True
"AI","Active","Uppehållstillstånd på grund av Sveriges internationella åtaganden",,"5 kap. 4 § UtlL",True
"AT","Active","Tortyr, alternativt skyddsbehövande","Uppehållstillstånd med stöd av 5 kap. 1 § UtlL grundat på skäl enligt 4 kap. 2 § UtlL","4 kap. 2 § samt 5 kap. 1 § UtlL",True
"NJ","Active","Nationellt program 1 § 2a. GymL","Tidigare uppehållstillstånd enligt 16c, 16f eller 16h §§ lagen (2016:752) om tillfälliga begränsningar (TL).","1 § 2a. lagen (2017:353) om uppehållstillstånd för studerande på gymnasial nivå (GymL)",False
"NK","Active","Yrkesinriktad utbildning 1 § 2b. GymL","Tidigare uppehållstillstånd enligt 16c, 16f eller 16h §§ TL.","1 § 2b. GymL",False
"NL","Active","Yrkesutb Komvux 2 § 2c. GymL","Tidigare uppehållstillstånd enligt 16c, 16f eller 16h §§ TL.","2 § 2c. GymL",False
"NM","Active","Introduktionsprogram 1 § 2 st GymL","Tidigare uppehållstillstånd enligt 16c, 16f eller 16h §§ TL.","1 § 2 st GymL",False
"NO","Active","Nationellt program 2 § 2a. GymL","Uppehållstillstånd enligt 16a § TL.","2 § 2a. GymL",False
"NP","Active","Yrkesinriktad utbildning 2 § 2b. GymL","Uppehållstillstånd enligt 16a § TL.","2 § 2b. GymL",False
"NQ","Active","Yrkesutbildning Komvux 1 § 2c. GymL","Uppehållstillstånd enligt 16a § TL.","1 § 2c. GymL",False
"NR","Active","Introduktionsprogram 3 § GymL","Tidigare uppehållstillstånd enligt 16c § TL.","3 § GymL",False
"NS","Active","Fullföljd utbildning 4 § GymL","Tidigare tidsbegränsat uppehållstillstånd för gymnasiestudier och som fullföljt utbildningen.","4 § GymL",
"NT","Active","Permanent uppehållstillstånd 5 § 2 st GymL","Tidigare tidsbegränsat uppehållstillstånd för gymnasiestudier och som fått anställning.","5 § 2 st GymL",
"G1","Active","Synnerligen ömmande omst 5 kap. 6 § 1 st UtlL","Synnerligen ömmande omständigheter.","5 kap. 6 § 1 st UtlL",True
"G2","Active","Särsk öm omst/särsk ank Sv 5 kap 6 § 2 st UtlL","Särskilt ömmande omständigheter eller särskild anknytning till Sverige genom t.ex. lång vistelse här.","5 kap. 6 § 2 st UtlL",True
"SA","Active","Omprövning enligt 5 kap. 1 a § UtlL, ASSF",,"5 kap. 1 a § UtlL",True
"SF","Active","Omprövning enligt 5 kap. 1 a § UtlL, FSF",,"5 kap. 1 a § UtlL",True
"A","Passive","Flykting",,,True
"A3","Passive","Flykting enligt 4 kap 1 § utlänningslagen",,,True
"A5","Passive","Krigsvägrare (3 kap 3 § UTLL)",,,True
"A6","Passive","De-facto-flykting (3 kap 1§ 3 UTLL)",,,True
"A7","Passive","Skyddsbehövande i övrigt enligt 4kap 2§ punkt 1",,,True
"A8","Passive","Skyddsbehövande i övrigt enligt 4 kap 2§ punkt 2",,,True
"A9","Passive","Skyddsbehövande i övrigt enligt 4kap 2§ punkt 3",,,True
"AK","Passive","Kvotflykting, utlänning som överförts till Sverige med stöd av ett särskilt regeringsbeslut",,,True
"AM","Passive","Miljökatastrof, övrig skyddsbehövande",,"4 kap. 2 a § UtlL",True
"AS","Passive","Svåra motsättningar, övrig skyddsbehövande",,"4 kap. 2 a § UtlL",True
"AV","Passive","Väpnad konflikt, övrig skyddsbehövande",,"4 kap. 2 § UtlL",True
"G","Passive","Synnerl och särsk ömmande omständigh","Synnerliga och särskilt ömmande omständigheter enligt 5 kap 6 §","5 kap. 6 § UtlL",True
"SÖ","Passive","SÖ Omprövning enligt 5 kap. 1A § UTLL, ÖSSF",,,True
"T7","Passive","Kosovoförordningen, avräknas kvoten",,,
"T8","Passive","Kosovoförordningen, sökt i sverige",,,
"X1","Passive","Tillstånd bev pga tillf praxisändr (1989-01-12)",,,
"X2","Passive","Tillstånd bev pga tillf praxisändr (1994-04-14)",,,
"AX","Passive","AX Förlängning av tillstånd, flykting eller skyddsbehövande",,,True
"N1","Passive","N1 Anknytning - 6 § TL - flykting","Bifall enligt 6 § - uppehållstillstånd enligt 5 kap 3 § UtlL beviljas när anknytningspersonen är flykting med ”välgrundade utsikter” att beviljas PUT.
Undantag, se KK-klassning nedan.","6 § tidsbegränsade lagen (TL)",True
"N2","Passive","N2 - Anknytning - 7 § TL - skyddsbehövande ansökt före 151124","Bifall enligt 7 § - uppehållstillstånd beviljas när anknytningspersonen är skyddsbehövande om ansökan är registrerad den 24 november 2015 eller tidigare.","7 § tidsbegränsade lagen (TL)",True
"N3","Passive","N3 - 11 § TL - avslag strider mot svenskt konventionsåtagande","Bifall enligt 11 § - uppehållstillstånd enligt 5 kap 6 § som beviljas om det skulle strida mot svenskt konventions-åtagande att avvisa/utvisa utlänningen.","11 § tidsbegränsade lagen (TL)",True
"N4","Passive","N4 - 13 § TL - avslag strider mot svenskt konventionsåtagande","Bifall enligt 13 § - uppehållstillstånd pga. anknytning som beviljas om ett avslag skulle strida mot svenskt konventionsåtagande. Fr.o.m. 2020-04-01 endast för anknytning till A*, G, M*, X1, X2, N3 eller N7. För övriga, se B9.","13 § tidsbegränsade lagen (TL)",True
"N5","Passive","N5 - 17 § 2 st. TL - anställning och försörjning","PUT enligt 17 § 2 st. - om utlänningen har haft anställning enligt 17 § 1 st. och kan försörja sig.","17 § 2 st. tidsbegränsade lagen (TL)",True
"N6","Passive","N6 - 17 § 3st. TL - under 25 år + gymnasieutbildning eller motsvarande","PUT enligt 17 § 3 st. - om utlänningen inte fyllt 25 år och har fullföljt gymnasieutbildning eller motsvarande.","17 § 3 st. tidsbegränsade lagen (TL)",True
"N7","Passive","N7 - 18 § TL - synnerligen ömmande + hälsotillstånd, barn","PUT enligt 18 § - synnerligen ömmande omständigheter relaterat till varaktigt nedsatt hälsotillstånd hos barn.","18 § tidsbegränsade lagen (TL)",True
"N8","Passive","N8 - Anknytning - 6 § TL - alternativt skyddsbehövande","Se N1, men här är anknytningspersonen alternativt skyddsbehövande","6 § tidsbegränsade lagen (TL)",True
"NC","Passive","NC 16 C § 1st, Sk. Gymnasielagen, intro.program",,"16 c § 1 st tidsbegränsade lagen (TL)",False
"ND","Passive","ND 16 D §, Sk. Gymnasielagen, nation.program",,"16 d § tidsbegränsade lagen (TL)",False
"NE","Passive","NE 16 E §, Sk. Gymnasielagen tillstånd 4 år",,"16 e § tidsbegränsade lagen (TL)",False
"NF","Passive","NF 16 F §, Sk. Gymnasielagen, tillfällig",,"16 f § tidsbegränsade lagen (TL)",False
"NG","Passive","NG 16 G §, Sk. Gymnasielagen, fortsatta studier",,"16 g § tidsbegränsade lagen (TL)",False
"NH","Passive","NH 16 H §, Sk. Gymnasielagen, fortsatta studier",,"16 h § tidsbegränsade lagen (TL)",False
"NI","Passive","NI 16 I §, Sk, Gymnasielagen, etablering",,"16 i § tidsbegränsade lagen (TL)",False
"NÖ","Passive","NÖ 16 C § 2st, Sk. Gymnasielagen, intro.program",,"16 c § 2st tidsbegränsade lagen (TL)",False
"B","Active","Anknytning, make/maka/sambo/barn under 18 år.","Se även klassning K. För barn som fötts i Sverige, se BB och KB.

Barn som beviljas uppehållstillstånd grundat på anknytning till förälder som i sitt beslut har klassats - B5 eller B6.

När sökande är ett medsökande barn som fyllt 18 år och beviljas uppehållstillstånd. Även ankn till N5, dvs till person som fått PUT enligt 17 § TL.","5 kap. 3 § 1 st. 2 p. UtlL eller 5 kap. 3 a § 2 st. UtlL",True
"BB","Active","Barn född i kommun","Barn född i kommun, dvs av föräldrar bosatta i Sverige. Om föräldrarna var inskrivna vid Migrationsverket när barnet föddes, se KB.",,True
"BF","Active","Förälder till barn - vårdnadshavare/sammanbor","Se även klassning KF. Förälder som beviljas uppehållstillstånd grundat på anknytning till ett i Sverige bosatt barn och då föräldern även är vårdnadshavare och sammanbor med detta barn - klassas BF.","5 kap. 3 a § 1 st. 3 p. UtlL",True
"BO","Active","Ank synnerliga skäl 5 kap. 3 a § 3 st 1 och 3 UtlL","Uppehållstillstånd beviljat på synnerliga skäl enligt 5 kap 3a § 3 st.1 och 3 UtlL., vuxenadoptioner eller personer som på annat sätt har särskild anknytning till Sverige.","5 kap. 3 a § 3 st 1 och 3 UtlL",True
"BR","Active","Anknytning, förälder till barn - umgänge","Se även klassning KR. Föräldrar som beviljas uppehållstillstånd grundat på anknytning till ett i Sverige bosatt barn i syfte att utöva umgänge - klassas BR. Se även KR.","5 kap. 3 a § 1 st. 4 p. UtlL",True
"B3","Active","Anknytning, svenskt ursprung eller tidigare vistelse i Sverige.",,"5 kap. 3 a § 1 st. 5 p. UtlL",True
"B4","Active","Anknytning, annan anhörig - hushållsgemenskap","Se även klassning K4.","5 kap. 3 a § 1 st. 2 p. UtlL",True
"B5","Active","5 kap. 3 § 1 (Direktivet)","Se även klassning K och K1.","5 kap. 3 § 1 st. 1 p. UtlL",True
"B6","Active","5 kap. 3 a § 1 (Nationell)","Se även klassning K.","5 kap. 3 a § 1 st. 1 p. UtlL",True
"B7","Active","Försörjningskravet uppfyllt",,"5 kap. 3 b § UtlL",True
"B8","Active","Försörjningskravet inte uppfyllt, men har särskilda skäl",,"5 kap. 3 e § UtlL",True
"K","Active","Anknytning, make/maka/sambo/barn till A*, G*, M*, X1, X2, N3 eller N7.","Anhöriga till personer boende i Sverige, som själva erhållit tillstånd med klassning A*, G*, M*, X1, X2, N3 eller N7. För förälder samt barn till förälder som erhållit tillstånd enligt 5 kap. 3 § 1 st. 4 p. UtlL, se KK.","5 kap. 3 § 1 st. 1 p. UtlL,
5 kap. 3 § 1 st. 2 p. UtlL,
5 kap. 3 a § 1 st. 1 p. UtlL eller
5 kap. 3 a § 2 st. UtlL",True
"KB","Active","Barn född i Sverige, av förälder med A*, G*, M*, X1, X2, N3 eller N7.","Barn född i Sverige, när föräldrar var asylsökande eller med uppehållstillstånd men fortfarande inskrivna hos Migrationsverket när barnet föddes. Gäller när barnet får uppehållstillstånd samtidigt som eller efter att föräldrarna fått tillstånd med A*, G*, M*, X1, X2, N3 eller N7.",,True
"KF","Active","Förälder till barn med klassning A*, G*, M*, X1, X2, N3 eller N7 - vårdnadshavare/sammanbor","Förälder som beviljas uppehållstillstånd grundat på anknytning till ett i Sverige bosatt barn och då föräldern även är vårdnadshavare och sammanbor med detta barn - när barnet har klassning A*, G*, M*, X1, X2, N3 eller N7 - klassas KF.","5 kap. 3 a § 1 st. 3 p. UtlL",True
"KK","Active","Förälder/Syskon till barn utan vårdnadshavare med A*, G*, M*, X1, X2, N3 eller N7.","Förälder som beviljas uppehållstillstånd grundat på anknytning till ett i Sverige bosatt barn utan vårdnadshavare, samt barn (syskon) som i sin tur får tillstånd på anknytning till sådan förälder, när barnet (som varit utan vårdnadshavare) har klassning A*, G*, M*, X1 eller X2, N3 eller N7. Enda tillfället när anknytning till anknytning (syskon) får en K-klassning istället för B-klassning.","5 kap. 3 § 1 st. 4 p. UtlL samt barn till dessa.",True
"KR","Active","Anknytning, förälder till barn - umgänge till A*, G*, M*, X1, X2, N3 eller N7.","Föräldrar som beviljas uppehållstillstånd grundat på anknytning till ett i Sverige bosatt barn i syfte att utöva umgänge - när barnet har klassning A*, G*, M*, X1 eller X2, N3 eller N7 - klassas KR.","5 kap. 3 a § 1 st. 4 p. UtlL",True
"K1","Active","Anknytning, make/maka/sambo/barn där referentpersonen är klassad P*","Anhöriga till personer boende i Sverige, som själva erhållit tillstånd med klassning P1-P5. För barn till förälder som erhållit tillstånd enligt 5 kap. 3 § 1 st. 4 p. UtlL, se KK.","5 kap. 3 § 1 st. 1 p. UtlL,
5 kap. 3 a § 1 st. 1 p. UtlL,
5 kap. 3 § 1 st. 2 p. UtlL eller",True
"K4","Active","Annan anhörig (ex. hushållsgemenskap) till A*, G*, M*, P*, X1, X2, N3 eller N7.","Annan anhörig (ex hushållsgemenskap) till personer boende i Sverige som själva erhållit tillstånd med klassning A*, G*, M*, X1, X2, N3 eller N7. För barn till förälder som erhållit tillstånd enligt 5 kap. 3 § 1 st. 4 p. UtlL, se KK.","5 kap. 3 a § 1 st. 2 p. UtlL,
5 kap. 3 a § 3 st. 2 p. UtlL eller",True
"K5","Active","Make/maka/sambo/barn eller annan anhörig till nybliven svensk medborgare som vid ansökningstillfället hade klassningskod A*, G*, M*, X1, X2, N3 eller N7","Anhöriga till personer boende i Sverige, som inte var svenska medborgare vid ansökningstillfället. 2 § 2 st lag (2017:584) om ansvar för etableringsinsatser för vissa nyanlända invandrare",,True
"K7","Active","Försörjningskravet uppfyllt - där referentpersonen är klassad A*, G*, M*, P*, X1, X2, N3 eller N7.",,"5 kap. 3 b § UtlL",True
"K8","Active","Försörjningskravet ej uppfyllt, men har särskilda skäl, där referentpersonen är klassad A*, G*, M*, P*, X1, X2, N3 eller N7.",,"5 kap. 3 e § UtlL",True
"1","Passive","Anknytning",,,
"2","Passive","Ej anknytning",,,
"3","Passive","Anknytning",,,
"B2","Passive","Ankn, annan anhörig, t.ex sista länk",,,True
"B9","Passive","B9 Avslag i strid m internationell konvention","För ankn t andra än flykting/ skyddsbehövande, se även N4.","13 § tidsbegränsade lagen (TL)",True
"K2","Passive","Anknytning, annan anhörig till klass AK, A3, A5, A6, G, X1, X2",,,True
"K9","Passive","K9 ankn till bosnier, klass A*, G, X1, X2",,,True
"KV","Passive","Anhörig till person klassad TV",,,True
"TB","Passive","Anknytning till person som klassats T8",,,
"C0","Active","Arbetstagare","Arbetstagare ansökan från utlandet - nya AT-regelverket","6 kap. 2 § 1 st. UtlL",False
"C7","Active","Arbetstagare asyl","Arbetstagare ansökan från Sverige f d asylsökande med lagakraftbeslut - nya AT-regelverket","5 kap. 15 a § UtlL",False
"C8","Active","Arbetstagare visum","Arbetstagare ansökan från Sverige person med visum - nya AT-regelverket","5 kap. 18 § 3 st. och 6 kap. 2 § 1 st. UtlL",False
"C9","Active","Arbetstagare tidigare student","Arbetstagare ansökan från Sverige gäststudent - nya AT-regelverket","5 kap. 18 § 2 st. 8 p. och 6 kap. 2 § 1 st. UtlL",False
"CA","Active","Anhörig till gästforskare",,"4 kap. 7 a § 2 st. UtlF",
"CB","Active","Anhöriga till egna företagare (samt ev fler)","Tydligt lagstöd saknas men man brukar hänvisa till 5 kap 10 § UtlL.","Lagstöd saknas. Brukar dock pressas in under 5 kap. 10 § UtlL. Tveksamt om man ska göra det då det handlar om en klassningskod.",
"CC","Active","Anhörig blåkort",,"6 a kap. 10 § UtlL",
"CD","Active","UT Arbetssökande forskare",,"5 b kap. 7 § UtlL",
"CE","Active","Blåkort",,"6 a kap. 1 § UtlL",
"CF","Active","Egna företagare",,"5 kap. 5 § 2 st. UtlL",False
"CG","Active","Anhöriga till arbetstagare",,"4 kap. 4 a § UtlF",
"CH","Active","Aupair (internationellt utbyte)","Au-pair i hushåll","6 kap. 2 § 3 st. UtlL",False
"CI","Active","Idrottsutövare/tränare","Professionell idrottsutövare","6 kap. 2 § 3 st. UtlL",False
"CJ","Active","Tillfälligt arbete, entreprenad",,"Särreglering saknas men prövas enligt 6 kap. 2 § 1 st. UtlL (minus krav på utannonsering).",False
"CM","Active","UT - civilmål med anledning av arbetstvist",,"5 kap. 15 d § UtlL",
"CO","Active","Praktikanter högre utbildning",,"5 b kap. 4 § UtlL",False
"CP","Active","Praktikanter",,"6 kap. 2 § 1 st. eller 6 kap. 2 § 3 st. UtlL beroende på om det anses vara internationellt utbyte eller inte",False
"CR","Active","Gästforskare EU-direktiv",,"4 kap. 7 a § 1 st. UtlF",False
"CS","Active","Arbetstagare säsong",,"6 c kap. 1 § UtlL",False
"CU","Active","Artister (internationellt utbyte)","Artister med anställning inom underhållningsbranschen, cirkus och dylikt.","6 kap. 2 § 1 st. UtlF",False
"CW","Active","Ungdomsutbyte (internationellt utbyte)","Ungdomsutbytesavtal med annat land, exempelvis med Australien, Nya Zeeland och Canada.","6 kap. 2 § 3 st. UtlL",False
"CK","Active","Arbetstagare ICT koncern","Tillstånd för anställd i företag utanför EES-staterna och Schweiz som ska tjänstgöra mer än 90 dagar i ett företag som tillhör samma företag eller ett företag inom samma koncern","6 b kap 1§ UtlL",False
"CT","Active","Arbetstagare ICT koncern, rörligt för längre vistelse","Anställd som redan har beviljats ett ICT-tillstånd av en annan EU-stat och ska tjänstgöra i Sverige enligt ovan","6 b kap 2§ UtlL",False
"CL","Active","Anhörig till arbetstagare ICT koncern","Anhöriga till ovanstående","6 b kap. 14 § UtlL jfr med 5 kap. 3 § första stycket 1-3 UtlL",
"CY","Active","Volontär",,"5 b kap. 5 § UtlL",False
"CZ","Active","Forskare rörlighet",,"5 b kap. 2 § UtlL",False
"C","Passive","Utlänning som beviljats tillstånd av arbetsmarknadsskäl",,,
"C1","Passive","Tidsbegränsat förstagångstillstånd av arbetsmarknadsskäl",,,
"C2","Passive","Förlängning av tidsbegränsat förstagångstillstånd av arbetsmarknadsskäl",,,
"C3","Passive","C3 Arbetsmarknadsskäl/1:a tillstånd enligt generellt yttrande",,,
"C4","Passive","C4 Arbetsmarknadsskäl/1:a tillstånd efter LAN:s yttrande",,,
"C5","Passive","C5 Arbetsmarknadsskäl/Förlängning enligt generellt yttrande",,,
"C6","Passive","C6 Arbetsmarknadsskäl/Förlängning efter LAN:s yttrande",,,
"H1","Active","vbeu/Arbetstagare",,"4 kap. 9 § 1 st. 1 p. UtlF",
"H2","Active","vbeu/Egen företagare",,"4 kap. 9 § 1 st. 1 p. UtlF",
"H3","Active","vbeu/Mottagare / Tillhandahållare av tjänst",,"4 kap. 9 § 1 st. 2 p. UtlF",
"H4","Active","vbeu/Studerande",,"4 kap. 9 § 1 st. 5 p. UtlF",
"H5","Active","vbeu/Pensionär eller person med tillräckliga medel",,"4 kap. 9 § 1 st. 6 p. UtlF",
"H6","Active","vbeu/Make / maka / sambo till person med status vbeu",,"4 kap. 16 a § UtlF",
"H7","Active","vbeu/Föräldern till person med status vbeu",,"4 kap. 16 a § UtlF",
"H8","Active","Anmälan om UT, 5 kap 2c § UtlL",,,
"LS","Active","Medborgare i Schweiz",,"4 kap. 9 § 1 st. 1 p. UtlF",
"LT","Active","Tredjelandsmedborgare som är familjemedlem till schweizisk medborgare",,"4 kap. 16 § UtlF",
"Q1","Active","Make/maka/barn enligt 3 a kap 4 § UtlL",,"3 a kap 4 § UtlL",True
"Q2","Active","Föräldrar och barn över 21 år enligt 3 a kap 4 § UtlL",,"3 a kap 4 § UtlL",True
"Q3","Active","Permanent UK make/maka/barn enligt 3 a kap 7 § UtlL",,"3 a kap 7 § UtlL",True
"Q4","Active","Permanent UK föräldrar och barn över 21 år enligt 3 a kap 7 § UtlL",,"3 a kap 7 § UtlL",True
"R6","Active","Make/maka/barn (EES) enligt 3 a kap 4 § UtlL",,"3 a kap 4 § UtlL",True
"R7","Active","Föräldrar/barn över 21 år (EES) enligt 3 a kap 4 § UtlL",,"3 a kap 4 § UtlL",True
"L1","Passive","Arbetstagare (enligt EES-avtalet)",,,
"L2","Passive","Egen företagare (enligt EES-avtalet)",,,
"L3","Passive","Tillhandahållare o mottagare av tjänst enligt EES-avtalet",,,
"L4","Passive","Studerande (enligt EES-avtalet)",,,
"L5","Passive","Ej ekonomiskt aktiv t.ex. pensionär (enligt EES-avtalet)",,,
"L6","Passive","Make/maka/barn (enligt EES-avtalet)",,,
"L7","Passive","Föräldrar (enligt EES-avtalet)",,,
"L8","Passive","Andra anhöriga (enligt EES-avtalet)",,,
"L9","Passive","Förlängning av tillstånd (enligt EES-avtalet)",,,
"R1","Passive","R1 Arbetstagare (EES) enligt 3 a kap 3 § 1",,,
"R2","Passive","R2 Egna företagare (EES) enligt 3 a kap 3 § 1",,,
"R3","Passive","Tillhandahållare enl. 3 a kap. 3 §1",,,
"R4","Passive","R4 Studier (EES) enligt 3 a kap 3 § 3",,,
"R5","Passive","R5 Tillräckliga medel (EES) enligt 3 a kap 3 § 4",,,
"M1","Active","12:18 1 st 1p jmf 12:1 UtlL (dödsstraff)",,"12 kap. 18 § 1 st 1p UtlL jmf 12:1 UtlL",True
"M2","Active","12:18 1 st 1p jmf 12:2 UtlL (flyktingar)",,"12 kap. 18 § 1 st 1p UtlL jmf 12:2 UtlL",True
"M3","Active","12:18 1 st 1p jmf 12:3 UtlL (övriga skyddsbehövande)",,"12 kap. 18 § 1 st 1p UtlL jmf 12:3 UtlL",True
"M4","Active","12:18 1 st 2p (mottagarlandet tar ej emot)",,"12 kap. 18 § 1 st 2p UtlL",True
"M5","Active","12:18 1 st 3p (medicinska hinder)",,"12 kap. 18 § 1 st 3p UtlL",True
"M6","Active","12:18 1 st 3p (annan särskild anledning)",,"12 kap. 18 § 1 st 3p UtlL",True
"P1","Passive","P1 Enligt 2 kap 5b § 2p",,,
"P2","Passive","P2 Enligt 2 kap 5b § 3p",,,
"P3","Passive","P3 Enligt 2 kap 5b § 4p första strecksatsen",,,
"P4","Passive","P4 Enligt 2 kap 5b § 4p andra strecksatsen",,,
"P5","Passive","P5 Enligt 2 kap 5b §4p",,,
"U1","Passive","Enligt 2 kap 5b § 2p",,,
"U2","Passive","Enligt 2 kap 5b § 3p",,,
"U3","Passive","Enligt 2 kap 5b § 4p första strecksatsen",,,
"U4","Passive","Enligt 2 kap 5b § 4p andra strecksatsen",,,
"U5","Passive","Enligt 2 kap 5b § 4p",,,
"V1","Passive","Enligt 2 kap 5b § 2p",,,
"V2","Passive","Enligt 2 kap 5b § 3p",,,
"V3","Passive","Enligt 2 kap 5b § 4p första strecksatsen",,,
"V4","Passive","Enligt 2 kap 5b § 4p andra strecksatsen",,,
"V5","Passive","Enligt 2 kap 5b § 4p",,,
"Y1","Passive","Enligt 2 kap 5b § 2p",,,
"Y2","Passive","Enligt 2 kap 5b § 3p",,,
"Y3","Passive","Enligt 2 kap 5b § 4p första strecksatsen",,,
"Y4","Passive","Enligt 2 kap 5b § 4p andra strecksatsen",,,
"Ö1","Passive","Enligt 2 kap 5b § 2p",,,
"Ö2","Passive","Enligt 2 kap 5b § 3p",,,
"Ö3","Passive","Enligt 2 kap 5b § 4p första strecksatsen",,,
"Ö4","Passive","Enligt 2 kap 5b § 4p andra strecksatsen",,,
"Ö5","Passive","Enligt 2 kap 5b § 4p",,,
"D","Active","Gäststuderande - förstagångstillstånd",,"5 kap.10 § UtlL + 4 kap. 5 § 1 st. Utlänningsförordningen (UtlF)",False
"DA","Active","UT - arbetssökande student",,"5 kap.10 § UtlL + 4 kap. 5a § 2. UtlF",
"DB","Active","Anhöriga till gäststudenter",,"4 kap. 4 b § 2 UtlF",
"DF","Active","Doktorand",,"5 kap.10 § UtlL + 4 kap. 5 § UtlF",False
"DM","Active","Mobilitetsstudent","Används både vid första tillstånd på denna grund samt förlängning.","5 b kap.3 § UtlL",False
"DO","Active","Övriga studier",,"5 kap. 10 § UtlL",False
"DS","Active","Specialiserings- eller uppdragsutbildning",,"4 kap. 5 § UtlF",False
"O1","Active","Besök släkt, vän, partner, som turist",,"5 kap. 10 § UtlL",False
"O2","Active","Besök medicinsk behandling",,"5 kap. 10 § UtlL",False
"O3","Active","Besök studier, förlängning",,"5 kap. 10 § UtlL",False
"O4","Active","Besök mission, religiöst syfte",,"5 kap. 10 § UtlL",False
"O5","Active","Besök volontär eller praktik",,"5 kap. 10 § UtlL",False
"O6","Active","Besök affärs- eller konferens",,"5 kap. 10 § UtlL",False
"O7","Active","Besök, annat",,"5 kap. 10 § UtlL",False
"O8","Active","Besök, extraordinär händelse",,"5 kap. 10 § UtlL",False
"T1","Active","UT vid behov av tillfälligt skydd enligt 21 kap UtlL","Behov av tillfälligt skydd enligt rådets direktiv 2001/55/EG eller av regeringen meddelade föreskrifter vid massflyktssituationer","21 kap 1 - 6 §§ UtlL",True
"T2","Active","UT som tidsbegränsats m.a.a. vandelsanmärkning","Uppehållstillstånd beviljas med stöd av 5 kap 1, 2, 4, 6 §§, 12 kap 18 §, 21 kap eller 22 kap UtlL men tidsbegränsas m.a.a. vandelsanmärkning","5 kap 1, 2, 4, 6 §§, 12 kap 18 §, 21 kap eller 22 kap UtlL",True
"T4","Active","Tidsbegränsat UT, tillsvidare verkställighetshinder",,"5 kap 11§ UtlL",
"T5","Active","Tidsbegränsat UT meddelat som verkställighetsanvisning",,"5 kap 11§ UtlL",
"T6","Active","Tidsbegränsat UT bedöms kunna styrka ID efter ytterligare utredning",,"5 kap 11§ UtlL",True
"TA","Active","Anknytning till person som klassats T1",,"21 kap 4 § UtlL",True
"TF","Active","Medföljande barn till bevisperson i brottmål",,"5 kap 15 § UtlL",False
"TM","Active","Bevisperson i brottmål - människohandel",,"5 kap. 15 § UtlL",False
"TP","Active","Personalsäkerhetsarbete 5 kap. 15b § UtlL",,"5 kap. 15 b § UtlL",False
"TT","Active","Tribunalvittne - 22 kap. 2 § UtlL.",,"22 kap. 2 § Utll.",True
"TÖ","Active","Bevisperson i brottmål - övriga brott",,"5 kap 15 § UtllL",False
"E","Passive","Gäststuderande - förlängnings-UT",,,False
"T3","Passive","Tidsbegränsat UT p.g.a. humanitär/medicinsk grund",,"5 kap 9 § UtlL",True
"T9","Passive","T9 Tidsbegränsat tillstånd, förundersökning/huvudförhandling i brottmål",,,False
"TV","Passive","Behov av tillf skydd pga inre väpnad konflikt",,,
"O","Passive","O Utlänning som beviljas första tillstånd för annan temporär vistelse",,,
"OB","Passive","Besökstillstånd för anhöriga till studerande",,,False
"OS","Passive","Besökstillstånd för studier",,,False
"DX","Active","Gäststuderande - förlängning",,"5 kap.10 § UtlL + 4 kap. 5 § 2 st. UtlF",False
"SX","Active","Förlängning av tillstånd Statusärende",,"Saknas?",
"X","Active","Förlängning","Förlängning av tillståndsärenden","5 kap. 16 § UtlL (förutom 16 § 3 st 1-3p)",
"XA","Active","Andra starka skäl","Andra starka skäl - vid förlängning","5 kap. 16 § 3 st. 3 p. UtlL",
"XS","Active","Särskild anknytning till Sverige","Särskild anknytning till Sverige - vid förlängning","5 kap. 16 § 3 st. 1 p. UtlL",
"XV","Active","Våld/annan allvarlig kränkning","Våld eller annan allvarlig kränkning - vid förlängning","5 kap. 16 § 3 st. 2 p. UtlL",
"F","Active","Fosterbarn för adoption/adoptivbarn",,"5 kap. 3 § 1 st. 3 p. UtlL",True
"I","Active","Utlänning som beviljas tillstånd för bosättning av övriga skäl","Se även under klassningskoderna K4, BR och KR","5 kap. 3 a § 3 st. 1 p. UtlL eller
5 kap. 3 a § 3 st. 3 p. UtlL",True
"0","Passive","Övrigt",,,
"X3","Passive","Aldrig använd",,,
"Ö","Passive","Konverterade innan 1995-05-15",,,
"H","Passive","Konverterade innan 1995-05-15",,,
"20","Active","Diplomat, CD",,,False
"21","Active","Make/maka till diplomat, CDF",,,False
"22","Active","Familjemedlem till diplomat, CDF",,,False
"23","Active","Barn till diplomat, CDF",,,False
"30","Active","A/T-tjänsteman, A/T",,,False
"31","Active","Make/maka till A/T-tjänsteman, A/TF",,,False
"32","Active","Familjemedlem till A/T-tjänsteman, A/TF",,,False
"33","Active","Barn till A/T-tjänsteman, A/TF",,,False
"40","Active","Tjänstepersonal, TJP",,,False
"41","Active","Make/maka till tjänstepersonal, TJPF",,,False
"42","Active","Familjemedlem till tjänstepersonal, TJPF",,,False
"43","Active","Barn till tjänstepersonal, TJPF",,,False
"50","Active","Privattjänsteman anställd av diplomat eller A/T-tjänsteman, PRI",,,False
"51","Active","Privattjänsteman anställd av konsul eller konsulär tjänsteman, PRI",,,False
"60","Active","Generalkonsul, konsul, vicekonsul, CC",,,False
"61","Active","Make/maka till GK, konsul eller vicekonsul, CCF",,,False
"62","Active","Familjemedlem till generalkonsul, konsul eller vicekonsul, CCF",,,False
"63","Active","Barn till generalkonsul, konsul eller vicekonsul, CCF",,,False
"70","Active","Konsulatstjänsteman, KTJM",,,False
"71","Active","Make/maka till konsulatstjänsteman, KTJMF",,,False
"72","Active","Familjemedlem till konsulatstjänsteman, KTJMF",,,False
"73","Active","Barn till konsulatstjänsteman, KTJMF",,,False
"80","Active","Konsulatstjänstepersonal, KTJP",,,False
"81","Active","Make/maka till konsulatstjänstepersonal, KTJPF",,,False
"82","Active","Familjemedlem till konsulatstjänstepersonal, KTJPF",,,False
"83","Active","Barn till konsulatstjänstepersonal, KTJPF",,,False
"90","Active","Tjänsteman vid internationell organisation, TJM",,,False
"91","Active","Make/maka till tjänsteman vid internationell organisation, TJMF",,,False
"92","Active","Familjemedlem till tjänsteman vid internationell organisation, TJMF",,,False
"93","Active","Barn till tjänsteman vid internationell organisation, TJMF",,,False
