{
  "Errors": [
    {
      "PropertyName": "AnsvarigHandlaggareSignatur",
      "ErrorMessage": "Ansvarig handläggare anngg måste finnas registrerad på det angivna kontoret 1208."
    },
    {
      "PropertyName": "BeslutandeHandlaggareSignatur",
      "ErrorMessage": "Beslutande handläggare måste vara samma som inloggad handläggare."
    },
    {
      "PropertyName": "BeslutandeHandlaggareSignatur",
      "ErrorMessage": "Beslutande handläggare anngg måste finnas registrerad på det angivna kontoret 1208."
    },
    {
      "PropertyName": "PlaneratUppehall.Startdatum",
      "ErrorMessage": "Det planerade uppehållets startdatum måste inträffa inom beslutsperioden."
    },
    {
      "PropertyName": "PlaneratUppehall.Slutdatum",
      "ErrorMessage": "Det planerade uppehållets slutdatum måste inträffa inom beslutsperioden."
    },
    {
      "PropertyName": "Anordnare.Kundnummer",
      "ErrorMessage": "Anordnare med kundnummer: 20515541 existerar inte."
    },
    {
      "PropertyName": "Anordnare.Kundnummer",
      "ErrorMessage": "Anordnaren får ej vara en raderad anordnare."
    },
    {
      "PropertyName": "Anordnare.Kundnummer",
      "ErrorMessage": "Anordnaren saknar organisationsnummer."
    },
    {
      "PropertyName": "Anordnare.Kundnummer",
      "ErrorMessage": "Anordnaren saknar arbetsgivarklasskod."
    },
    {
      "PropertyName": "Anordnare.Kundnummer",
      "ErrorMessage": "Anordnaren saknar näringsgrenskod."
    }
  ]
}
