{
  "@context": [
    "https://linkedsoftwaredependencies.org/bundles/npm/egendata-identity-provider/^0.0.0/components/context.jsonld",
    "https://linkedsoftwaredependencies.org/bundles/npm/@solid/community-server/^6.0.0/components/context.jsonld"
  ],
  "@graph": [
    {
      "@id": "urn:solid-server:default:ResourceLockerOverride",
      "@type": "Override",
      "overrideInstance": { "@id": "urn:solid-server:default:ResourceLocker" },
      "overrideParameters": {
        "@type": "WrappedExpiringReadWriteLocker",
        "expiration": 120000
      }
    },
    {
      "@id": "urn:solid-server:default:InteractionHandlerOverride",
      "@type": "Override",
      "overrideInstance": { "@id": "urn:solid-server:default:InteractionHandler" },
      "overrideParameters": {
        "@type": "WaterfallHandler",
        "handlers": [
          {
            "comment": "Returns the relevant HTML pages for the interactions when needed",
            "@id": "urn:solid-server:auth:ssn:HtmlViewHandler"
          },
          {
            "comment": "Adds controls and API version to JSON responses.",
            "@id": "urn:solid-server:auth:visma:ControlHandler",
            "@type": "ControlHandler",
            "source" : { "@id": "urn:solid-server:auth:ssn:LocationInteractionHandler" }
          }
        ]
      }
    },
    {
      "comment": "Converts 3xx redirects to 200 JSON responses for consumption by browser scripts.",
      "@id": "urn:solid-server:auth:ssn:LocationInteractionHandler",
      "@type": "LocationInteractionHandler",
      "source" : { "@id": "urn:solid-server:auth:visma:InteractionRouteHandler" }
    },
    {
      "comment": "Handles every interaction based on their route.",
      "@id": "urn:solid-server:auth:visma:InteractionRouteHandler",
      "@type": "WaterfallHandler",
      "handlers": [
        { "@id": "urn:solid-server:auth:ssn:IndexRouteHandler" },
        { "@id": "urn:solid-server:auth:ssn:PromptRouteHandler" },
        { "@id": "urn:solid-server:auth:ssn:LoginRouteHandler" },
        { "@id": "urn:solid-server:auth:ssn:ConsentRouteHandler" },
        { "@id": "urn:solid-server:auth:password:CredentialsRouteHandler" }
      ]
    },
    {
      "comment": "Handles the login interaction",
      "@id": "urn:solid-server:auth:ssn:LoginRouteHandler",
      "@type": "InteractionRouteHandler",
      "route": {
        "@id": "urn:solid-server:auth:ssn:LoginRoute",
        "@type": "RelativePathInteractionRoute",
        "base": { "@id": "urn:solid-server:auth:ssn:IndexRoute" },
        "relativePath": "/login/"
      },
      "source": {
        "@id": "urn:solid-server:auth:visma:LoginHandler",
        "@type": "VismaLoginHandler",
        "accountStore": { "@id": "urn:solid-server:auth:ssn:AccountStore" },
        "vismaClient": {
          "@id": "urn:egendata-identity-provider:VismaClient",
          "@type": "VismaClientMock",
          "VismaClientMock:_options_apiUrl": { "@id": "urn:solid-server:default:variable:vismaApiUrl" },
          "VismaClientMock:_handler": { "@id": "urn:solid-server:default:TestLoginHandler" }
        },
        "registrationManager": {
          "@id": "urn:egendata-identity-provider:ProfileRegistrationManager",
          "@type": "ProfileRegistrationManager",
          "ProfileRegistrationManager:_args_rootWebId": { "@id": "urn:solid-server:default:variable:rootWebId" },
          "ProfileRegistrationManager:_args_baseUrl": { "@id": "urn:solid-server:default:variable:baseUrl" },
          "ProfileRegistrationManager:_args_webIdSuffix": "/profile/card#me",
          "ProfileRegistrationManager:_args_identifierGenerator": { "@id": "urn:solid-server:default:IdentifierGenerator" },
          "ProfileRegistrationManager:_args_accountStore": { "@id": "urn:solid-server:auth:ssn:AccountStore" },
          "ProfileRegistrationManager:_args_credentialStorage": { "@id": "urn:solid-server:credentials:KeyValueStorage" },
          "ProfileRegistrationManager:_args_rootPodManager": { "@id": "urn:solid-server:root:PodManager" },
          "ProfileRegistrationManager:_args_servicePodManager": { "@id": "urn:solid-server:service:PodManager" },
          "ProfileRegistrationManager:_args_personPodManager": { "@id": "urn:solid-server:person:PodManager" },
          "ProfileRegistrationManager:_args_podStorageBaseUrl": { "@id": "urn:solid-server:default:variable:podStorageBaseUrl" },
          "ProfileRegistrationManager:_args_clientId": { "@id": "urn:solid-server:default:variable:clientId" },
          "ProfileRegistrationManager:_args_clientSecret": { "@id": "urn:solid-server:default:variable:clientSecret" },
          "ProfileRegistrationManager:_args_jwkGenerator": { "@id": "urn:solid-server:default:JwkGenerator" },
          "ProfileRegistrationManager:_args_authFetchFactory": { "@id": "urn:solid-server:default:AuthFetchFactory" }
        }
      }
    },
    {
      "comment": "Handles the interaction that occurs when a logged in user wants to authenticate with a new app.",
      "@id": "urn:solid-server:auth:ssn:ConsentRouteHandler",
      "@type":"InteractionRouteHandler",
      "route": {
        "@id": "urn:solid-server:auth:ssn:ConsentRoute",
        "@type": "RelativePathInteractionRoute",
        "base": { "@id": "urn:solid-server:auth:ssn:IndexRoute" },
        "relativePath": "/consent/"
      },
      "source": {
        "@id": "urn:solid-server:auth:ssn:ConsentHandler",
        "@type": "GrantConsentHandler",
        "providerFactory": { "@id": "urn:solid-server:default:IdentityProviderFactory" }
      }
    },
    {
      "@id": "urn:solid-server:default:AuthFetchFactory",
      "@type": "OidcAuthFetchFactory",
      "baseUrl": { "@id": "urn:solid-server:default:variable:baseUrl" }
    },
    {
      "@id": "urn:solid-server:root:PodManager",
      "@type": "RemovableGeneratedPodManager",
      "store": { "@id": "urn:solid-server:default:ResourceStore" },
      "resourcesGenerator": { "@id": "urn:solid-server:root:ResourcesGenerator" }
    },
    {
      "@id": "urn:solid-server:service:PodManager",
      "@type": "RemovableGeneratedPodManager",
      "store": { "@id": "urn:solid-server:default:ResourceStore" },
      "resourcesGenerator": { "@id": "urn:solid-server:service:ResourcesGenerator" }
    },
    {
      "@id": "urn:solid-server:person:PodManager",
      "@type": "RemovableGeneratedPodManager",
      "store": { "@id": "urn:solid-server:default:ResourceStore" },
      "resourcesGenerator": { "@id": "urn:solid-server:person:ResourcesGenerator" }
    },
    {
      "comment": "The storage adapter that persists ssn, WebId, etc.",
      "@id": "urn:solid-server:auth:ssn:AccountStore",
      "@type": "SsnAccountStore",
      "storage": {
        "@type": "EncodingPathStorage",
        "relativePath": "/accounts/",
        "source": { "@id": "urn:solid-server:account:KeyValueStorage" }
      }
    },
    {
      "comment": "Root API entry. Returns an empty body so we can add controls pointing to other interaction routes.",
      "@id": "urn:solid-server:auth:ssn:IndexRouteHandler",
      "@type": "InteractionRouteHandler",
      "route": {
        "@id": "urn:solid-server:auth:ssn:IndexRoute",
        "@type": "RelativePathInteractionRoute",
        "base": { "@id": "urn:solid-server:default:variable:baseUrl" },
        "relativePath": "/idp/"
      },
      "source": {
        "@id": "urn:solid-server:auth:ssn:IndexHandler",
        "@type": "FixedInteractionHandler",
        "response": {}
      }
    },
    {
      "@id": "urn:solid-server:auth:ssn:HtmlViewHandler",
      "@type": "HtmlViewHandler",
      "index": { "@id": "urn:solid-server:auth:ssn:IndexRoute" },
      "templateEngine": {
        "comment": "Renders the specific page and embeds it into the main HTML body.",
        "@type": "ChainedTemplateEngine",
        "renderedName": "htmlBody",
        "engines": [
          {
            "comment": "Will be called with specific templates to generate HTML snippets.",
            "@id": "urn:solid-server:default:TemplateEngine"
          },
          {
            "comment": "Will embed the result of the first engine into the main HTML template.",
            "@type": "StaticTemplateEngine",
            "templateEngine": { "@id": "urn:solid-server:default:TemplateEngine" },
            "template": "templates/main.html.ejs"
          }
        ]
      },
      "templates": [
        {
          "HtmlViewHandler:_templates_key": "templates/identity/visma/login.html.ejs",
          "HtmlViewHandler:_templates_value": { "@id": "urn:solid-server:auth:ssn:LoginRoute" }
        },
        {
          "HtmlViewHandler:_templates_key": "templates/identity/visma/consent.html.ejs",
          "HtmlViewHandler:_templates_value": { "@id": "urn:solid-server:auth:ssn:ConsentRoute" }
        }
      ]
    },
    {
      "@id": "urn:solid-server:default:RootInitializerOverride",
      "@type": "Override",
      "overrideInstance": { "@id": "urn:solid-server:default:RootInitializer" },
      "overrideParameters": {
        "@type": "ConditionalHandler",
        "source": {
          "@type": "RootContainerInitializer",
          "args_baseUrl": { "@id": "urn:solid-server:default:variable:baseUrl" },
          "args_path": "/",
          "args_store": { "@id": "urn:solid-server:default:ResourceStore" },
          "args_generator": {
            "@type": "StaticFolderGenerator",
            "templateFolder": "templates/root",
            "resourcesGenerator": { "@id": "urn:solid-server:default:TemplatedResourcesGenerator" }
          },
          "args_storageKey": "rootInitialized",
          "args_storage": { "@id": "urn:solid-server:default:SetupStorage" },
          "args_rootWebId": { "@id": "urn:solid-server:default:variable:rootWebId" },
          "args_registrationManager": { "@id":  "urn:egendata-identity-provider:ProfileRegistrationManager" }
        }
      }
    },
    {
      "comment": "Generates resources for the root pod",
      "@id": "urn:solid-server:root:ResourcesGenerator",
      "@type": "StaticFolderGenerator",
      "templateFolder": "templates/root-pod",
      "resourcesGenerator": { "@id": "urn:solid-server:default:TemplatedResourcesGenerator" }
    },
    {
      "comment": "Generates resources for the service pods",
      "@id": "urn:solid-server:service:ResourcesGenerator",
      "@type": "StaticFolderGenerator",
      "templateFolder": "templates/service-pod",
      "resourcesGenerator": { "@id": "urn:solid-server:default:TemplatedResourcesGenerator" }
    },
    {
      "comment": "Generates resources for the person pods",
      "@id": "urn:solid-server:person:ResourcesGenerator",
      "@type": "StaticFolderGenerator",
      "templateFolder": "templates/person-pod",
      "resourcesGenerator": { "@id": "urn:solid-server:default:TemplatedResourcesGenerator" }
    },
    {
      "@id": "urn:solid-server:default:ResourcesGeneratorOverride",
      "@type": "Override",
      "overrideInstance": { "@id": "urn:solid-server:default:PodResourcesGenerator" },
      "overrideParameters": {
        "@type": "StaticFolderGenerator",
        "templateFolder": "templates/pod"
      }
    },
    {
      "@id": "urn:solid-server-app-setup:default:ShorthandResolver",
      "@type": "CombinedShorthandResolver",
      "resolvers": [
        {
          "CombinedShorthandResolver:_resolvers_key": "urn:solid-server:default:variable:podStorageBaseUrl",
          "CombinedShorthandResolver:_resolvers_value": {
            "@type": "KeyExtractor",
            "key": "podStorageBaseUrl"
          }
        },
        {
          "CombinedShorthandResolver:_resolvers_key": "urn:solid-server:default:variable:clientId",
          "CombinedShorthandResolver:_resolvers_value": {
            "@type": "KeyExtractor",
            "key": "clientId"
          }
        },
        {
          "CombinedShorthandResolver:_resolvers_key": "urn:solid-server:default:variable:clientSecret",
          "CombinedShorthandResolver:_resolvers_value": {
            "@type": "KeyExtractor",
            "key": "clientSecret"
          }
        },
        {
          "CombinedShorthandResolver:_resolvers_key": "urn:solid-server:default:variable:rootWebId",
          "CombinedShorthandResolver:_resolvers_value": {
            "@type": "KeyExtractor",
            "key": "rootWebId"
          }
        },
        {
          "CombinedShorthandResolver:_resolvers_key": "urn:solid-server:default:variable:adminAccessKey",
          "CombinedShorthandResolver:_resolvers_value": {
            "@type": "KeyExtractor",
            "key": "adminAccessKey"
          }
        },
        {
          "CombinedShorthandResolver:_resolvers_key": "urn:solid-server:default:variable:vismaApiUrl",
          "CombinedShorthandResolver:_resolvers_value": {
            "@type": "KeyExtractor",
            "key": "vismaApiUrl"
          }
        },
        {
          "CombinedShorthandResolver:_resolvers_key": "urn:solid-server:default:variable:vismaCustomerKey",
          "CombinedShorthandResolver:_resolvers_value": {
            "@type": "KeyExtractor",
            "key": "vismaCustomerKey"
          }
        },
        {
          "CombinedShorthandResolver:_resolvers_key": "urn:solid-server:default:variable:vismaServiceKey",
          "CombinedShorthandResolver:_resolvers_value": {
            "@type": "KeyExtractor",
            "key": "vismaServiceKey"
          }
        },
        {
          "CombinedShorthandResolver:_resolvers_key": "urn:solid-server:default:variable:vismaProxyUrl",
          "CombinedShorthandResolver:_resolvers_value": {
            "@type": "KeyExtractor",
            "key": "vismaProxyUrl",
            "defaultValue": ""
          }
        }
      ]
    },
    {
      "@id": "urn:solid-server-app-setup:default:CliExtractor",
      "@type": "YargsCliExtractor",
      "parameters": [
        {
          "@type": "YargsParameter",
          "name": "podStorageBaseUrl",
          "options": {
            "requiresArg": true,
            "type": "string",
            "describe": "Other pod storage server base url denoting where user storage pods are created/located during WebID minting."
          }
        },
        {
          "@type": "YargsParameter",
          "name": "clientId",
          "options": {
            "requiresArg": true,
            "type": "string",
            "describe": "Client id for this service."
          }
        },
        {
          "@type": "YargsParameter",
          "name": "clientSecret",
          "options": {
            "requiresArg": true,
            "type": "string",
            "describe": "Client secret for this service."
          }
        },
        {
          "@type": "YargsParameter",
          "name": "rootWebId",
          "options": {
            "alias": "r",
            "requiresArg": true,
            "type": "string",
            "describe": "Root owner webId"
          }
        },
        {
          "@type": "YargsParameter",
          "name": "adminAccessKey",
          "options": {
            "alias": "a",
            "requiresArg": true,
            "type": "string",
            "describe": "Admin API access key"
          }
        },
        {
          "@type": "YargsParameter",
          "name": "vismaApiUrl",
          "options": {
            "requiresArg": true,
            "type": "string",
            "describe": "Visma API URL"
          }
        },
        {
          "@type": "YargsParameter",
          "name": "vismaCustomerKey",
          "options": {
            "requiresArg": true,
            "type": "string",
            "describe": "Visma customer key"
          }
        },
        {
          "@type": "YargsParameter",
          "name": "vismaServiceKey",
          "options": {
            "requiresArg": true,
            "type": "string",
            "describe": "Visma service key"
          }
        }
      ]
    },
    {
      "comment": "Other pod storage server base url denoting where user storage pods are created/located during WebID minting",
      "@id": "urn:solid-server:default:variable:podStorageBaseUrl",
      "@type": "Variable"
    },
    {
      "comment": "Client id for this service.",
      "@id": "urn:solid-server:default:variable:clientId",
      "@type": "Variable"
    },
    {
      "comment": "Client secret for this service.",
      "@id": "urn:solid-server:default:variable:clientSecret",
      "@type": "Variable"
    },
    {
      "comment": "Root owner webId",
      "@id": "urn:solid-server:default:variable:rootWebId",
      "@type": "Variable"
    },
    {
      "comment": "Admin API access key",
      "@id": "urn:solid-server:default:variable:adminAccessKey",
      "@type": "Variable"
    },
    {
      "comment": "Visma API URL",
      "@id": "urn:solid-server:default:variable:vismaApiUrl",
      "@type": "Variable"
    },
    {
      "comment": "Handles OIDC redirects containing a prompt, such as login or consent.",
      "@id": "urn:solid-server:auth:ssn:PromptRouteHandler",
      "@type": "InteractionRouteHandler",
      "route": {
        "@id": "urn:solid-server:auth:ssn:PromptRoute",
        "@type": "RelativePathInteractionRoute",
        "base": { "@id": "urn:solid-server:auth:ssn:IndexRoute" },
        "relativePath": "/prompt/"
      },
      "source": {
        "@type": "PromptHandler",
        "@id": "urn:solid-server:auth:ssn:PromptHandler",
        "promptRoutes": [
          {
            "PromptHandler:_promptRoutes_key": "login",
            "PromptHandler:_promptRoutes_value": { "@id": "urn:solid-server:auth:ssn:LoginRoute" }
          },
          {
            "PromptHandler:_promptRoutes_key": "consent",
            "PromptHandler:_promptRoutes_value": { "@id": "urn:solid-server:auth:ssn:ConsentRoute" }
          }
        ]
      }
    },
    {
      "@id": "urn:solid-server:default:OidcHandlerOverride",
      "@type": "Override",
      "overrideInstance": { "@id": "urn:solid-server:default:OidcHandler" },
      "overrideParameters": {
        "@type": "RouterHandler",
        "args_handler": {
          "@type": "OidcHttpHandler",
          "providerFactory": { "@id": "urn:solid-server:extended:IdentityProviderFactory" }
        }
      }
    },
    {
      "@id": "urn:solid-server:auth:password:ConsentHandlerOverride",
      "@type": "Override",
      "overrideInstance": { "@id": "urn:solid-server:auth:password:ConsentHandler" },
      "overrideParameters": {
        "@type": "ConsentHandler",
        "providerFactory": { "@id": "urn:solid-server:extended:IdentityProviderFactory" }
      }
    },
    {
      "@id": "urn:solid-server:default:IdentityProviderHttpHandlerOverride",
      "@type": "Override",
      "overrideInstance": { "@id": "urn:solid-server:default:IdentityProviderHttpHandler" },
      "overrideParameters": {
        "@type": "IdentityProviderHttpHandler",
        "args_providerFactory": { "@id": "urn:solid-server:extended:IdentityProviderFactory" }
      }
    },
    {
      "@id": "urn:solid-server:extended:IdentityProviderFactory",
      "@type": "ExtendedIdentityProviderFactory",
      "args_adapterFactory": { "@id": "urn:solid-server:default:IdpAdapterFactory" },
      "args_baseUrl": { "@id": "urn:solid-server:default:variable:baseUrl" },
      "args_oidcPath": "/.oidc",
      "args_interactionHandler": { "@id": "urn:solid-server:auth:ssn:PromptHandler" },
      "args_credentialStorage": { "@id": "urn:solid-server:credentials:KeyValueStorage" },
      "args_storage": {
        "@type": "EncodingPathStorage",
        "relativePath": "/idp/keys/",
        "source": { "@id": "urn:solid-server:default:KeyValueStorage" }
      },
      "args_showStackTrace": { "@id": "urn:solid-server:default:variable:showStackTrace" },
      "args_errorHandler": { "@id": "urn:solid-server:default:ErrorHandler" },
      "args_responseWriter": { "@id": "urn:solid-server:default:ResponseWriter" },
      "args_jwkGenerator": { "@id": "urn:solid-server:default:JwkGenerator" },
      "config": {
        "claims": {
          "openid": [ "azp" ],
          "webid": [ "webid" ]
        },
        "cookies": {
          "long": { "signed": true, "maxAge": 86400000 },
          "short": { "signed": true }
        },
        "features": {
          "claimsParameter": { "enabled": true },
          "clientCredentials": { "enabled": true },
          "devInteractions": { "enabled": false },
          "dPoP": { "enabled": true, "ack": "draft-03" },
          "introspection": { "enabled": true },
          "registration": { "enabled": true },
          "revocation": { "enabled": true },
          "userinfo": { "enabled": false }
        },
        "scopes": [ "openid", "profile", "offline_access", "webid" ],
        "subjectTypes": [ "public" ],
        "ttl": {
          "AccessToken": 3600,
          "AuthorizationCode": 600,
          "BackchannelAuthenticationRequest": 600,
          "ClientCredentials": 600,
          "DeviceCode": 600,
          "Grant": 1209600,
          "IdToken": 3600,
          "Interaction": 3600,
          "RefreshToken": 86400,
          "Session": 1209600
        },
        "clockTolerance": 5
      }
    },
    {
      "@id": "urn:solid-server:default:IdpAdapterFactoryOverride",
      "@type": "Override",
      "overrideInstance": { "@id": "urn:solid-server:default:IdpAdapterFactory" },
      "overrideParameters": {
        "@type": "ClientCredentialsAdapterFactory",
        "storage": { "@id": "urn:solid-server:credentials:KeyValueStorage" }
      }
    },
    {
      "comment": "Routes logout requests",
      "@id": "urn:solid-server:default:LogoutHandler",
      "@type": "RouterHandler",
      "args_baseUrl": { "@id": "urn:solid-server:default:variable:baseUrl" },
      "args_targetExtractor": { "@id": "urn:solid-server:default:TargetExtractor" },
      "args_allowedMethods": [ "POST" ],
      "args_allowedPathNames": [ "^/logout" ],
      "args_handler": {
        "@type": "VismaLogoutHandler",
        "vismaClient": { "@id": "urn:egendata-identity-provider:VismaClient" }
      }
    },
    {
      "@id": "urn:solid-server:default:HttpHandlerOverride",
      "@type": "Override",
      "overrideInstance": { "@id": "urn:solid-server:default:HttpHandler" },
      "overrideParameters": {
        "@type": "SequenceHandler",
        "handlers": [
          { "@id": "urn:solid-server:default:Middleware" },
          {
            "@type": "WaterfallHandler",
            "handlers": [
              { "@id": "urn:solid-server:default:LoginMockHandler" },
              { "@id": "urn:solid-server:default:StaticAssetHandler" },
              { "@id": "urn:solid-server:default:SetupHandler" },
              { "@id": "urn:solid-server:default:OidcHandler" },
              { "@id": "urn:solid-server:default:NotificationHttpHandler" },
              { "@id": "urn:solid-server:default:StorageDescriptionHandler" },
              { "@id": "urn:solid-server:default:AdminHandler" },
              { "@id": "urn:solid-server:default:LogoutHandler" },
              { "@id": "urn:solid-server:default:AuthResourceHttpHandler" },
              { "@id": "urn:solid-server:default:IdentityProviderHandler" },
              { "@id": "urn:solid-server:default:LdpHandler" }
            ]
          }
        ]
      }
    },
    {
      "@id": "urn:solid-server:default:StaticAssetHandlerOverride",
      "@type": "Override",
      "overrideInstance": { "@id": "urn:solid-server:default:StaticAssetHandler" },
      "overrideParameters": {
        "@type": "StaticAssetHandler",
        "assets": [
          {
            "StaticAssetHandler:_assets_key": "/favicon.ico",
            "StaticAssetHandler:_assets_value": "@css:templates/images/favicon.ico"
          },
          {
            "StaticAssetHandler:_assets_key": "/.well-known/css/styles/",
            "StaticAssetHandler:_assets_value": "templates/styles/"
          },
          {
            "StaticAssetHandler:_assets_key": "/.well-known/css/fonts/",
            "StaticAssetHandler:_assets_value": "@css:templates/fonts/"
          },
          {
            "StaticAssetHandler:_assets_key": "/.well-known/css/images/",
            "StaticAssetHandler:_assets_value": "templates/images/"
          },
          {
            "StaticAssetHandler:_assets_key": "/.well-known/css/scripts/",
            "StaticAssetHandler:_assets_value": "@css:templates/scripts/"
          }
        ]
      }
    },
    {
      "@id": "urn:solid-server:default:MarkdownToHtmlConverterOverride",
      "@type": "Override",
      "overrideInstance": { "@id": "urn:solid-server:default:MarkdownToHtmlConverter" },
      "overrideParameters": {
        "@type": "MarkdownToHtmlConverter",
        "templateEngine": {
          "@type": "StaticTemplateEngine",
          "templateEngine": { "@id": "urn:solid-server:default:TemplateEngine" },
          "template": "templates/main.html.ejs"
        }
      }
    },
    {
      "comment": "Handles the admin endpoint.",
      "@id": "urn:solid-server:default:AdminEndpointHttpHandler",
      "@type": "RouterHandler",
      "args_baseUrl": { "@id": "urn:solid-server:default:variable:baseUrl" },
      "args_targetExtractor": { "@id": "urn:solid-server:default:TargetExtractor" },
      "args_allowedMethods": [ "post" ],
      "args_allowedPathNames": [ "^/serviceUser" ],
      "args_handler": { "@id": "urn:solid-server:default:AdminParsingHandler" }
    },
    {
      "comment": "Handles admin input parsing.",
      "@id": "urn:solid-server:default:AdminParsingHandler",
      "@type": "ParsingHttpHandler",
      "args_requestParser": { "@id": "urn:solid-server:default:RequestParser" },
      "args_errorHandler": { "@id": "urn:solid-server:default:ErrorHandler" },
      "args_responseWriter": { "@id": "urn:solid-server:default:ResponseWriter" },
      "args_operationHandler": { "@id": "urn:solid-server:default:AdminHttpHandler" }
    },
    {
      "comment": "Routes all admin related requests to the AdminHttpHandler.",
      "@id": "urn:solid-server:default:AdminHandler",
      "@type": "RouterHandler",
      "args_baseUrl": { "@id": "urn:solid-server:default:variable:baseUrl" },
      "args_targetExtractor": { "@id": "urn:solid-server:default:TargetExtractor" },
      "args_allowedMethods": [ "*" ],
      "args_allowedPathNames": [ "^/.admin/*" ],
      "args_handler": { "@id": "urn:solid-server:default:AdminHttpHandler" }
    },
    {
      "comment": "Handles the admin API behaviour.",
      "@id": "urn:solid-server:default:AdminHttpHandler",
      "@type": "AdminHttpHandler",
      "accessKey": { "@id": "urn:solid-server:default:variable:adminAccessKey" },
      "accountStore": { "@id": "urn:solid-server:auth:ssn:AccountStore" },
      "credentialStorage": { "@id": "urn:solid-server:credentials:KeyValueStorage" },
      "registrationManager": { "@id": "urn:egendata-identity-provider:ProfileRegistrationManager" },
      "rootWebId": { "@id": "urn:solid-server:default:variable:rootWebId" }
    },
    {
      "comment": "Routes all visma MOCK related requests to the TestLoginHandler.",
      "@id": "urn:solid-server:default:LoginMockHandler",
      "@type": "RouterHandler",
      "args_baseUrl": { "@id": "urn:solid-server:default:variable:baseUrl" },
      "args_targetExtractor": { "@id": "urn:solid-server:default:TargetExtractor" },
      "args_allowedMethods": [ "*" ],
      "args_allowedPathNames": [ "^/.login/*" ],
      "args_handler": { "@id": "urn:solid-server:default:TestLoginHandler" }
    },
    {
      "comment": "Handles the TestLoginHandler behaviour.",
      "@id": "urn:solid-server:default:TestLoginHandler",
      "@type": "TestLoginHandler",
      "responseWriter": {"@id": "urn:solid-server:default:ResponseWriter"}
    }
  ]
}