{
  "@context": [
    "https://linkedsoftwaredependencies.org/bundles/npm/egendata-identity-provider/^0.0.0/components/context.jsonld",
    "https://linkedsoftwaredependencies.org/bundles/npm/@solid/community-server/^6.0.0/components/context.jsonld"
  ],
  "import": [
    "css:config/app/main/default.json",
    "css:config/app/init/initialize-root.json",
    "css:config/app/setup/disabled.json",
    "css:config/app/variables/default.json",
    "css:config/http/handler/notification.json",
    "css:config/http/middleware/websockets.json",
    "css:config/http/server-factory/websockets.json",
    "css:config/http/static/default.json",
    "css:config/identity/access/public.json",
    "css:config/identity/email/default.json",
    "css:config/identity/handler/default.json",
    "css:config/identity/ownership/token.json",
    "css:config/identity/pod/static.json",
    "css:config/identity/registration/enabled.json",
    "css:config/ldp/authentication/dpop-bearer.json",
    "css:config/ldp/authorization/webacl.json",
    "css:config/ldp/handler/default.json",
    "css:config/ldp/metadata-parser/default.json",
    "css:config/ldp/metadata-writer/default.json",
    "css:config/ldp/modes/default.json",
    "css:config/notification/default.json",
    "css:config/storage/backend/memory.json",
    "css:config/storage/key-value/resource-store.json",
    "css:config/storage/middleware/default.json",
    "css:config/util/auxiliary/acl.json",
    "css:config/util/identifiers/suffix.json",
    "css:config/util/index/default.json",
    "css:config/util/logging/winston.json",
    "css:config/util/representation-conversion/default.json",
    "css:config/util/resource-locker/memory.json",
    "css:config/util/variables/default.json",
    "overrides.json"
  ],
  "@graph": [
    {
      "comment": "Egendata Identity Provider configuration"
    },
    {
      "comment": "Stores all client credential tokens.",
      "@id": "urn:solid-server:credentials:KeyValueStorage",
      "@type": "EncodingPathStorage",
      "relativePath": "/credentials/",
      "source": { "@id": "urn:solid-server:default:KeyValueStorage" }
    },
    {
      "comment": "Storage used for account management.",
      "@id": "urn:solid-server:account:KeyValueStorage",
      "@type": "EncodingPathStorage",
      "relativePath": "/accounts/",
      "source": { "@id": "urn:solid-server:default:KeyValueStorage" }
    }
  ]
}
