{
    "profiles": [
        {
            "languageCode": "sv-SE",
            "employment": [
                {
                    "positionHistories": [
                        {
                            "title": "Privatrådgivare Lokalbanken",
                            "descriptions": [
                                "Lokal bank med huvudkontor i Staden och ett mindre i Grannbyn.",
                                "Rådgivning inom privatekonomi för bankens kunder",
                                "Ansvarade för kundevent och -aktiviteter",
                                "Under min tid på företaget har privatrådgivarna fått bättre omdömen i våra kundundersökningar.",
                                "Jag jobbade även med interna personalaktiviteter, efter eget initiativ."
                            ]
                        }
                    ]
                },
                {
                    "positionHistories": [
                        {
                            "title": "Administrativ tjänst",
                            "descriptions": [
                                "Diverse administrativa uppgifter",
                                "Lönehantering",
                                "Fakturering och löpande bokföring",
                                "För de ekonomiska uppgifterna rapporterade jag till en ekonomikonsult som var på plats en halvdag per vecka."
                            ]
                        }
                    ]
                },
                {
                    "positionHistories": [
                        {
                            "title": "Patrikplats",
                            "descriptions": [
                                "Diverse administrativa uppgifter, inklusive lönehantering, fakturering och löpande bokföring",
                                "Lokalsmeden är en liten firma som jobbar med smide. För de ekonomiska uppgifterna rapporterade jag till en ekonomikonsult som var på plats en halvdag per vecka."
                            ]
                        }
                    ]
                }
            ]
        }
    ]
}
