{
    "access": "NoneType",
    "access_to_own_car": "bool",
    "application_deadline": "str",
    "application_details": {
        "email": "NoneType",
        "information": "NoneType",
        "other": "NoneType",
        "reference": "NoneType",
        "url": "str",
        "via_af": "bool"
    },
    "description": {
        "company_information": "NoneType",
        "conditions": "NoneType",
        "needs": "NoneType",
        "requirements": "NoneType",
        "text": "str",
        "text_formatted": "NoneType"
    },
    "driving_license": "NoneType",
    "driving_license_required": "bool",
    "duration": {
        "concept_id": "str",
        "label": "str",
        "legacy_ams_taxonomy_id": "str"
    },
    "employer": {
        "email": "NoneType",
        "name": "str",
        "organization_number": "NoneType",
        "phone_number": "NoneType",
        "url": "NoneType",
        "workplace": "str"
    },
    "employment_type": {
        "concept_id": "str",
        "label": "str",
        "legacy_ams_taxonomy_id": "str"
    },
    "experience_required": "bool",
    "external_id": "NoneType",
    "headline": "str",
    "id": "str",
    "last_publication_date": "str",
    "logo_url": "NoneType",
    "must_have": {
        "languages": "list",
        "skills": "list",
        "work_experiences": "list"
    },
    "nice_to_have": {
        "languages": "list",
        "skills": "list",
        "work_experiences": "list"
    },
    "number_of_vacancies": "int",
    "occupation": {
        "concept_id": "str",
        "label": "str",
        "legacy_ams_taxonomy_id": "str"
    },
    "occupation_field": {
        "concept_id": "str",
        "label": "str",
        "legacy_ams_taxonomy_id": "str"
    },
    "occupation_group": {
        "concept_id": "str",
        "label": "str",
        "legacy_ams_taxonomy_id": "str"
    },
    "publication_date": "str",
    "removed": "bool",
    "removed_date": "NoneType",
    "salary_description": "NoneType",
    "salary_type": {
        "concept_id": "str",
        "label": "str",
        "legacy_ams_taxonomy_id": "str"
    },
    "scope_of_work": {
        "max": "int",
        "min": "int"
    },
    "source_type": "str",
    "timestamp": "int",
    "webpage_url": "str",
    "working_hours_type": {
        "concept_id": "str",
        "label": "str",
        "legacy_ams_taxonomy_id": "str"
    },
    "workplace_address": {
        "city": "str",
        "coordinates": [
            "float"
        ],
        "country": "str",
        "country_code": "str",
        "country_concept_id": "str",
        "municipality": "str",
        "municipality_code": "str",
        "municipality_concept_id": "str",
        "postcode": "str",
        "region": "str",
        "region_code": "str",
        "region_concept_id": "str",
        "street_address": "NoneType"
    }
}