[
  {
    "sun_code": "400212x",
    "occupations": [
      {
        "concept_id": "euJP_wxo_skF",
        "name": "Dansare"
      }
    ]
  },
  {
    "sun_code": "400215z",
    "occupations": []
  },
  {
    "sun_code": "405840d",
    "occupations": []
  },
  {
    "sun_code": "400999z",
    "occupations": []
  },
  {
    "sun_code": "405523x",
    "occupations": []
  },
  {
    "sun_code": "410215z",
    "occupations": []
  },
  {
    "sun_code": "405344z",
    "occupations": [
      {
        "concept_id": "8N18_sGB_X4M",
        "name": "Redovisningsekonom"
      },
      {
        "concept_id": "CeoS_Wzo_uz5",
        "name": "Redovisningskonsult"
      }
    ]
  },
  {
    "sun_code": "525861a",
    "occupations": [
      {
        "concept_id": "bpCT_mnW_CKr",
        "name": "Inspektör, Polisen"
      },
      {
        "concept_id": "GqEz_Pan_2nm",
        "name": "Kommissarie, Polisen"
      },
      {
        "concept_id": "W2dh_NJx_QLB",
        "name": "Polisaspirant"
      },
      {
        "concept_id": "nPhL_nKW_sqs",
        "name": "Polisintendent"
      },
      {
        "concept_id": "5cVu_BVm_nNG",
        "name": "Polismästare"
      }
    ]
  },
  {
    "sun_code": "405481x",
    "occupations": [
      {
        "concept_id": "CZkP_hCz_KM8",
        "name": "Applikationsutvecklare"
      },
      {
        "concept_id": "7wdX_4rv_33z",
        "name": "Backend-utvecklare"
      },
      {
        "concept_id": "rz2m_96d_vyF",
        "name": "Databasutvecklare"
      },
      {
        "concept_id": "GDHs_eoz_uKx",
        "name": "Frontend-utvecklare"
      },
      {
        "concept_id": "71Ji_irM_rSJ",
        "name": "Fullstack-utvecklare"
      },
      {
        "concept_id": "rQds_YGd_quU",
        "name": "Mjukvaruutvecklare"
      },
      {
        "concept_id": "n2kJ_qFK_x2K",
        "name": "Mobilutvecklare/Apputvecklare"
      },
      {
        "concept_id": "fg7B_yov_smw",
        "name": "Systemutvecklare/Programmerare"
      },
      {
        "concept_id": "TU7g_mwa_VzB",
        "name": "Testutvecklare"
      }
    ]
  },
  {
    "sun_code": "520212b",
    "occupations": [
      {
        "concept_id": "euJP_wxo_skF",
        "name": "Dansare"
      },
      {
        "concept_id": "p2tN_r4a_VPK",
        "name": "Koreograf"
      }
    ]
  },
  {
    "sun_code": "410211a",
    "occupations": [
      {
        "concept_id": "xaLh_X2Y_aAn",
        "name": "Konstnär"
      }
    ]
  },
  {
    "sun_code": "405723p",
    "occupations": []
  },
  {
    "sun_code": "405815b",
    "occupations": [
      {
        "concept_id": "mC28_vEv_AVx",
        "name": "Massör/Massageterapeut"
      }
    ]
  },
  {
    "sun_code": "535211a",
    "occupations": [
      {
        "concept_id": "xaLh_X2Y_aAn",
        "name": "Konstnär"
      }
    ]
  },
  {
    "sun_code": "415840d",
    "occupations": [
      {
        "concept_id": "eSXv_uCd_b9M",
        "name": "Pilot/Trafikflygare/Flygkapten"
      },
      {
        "concept_id": "F7jC_B6h_vDg",
        "name": "Pilot/Trafikflygare/Flygstyrman"
      }
    ]
  },
  {
    "sun_code": "525840d",
    "occupations": [
      {
        "concept_id": "eSXv_uCd_b9M",
        "name": "Pilot/Trafikflygare/Flygkapten"
      },
      {
        "concept_id": "F7jC_B6h_vDg",
        "name": "Pilot/Trafikflygare/Flygstyrman"
      }
    ]
  },
  {
    "sun_code": "410542c",
    "occupations": [
      {
        "concept_id": "ras1_rJP_9UX",
        "name": "Skräddare"
      },
      {
        "concept_id": "W6ke_dme_Lf2",
        "name": "Damskräddare"
      },
      {
        "concept_id": "h1MS_NFS_NUn",
        "name": "Herrskräddare"
      },
      {
        "concept_id": "9X5m_3HX_xv5",
        "name": "Ändringsskräddare"
      }
    ]
  },
  {
    "sun_code": "525582d",
    "occupations": [
      {
        "concept_id": "cyCt_LLE_qDy",
        "name": "Inredningssnickare/Specialsnickare"
      },
      {
        "concept_id": "4Z7F_oBG_vMG",
        "name": "Träarbetare/Snickare"
      }
    ]
  },
  {
    "sun_code": "525522d",
    "occupations": [
      {
        "concept_id": "Avnw_RQP_2qy",
        "name": "Elektrotekniker"
      }
    ]
  },
  {
    "sun_code": "405522c",
    "occupations": [
    ]
  },
  {
    "sun_code": "405582c",
    "occupations": []
  },
  {
    "sun_code": "405723t",
    "occupations": []
  },
  {
    "sun_code": "405622c",
    "occupations": []
  },
  {
    "sun_code": "405723u",
    "occupations": []
  },
  {
    "sun_code": "415541e",
    "occupations": [
      {
        "concept_id": "XugJ_6hw_wVV",
        "name": "Bagare/Konditor"
      }
    ]
  },
  {
    "sun_code": "415815a",
    "occupations": []
  },
  {
    "sun_code": "525543x",
    "occupations": []
  },
  {
    "sun_code": "415724e",
    "occupations": [
      {
        "concept_id": "ckkD_JhH_Sc6",
        "name": "Tandsköterska"
      }
    ]
  },
  {
    "sun_code": "415146x",
    "occupations": []
  },
  {
    "sun_code": "415723t",
    "occupations": []
  },
  {
    "sun_code": "415525c",
    "occupations": []
  },
  {
    "sun_code": "415622c",
    "occupations": []
  },
  {
    "sun_code": "415522c",
    "occupations": []
  },
  {
    "sun_code": "415542c",
    "occupations": [
      {
        "concept_id": "ezMJ_6c9_P5z",
        "name": "Mönsterritare, tyger"
      },
      {
        "concept_id": "M9iy_1ua_7UK",
        "name": "Direktris/Garment technician/Mönsterkonstruktör"
      }
    ]
  },
  {
    "sun_code": "415543c",
    "occupations": []
  },
  {
    "sun_code": "405525c",
    "occupations": []
  },
  {
    "sun_code": "405582g",
    "occupations": [
      {
        "concept_id": "k7aW_toR_PPm",
        "name": "Arbetsledare, husbyggnad"
      },
      {
        "concept_id": "Ys2U_uQv_V4n",
        "name": "Byggledare"
      },
      {
        "concept_id": "rBpK_cfG_2v9",
        "name": "Produktionsingenjör, bygg"
      },
      {
        "concept_id": "pTTz_5DC_itW",
        "name": "Projektledare, bygg och anläggning"
      }
    ]
  },
  {
    "sun_code": "405723q",
    "occupations": [
      {
        "concept_id": "c32f_KpH_CfN",
        "name": "Vårdare/Arbetshandledare/Boendestödjare"
      },
      {
        "concept_id": "LxhG_of8_eMi",
        "name": "Stödassistent"
      },
      {
        "concept_id": "JxX3_zHB_ycd",
        "name": "Skötare"
      }
    ]
  },
  {
    "sun_code": "405762c",
    "occupations": []
  },
  {
    "sun_code": "405541x",
    "occupations": []
  },
  {
    "sun_code": "405345x",
    "occupations": []
  },
  {
    "sun_code": "405341z",
    "occupations": []
  },
  {
    "sun_code": "405812z",
    "occupations": [
      {
        "concept_id": "21B5_fF6_MTN",
        "name": "Resebyråchef"
      },
      {
        "concept_id": "GnQz_w5A_c8Q",
        "name": "Reseproducent"
      }
    ]
  },
  {
    "sun_code": "405523f",
    "occupations": [
      {
        "concept_id": "rncq_GAq_KMx",
        "name": "Automationsingenjör, maskin"
      }
    ]
  },
  {
    "sun_code": "405342z",
    "occupations": [
      {
        "concept_id": "WCma_2oa_gyZ",
        "name": "Marknadsförare"
      }
    ]
  },
  {
    "sun_code": "405349z",
    "occupations": []
  },
  {
    "sun_code": "405481a",
    "occupations": []
  },
  {
    "sun_code": "405811c",
    "occupations": []
  },
  {
    "sun_code": "405345a",
    "occupations": []
  },
  {
    "sun_code": "405213d",
    "occupations": []
  },
  {
    "sun_code": "405321b",
    "occupations": []
  },
  {
    "sun_code": "405580x",
    "occupations": []
  },
  {
    "sun_code": "405521c",
    "occupations": []
  },
  {
    "sun_code": "405149x",
    "occupations": []
  },
  {
    "sun_code": "405214a",
    "occupations": []
  },
  {
    "sun_code": "405345c",
    "occupations": [
      {
        "concept_id": "nRLP_eqC_ow9",
        "name": "Löneadministratör/Lönekonsult"
      }
    ]
  },
  {
    "sun_code": "415211a",
    "occupations": [
      {
        "concept_id": "xaLh_X2Y_aAn",
        "name": "Konstnär"
      }
    ]
  },
  {
    "sun_code": "415640x",
    "occupations": [
      {
        "concept_id": "FtjZ_ATU_Sup",
        "name": "Djurvårdare"
      }
    ]
  },
  {
    "sun_code": "525812z",
    "occupations": [
      {
        "concept_id": "3UjR_xoC_5D6",
        "name": "Turistbyråchef"
      },
      {
        "concept_id": "M7Cg_frj_qVu",
        "name": "Turistbyråtjänsteman"
      },
      {
        "concept_id": "jzeN_ugc_uyf",
        "name": "Turistinformatör"
      }
    ]
  },
  {
    "sun_code": "415723r",
    "occupations": [
      {
        "concept_id": "Y3QA_5pk_uXd",
        "name": "Undersköterska, hemtjänst, äldreboende och habilitering"
      }
    ]
  },
  {
    "sun_code": "415727x",
    "occupations": [
      {
        "concept_id": "8cJ8_fJJ_X5X",
        "name": "Apotekstekniker"
      }
    ]
  },
  {
    "sun_code": "415811d",
    "occupations": [
      {
        "concept_id": "X4JJ_j1w_72W",
        "name": "Kostkonsulent/Kostutvecklare/Måltidsutvecklare"
      },
      {
        "concept_id": "VKcv_Mbu_KJE",
        "name": "Internatföreståndare/Skolmåltidsföreståndare"
      }
    ]
  },
  {
    "sun_code": "525481a",
    "occupations": [
      {
        "concept_id": "GDHs_eoz_uKx",
        "name": "Frontend-utvecklare"
      },
      {
        "concept_id": "7wdX_4rv_33z",
        "name": "Backend-utvecklare"
      },
      {
        "concept_id": "71Ji_irM_rSJ",
        "name": "Fullstack-utvecklare"
      }
    ]
  },
  {
    "sun_code": "525851z",
    "occupations": [
      {
        "concept_id": "tKCe_Qpx_Thx",
        "name": "Arbetsmiljöingenjör"
      }
    ]
  },
  {
    "sun_code": "525343z",
    "occupations": [
      {
        "concept_id": "1oPB_E5L_n8e",
        "name": "Försäkringsrådgivare/Försäkringssäljare"
      },
      {
        "concept_id": "6Lx9_ukW_WSn",
        "name": "Privatekonomisk rådgivare"
      }
    ]
  },
  {
    "sun_code": "525213d",
    "occupations": [
      {
        "concept_id": "E4KE_68y_6ag",
        "name": "Art Director/AD"
      },
      {
        "concept_id": "ytrP_JCv_bwH",
        "name": "Game designer, Speldesigner"
      }
    ]
  },
  {
    "sun_code": "525762c",
    "occupations": [
      {
        "concept_id": "MMTE_fiP_1Ng",
        "name": "Behandlingsassistent/Socialpedagog"
      }
    ]
  },
  {
    "sun_code": "525481x",
    "occupations": []
  },
  {
    "sun_code": "525582c",
    "occupations": [
      {
        "concept_id": "k7aW_toR_PPm",
        "name": "Arbetsledare, husbyggnad"
      },
      {
        "concept_id": "A6CQ_XVJ_iy4",
        "name": "Arbetsledare, anläggning"
      },
      {
        "concept_id": "pTTz_5DC_itW",
        "name": "Projektledare, bygg och anläggning"
      }
    ]
  },
  {
    "sun_code": "525521c",
    "occupations": [
      {
        "concept_id": "XpZG_8pA_V2c",
        "name": "Industridesigner"
      },
      {
        "concept_id": "y2J4_Kxs_TVQ",
        "name": "Maskinkonstruktör"
      },
      {
        "concept_id": "EvmU_s9w_euP",
        "name": "CNC-operatör/FMS-operatör"
      }
    ]
  },
  {
    "sun_code": "525349z",
    "occupations": [
      {
        "concept_id": "7oRE_Ejt_YWQ",
        "name": "Logistiker"
      },
      {
        "concept_id": "Ce5J_e8j_7oh",
        "name": "Transportledare"
      },
      {
        "concept_id": "wQ7H_qrm_hr2",
        "name": "Logistikchef"
      }
    ]
  },
  {
    "sun_code": "415811b",
    "occupations": [
      {
        "concept_id": "EH8C_7Pm_SMZ",
        "name": "Hotellchef"
      }
    ]
  },
  {
    "sun_code": "415621c",
    "occupations": [
      {
        "concept_id": "TT1h_Km4_mNS",
        "name": "Driftledare, lantbruk"
      },
      {
        "concept_id": "PWy4_nn9_tCQ",
        "name": "Driftchef, lantbruk"
      }
    ]
  },
  {
    "sun_code": "525344z",
    "occupations": [
      {
        "concept_id": "CeoS_Wzo_uz5",
        "name": "Redovisningskonsult"
      }
    ]
  },
  {
    "sun_code": "525522c",
    "occupations": [
      {
        "concept_id": "7Yn2_NLJ_oa2",
        "name": "Elkraftingenjör"
      }
    ]
  },
  {
    "sun_code": "525582x",
    "occupations": [
      {
        "concept_id": "9NVZ_LfD_vqT",
        "name": "Fastighetstekniker/Drifttekniker, fastighet"
      },
      {
        "concept_id": "EPe8_EQu_YCL",
        "name": "Fastighetsförvaltare"
      },
      {
        "concept_id": "zZsy_ajo_BuR",
        "name": "Driftchef, fastighet"
      }
    ]
  },
  {
    "sun_code": "415341z",
    "occupations": [
      {
        "concept_id": "TTDZ_Neo_9GJ",
        "name": "Key account manager"
      }
    ]
  },
  {
    "sun_code": "525523e",
    "occupations": []
  },
  {
    "sun_code": "525489z",
    "occupations": []
  },
  {
    "sun_code": "415523e",
    "occupations": [
      {
        "concept_id": "Nkbd_wa9_TZF",
        "name": "Nätverkstekniker"
      }
    ]
  },
  {
    "sun_code": "415213b",
    "occupations": [
      {
        "concept_id": "FcaP_vhz_Cuy",
        "name": "Producent: kultur, media, film, dataspel"
      }
    ]
  },
  {
    "sun_code": "415481a",
    "occupations": [
      {
        "concept_id": "fg7B_yov_smw",
        "name": "Systemutvecklare/Programmerare"
      },
      {
        "concept_id": "ZtTD_4VC_f4i",
        "name": "Systemtestare/Funktionstestare"
      }
    ]
  },
  {
    "sun_code": "415811c",
    "occupations": [
      {
        "concept_id": "XSBp_5wD_VaU",
        "name": "Restaurangchef"
      },
      {
        "concept_id": "EH8C_7Pm_SMZ",
        "name": "Hotellchef"
      },
      {
        "concept_id": "Z3zH_Cbd_bbC",
        "name": "Konferenschef"
      }
    ]
  },
  {
    "sun_code": "415213d",
    "occupations": [
      {
        "concept_id": "ytrP_JCv_bwH",
        "name": "Game designer, Speldesigner"
      },
      {
        "concept_id": "E4KE_68y_6ag",
        "name": "Art Director/AD"
      },
      {
        "concept_id": "iwJU_gW4_SxT",
        "name": "UX-designer"
      }
    ]
  },
  {
    "sun_code": "415869z",
    "occupations": []
  },
  {
    "sun_code": "525723q",
    "occupations": [
      {
        "concept_id": "c32f_KpH_CfN",
        "name": "Vårdare/Arbetshandledare/Boendestödjare"
      },
      {
        "concept_id": "JxX3_zHB_ycd",
        "name": "Skötare"
      },
      {
        "concept_id": "MMTE_fiP_1Ng",
        "name": "Behandlingsassistent/Socialpedagog"
      }
    ]
  },
  {
    "sun_code": "525840a",
    "occupations": [
      {
        "concept_id": "Ce5J_e8j_7oh",
        "name": "Transportledare"
      },
      {
        "concept_id": "tbMx_bRW_QSM",
        "name": "Speditör"
      },
      {
        "concept_id": "7sWW_Zpv_wy1",
        "name": "Befraktningsmäklare"
      }
    ]
  },
  {
    "sun_code": "525582g",
    "occupations": []
  },
  {
    "sun_code": "415621f",
    "occupations": [
      {
        "concept_id": "JMd5_2p6_zQt",
        "name": "Djurskötare, häst"
      },
      {
        "concept_id": "Tufb_JbW_wS6",
        "name": "Hovslagare"
      },
      {
        "concept_id": "H9ej_iRx_9G6",
        "name": "Ridinstruktör/Ridlärare"
      }
    ]
  },
  {
    "sun_code": "415349z",
    "occupations": []
  },
  {
    "sun_code": "525345c",
    "occupations": [
      {
        "concept_id": "nRLP_eqC_ow9",
        "name": "Löneadministratör/Lönekonsult"
      }
    ]
  },
  {
    "sun_code": "525346a",
    "occupations": [
      {
        "concept_id": "J5oq_tNd_6RU",
        "name": "Läkarsekreterare/Vårdadministratör/Medicinsk sekreterare"
      }
    ]
  },
  {
    "sun_code": "415582c",
    "occupations": []
  },
  {
    "sun_code": "415582g",
    "occupations": []
  },
  {
    "sun_code": "525524d",
    "occupations": [
      {
        "concept_id": "xhPp_qTB_poK",
        "name": "Processoperatör, kemisk industri"
      },
      {
        "concept_id": "4ZyQ_56y_MwM",
        "name": "Livsmedelstekniker"
      }
    ]
  },
  {
    "sun_code": "415524d",
    "occupations": [
      {
        "concept_id": "h4wH_7kG_UTN",
        "name": "Processoperatör, pappersmassa"
      },
      {
        "concept_id": "eXSQ_Gwt_hZN",
        "name": "Sågverksoperatör"
      }
    ]
  },
  {
    "sun_code": "415623x",
    "occupations": [
      {
        "concept_id": "77Gm_wws_Dqp",
        "name": "Skogsplanläggare"
      }
    ]
  },
  {
    "sun_code": "415541x",
    "occupations": [
      {
        "concept_id": "sv8p_KRW_9Q5",
        "name": "Bryggeriarbetare"
      },
      {
        "concept_id": "1Ffa_QcR_YQj",
        "name": "Brygghusarbetare"
      },
      {
        "concept_id": "1Ffa_QcR_YQj",
        "name": "Brygghusarbetare"
      }
    ]
  },
  {
    "sun_code": "415582f",
    "occupations": [
      {
        "concept_id": "oAHt_G4F_Bya",
        "name": "Rörinfodrare"
      },
      {
        "concept_id": "ZZTi_v6g_4cZ",
        "name": "VVS-montör"
      }
    ]
  },
  {
    "sun_code": "415723q",
    "occupations": []
  },
  {
    "sun_code": "415723p",
    "occupations": []
  },
  {
    "sun_code": "525622c",
    "occupations": [
      {
        "concept_id": "JZur_dmf_EPY",
        "name": "Trädgårdsmästare, anläggning"
      },
      {
        "concept_id": "43oy_qgN_eds",
        "name": "Trädgårdsmästare, odling"
      }
    ]
  },
  {
    "sun_code": "415725x",
    "occupations": []
  },
  {
    "sun_code": "415342z",
    "occupations": [
      {
        "concept_id": "GTFy_iPM_msj",
        "name": "Butikskommunikatör/Visual merchandiser"
      },
      {
        "concept_id": "WCma_2oa_gyZ",
        "name": "Marknadsförare"
      },
      {
        "concept_id": "1z8u_QoC_C56",
        "name": "Relationsmarknadsförare"
      }
    ]
  },
  {
    "sun_code": "520212a",
    "occupations": [
      {
        "concept_id": "k3ZW_16R_riY",
        "name": "Sångare"
      },
      {
        "concept_id": "UCXb_LjK_pHv",
        "name": "Musiker"
      }
    ]
  },
  {
    "sun_code": "405815a",
    "occupations": [
      {
        "concept_id": "MiYT_1JK_fKe",
        "name": "Make-up artist/MUA"
      },
      {
        "concept_id": "xUwN_SAt_vGg",
        "name": "Sminkör"
      },
      {
        "concept_id": "zqBJ_sRm_m5Z",
        "name": "Hudterapeut"
      },
      {
        "concept_id": "tuoE_9Nj_fAS",
        "name": "Frisör"
      },
      {
        "concept_id": "hDzC_BF5_Wz2",
        "name": "Barberare"
      }
    ]
  },
  {
    "sun_code": "525215z",
    "occupations": [
      {
        "concept_id": "xQxJ_E6e_Hzv",
        "name": "Konsthantverkare"
      }
    ]
  },
  {
    "sun_code": "525543c",
    "occupations": [
      {
        "concept_id": "EVMd_5ES_dRT",
        "name": "Möbelsnickare"
      },
      {
        "concept_id": "RmVi_RnM_LpF",
        "name": "Reparationssnickare"
      }
    ]
  },
  {
    "sun_code": "525582f",
    "occupations": [
      {
        "concept_id": "8wPx_j4J_ZTh",
        "name": "VVS-ingenjör"
      }
    ]
  },
  {
    "sun_code": "415521c",
    "occupations": []
  },
  {
    "sun_code": "400212a",
    "occupations": [
      {
        "concept_id": "UCXb_LjK_pHv",
        "name": "Musiker"
      }
    ]
  },
  {
    "sun_code": "415212a",
    "occupations": [
      {
        "concept_id": "UCXb_LjK_pHv",
        "name": "Musiker"
      },
      {
        "concept_id": "YFUx_75S_WMJ",
        "name": "Arrangör, musik"
      }
    ]
  },
  {
    "sun_code": "410223x",
    "occupations": [
      {
        "concept_id": "5fri_5bN_1Da",
        "name": "Manusförfattare"
      },
      {
        "concept_id": "nbQm_DXb_5vC",
        "name": "Författare"
      }
    ]
  },
  {
    "sun_code": "520211a",
    "occupations": [
      {
        "concept_id": "xaLh_X2Y_aAn",
        "name": "Konstnär"
      }
    ]
  },
  {
    "sun_code": "415215z",
    "occupations": [
      {
        "concept_id": "xQxJ_E6e_Hzv",
        "name": "Konsthantverkare"
      },
      {
        "concept_id": "ZTB6_ors_GyC",
        "name": "Textilkonstnär"
      }
    ]
  },
  {
    "sun_code": "415214a",
    "occupations": [
      {
        "concept_id": "PhYb_nma_zEu",
        "name": "Kostymdesigner/Kostymtecknare"
      }
    ]
  },
  {
    "sun_code": "410543c",
    "occupations": [
      {
        "concept_id": "EVMd_5ES_dRT",
        "name": "Möbelsnickare"
      },
      {
        "concept_id": "imUa_z6c_NDM",
        "name": "Musikinstrumentmakare"
      }
    ]
  },
  {
    "sun_code": "410214c",
    "occupations": [
      {
        "concept_id": "XpZG_8pA_V2c",
        "name": "Industridesigner"
      }
    ]
  },
  {
    "sun_code": "410212a",
    "occupations": [
      {
        "concept_id": "UCXb_LjK_pHv",
        "name": "Musiker"
      }
    ]
  },
  {
    "sun_code": "410214b",
    "occupations": [
      {
        "concept_id": "xqy1_tB2_tBK",
        "name": "Inredningsarkitekt"
      }
    ]
  },
  {
    "sun_code": "410212b",
    "occupations": [
      {
        "concept_id": "euJP_wxo_skF",
        "name": "Dansare"
      }
    ]
  },
  {
    "sun_code": "410213d",
    "occupations": [
      {
        "concept_id": "1N2U_6xW_Tdx",
        "name": "Fotograf"
      }
    ]
  },
  {
    "sun_code": "410210z",
    "occupations": []
  },
  {
    "sun_code": "410213b",
    "occupations": [
      {
        "concept_id": "FcaP_vhz_Cuy",
        "name": "Producent: kultur, media, film, dataspel"
      }
    ]
  },
  {
    "sun_code": "410211x",
    "occupations": []
  },
  {
    "sun_code": "525341z",
    "occupations": [
      {
        "concept_id": "8jrL_5RZ_9Kt",
        "name": "Account manager"
      }
    ]
  },
  {
    "sun_code": "415481x",
    "occupations": [
      {
        "concept_id": "xJQz_S3z_vab",
        "name": "Agil coach/Agile coach"
      },
      {
        "concept_id": "z5AM_ayf_WcL",
        "name": "Projektledare, IT"
      }
    ]
  },
  {
    "sun_code": "525523f",
    "occupations": [
      {
        "concept_id": "rncq_GAq_KMx",
        "name": "Automationsingenjör, maskin"
      },
      {
        "concept_id": "kx3b_92W_PuD",
        "name": "Elingenjör"
      }
    ]
  },
  {
    "sun_code": "525544c",
    "occupations": [
      {
        "concept_id": "Ls8r_yKQ_MQ4",
        "name": "Bergarbetare, gruva"
      },
      {
        "concept_id": "nJ4r_QkK_ASp",
        "name": "Bergarbetare, bygg och anläggning"
      }
    ]
  },
  {
    "sun_code": "415522d",
    "occupations": []
  },
  {
    "sun_code": "525525c",
    "occupations": [
      {
        "concept_id": "bLKd_4Wg_3rn",
        "name": "Fordonstekniker/Bilmekaniker/Personbilsmekaniker"
      }
    ]
  },
  {
    "sun_code": "525580x",
    "occupations": []
  },
  {
    "sun_code": "525999z",
    "occupations": []
  },
  {
    "sun_code": "415523f",
    "occupations": [
      {
        "concept_id": "oC9M_Bqu_WZH",
        "name": "Automationstekniker, elektronik"
      }
    ]
  },
  {
    "sun_code": "525213b",
    "occupations": [
      {
        "concept_id": "5fri_5bN_1Da",
        "name": "Manusförfattare"
      },
      {
        "concept_id": "FcaP_vhz_Cuy",
        "name": "Producent: kultur, media, film, dataspel"
      }
    ]
  },
  {
    "sun_code": "415321b",
    "occupations": []
  },
  {
    "sun_code": "525380x",
    "occupations": []
  },
  {
    "sun_code": "525621f",
    "occupations": [
      {
        "concept_id": "H9ej_iRx_9G6",
        "name": "Ridinstruktör/Ridlärare"
      }
    ]
  },
  {
    "sun_code": "415623b",
    "occupations": [
      {
        "concept_id": "RiAf_dVp_md4",
        "name": "Skogsförvaltare"
      }
    ]
  },
  {
    "sun_code": "415723u",
    "occupations": []
  },
  {
    "sun_code": "405542c",
    "occupations": [
      {
        "concept_id": "NFor_pi5_ZZY",
        "name": "Konstruktör, textil, trä, glas, förpackningarKonstruktör, textil, trä, glas, förpackningar"
      }
    ]
  },
  {
    "sun_code": "405869z",
    "occupations": []
  },
  {
    "sun_code": "405522d",
    "occupations": []
  },
  {
    "sun_code": "405582x",
    "occupations": []
  },
  {
    "sun_code": "405725x",
    "occupations": []
  },
  {
    "sun_code": "405582f",
    "occupations": [
      {
        "concept_id": "8wPx_j4J_ZTh",
        "name": "VVS-ingenjör"
      },
      {
        "concept_id": "mpcK_WMn_6q4",
        "name": "VVS-tekniker"
      }
    ]
  },
  {
    "sun_code": "405840a",
    "occupations": []
  },
  {
    "sun_code": "405523e",
    "occupations": [
      {
        "concept_id": "51vT_RSZ_sK1",
        "name": "Mekatronikingenjör"
      }
    ]
  },
  {
    "sun_code": "405340x",
    "occupations": [
      {
        "concept_id": "Zwhm_5tT_Zms",
        "name": "Affärsutvecklare"
      }
    ]
  },
  {
    "sun_code": "415345a",
    "occupations": []
  },
  {
    "sun_code": "525581x",
    "occupations": []
  },
  {
    "sun_code": "415580x",
    "occupations": []
  },
  {
    "sun_code": "525342z",
    "occupations": [
      {
        "concept_id": "WCma_2oa_gyZ",
        "name": "Marknadsförare"
      },
      {
        "concept_id": "XiJJ_yXL_TC7",
        "name": "Onlinemarknadsförare"
      }
    ]
  },
  {
    "sun_code": "525523x",
    "occupations": []
  },
  {
    "sun_code": "525525d",
    "occupations": [
      {
        "concept_id": "XjEC_vph_KJH",
        "name": "Flygtekniker"
      },
      {
        "concept_id": "wEEf_wFY_sxa",
        "name": "Helikoptertekniker"
      },
      {
        "concept_id": "M6Yt_ynM_FDQ",
        "name": "Marinmekaniker/Marintekniker"
      }
    ]
  },
  {
    "sun_code": "525214c",
    "occupations": [
      {
        "concept_id": "NFor_pi5_ZZY",
        "name": "Konstruktör, textil, trä, glas, förpackningar"
      }
    ]
  },
  {
    "sun_code": "525214a",
    "occupations": [
      {
        "concept_id": "PhYb_nma_zEu",
        "name": "Kostymdesigner/Kostymtecknare"
      }
    ]
  },
  {
    "sun_code": "525210z",
    "occupations": [
      {
        "concept_id": "APXv_QHZ_dkt",
        "name": "Projektledare: kultur, media, film"
      }
    ]
  },
  {
    "sun_code": "525212a",
    "occupations": [
      {
        "concept_id": "YFUx_75S_WMJ",
        "name": "Arrangör, musik"
      }
    ]
  },
  {
    "sun_code": "415582d",
    "occupations": []
  },
  {
    "sun_code": "415840b",
    "occupations": [
      {
        "concept_id": "UkgF_gNF_EYY",
        "name": " Lokförare/Förare av tåg"
      },
      {
        "concept_id": "neCW_Kwd_SHC",
        "name": "Radiolokförare"
      }
    ]
  },
  {
    "sun_code": "415345c",
    "occupations": [
      {
        "concept_id": "nRLP_eqC_ow9",
        "name": "Löneadministratör/Lönekonsult"
      }
    ]
  },
  {
    "sun_code": "525726x",
    "occupations": [
      {
        "concept_id": "mC28_vEv_AVx",
        "name": "Massör/Massageterapeut"
      },
      {
        "concept_id": "2Q3q_yQV_LTm",
        "name": "Spa-terapeut"
      }
    ]
  },
  {
    "sun_code": "535543c",
    "occupations": [
      {
        "concept_id": "imUa_z6c_NDM",
        "name": "Musikinstrumentmakare"
      },
      {
        "concept_id": "EVMd_5ES_dRT",
        "name": "Möbelsnickare"
      }
    ]
  },
  {
    "sun_code": "525815b",
    "occupations": [
      {
        "concept_id": "mC28_vEv_AVx",
        "name": "Massör/Massageterapeut"
      }
    ]
  },
  {
    "sun_code": "525542c",
    "occupations": [
      {
        "concept_id": "ras1_rJP_9UX",
        "name": "Skräddare"
      },
      {
        "concept_id": "W6ke_dme_Lf2",
        "name": "Damskräddare"
      },
      {
        "concept_id": "h1MS_NFS_NUn",
        "name": "Herrskräddare"
      },
      {
        "concept_id": "9X5m_3HX_xv5",
        "name": "Ändringsskräddare"
      }
    ]
  },
  {
    "sun_code": "535542c",
    "occupations": [
      {
        "concept_id": "ras1_rJP_9UX",
        "name": "Skräddare"
      },
      {
        "concept_id": "W6ke_dme_Lf2",
        "name": "Damskräddare"
      },
      {
        "concept_id": "h1MS_NFS_NUn",
        "name": "Herrskräddare"
      },
      {
        "concept_id": "9X5m_3HX_xv5",
        "name": "Ändringsskräddare"
      }
    ]
  },
  {
    "sun_code": "415321x",
    "occupations": [
      {
        "concept_id": "xQxJ_E6e_Hzv",
        "name": "Konsthantverkare"
      },
      {
        "concept_id": "EWXb_FW7_fTJ",
        "name": "Konstsmed"
      }
    ]
  },
  {
    "sun_code": "535215z",
    "occupations": [
      {
        "concept_id": "xQxJ_E6e_Hzv",
        "name": "Konsthantverkare"
      }
    ]
  },
  {
    "sun_code": "535321a",
    "occupations": [
      {
        "concept_id": "BduY_UUY_pvK",
        "name": " Journalist/Reporter"
      },
      {
        "concept_id": "7EQu_8Xg_9SD",
        "name": "Videojournalist/Videoreporter"
      },
      {
        "concept_id": "1N2U_6xW_Tdx",
        "name": "Fotograf"
      }
    ]
  },
  {
    "sun_code": "535212a",
    "occupations": [
      {
        "concept_id": "RjeB_w9X_dhM",
        "name": "Musikalartist"
      }
    ]
  },
  {
    "sun_code": "530211a",
    "occupations": [
      {
        "concept_id": "xaLh_X2Y_aAn",
        "name": "Konstnär"
      }
    ]
  },
  {
    "sun_code": "535212b",
    "occupations": [
      {
        "concept_id": "euJP_wxo_skF",
        "name": "Dansare"
      }
    ]
  },
  {
    "sun_code": "415345x",
    "occupations": []
  },
  {
    "sun_code": "415525d",
    "occupations": [
      {
        "concept_id": "5vTD_wiJ_KGJ",
        "name": "El- och avioniktekniker/IERA- tekniker"
      },
      {
        "concept_id": "M6Yt_ynM_FDQ",
        "name": "Marinmekaniker/Marintekniker"
      }
    ]
  },
  {
    "sun_code": "415815b",
    "occupations": [
      {
        "concept_id": "mC28_vEv_AVx",
        "name": "Massör/Massageterapeut"
      }
    ]
  },
  {
    "sun_code": "415762c",
    "occupations": [
      {
        "concept_id": "c32f_KpH_CfN",
        "name": "Vårdare/Arbetshandledare/Boendestödjare"
      }
    ]
  },
  {
    "sun_code": "415582x",
    "occupations": [
      {
        "concept_id": "9NVZ_LfD_vqT",
        "name": "Fastighetstekniker/Drifttekniker, fastighet"
      }
    ]
  },
  {
    "sun_code": "415581x",
    "occupations": []
  },
  {
    "sun_code": "525524c",
    "occupations": [
      {
        "concept_id": "pdKf_yyX_vWc",
        "name": "Laboratorietekniker, kemi"
      }
    ]
  },
  {
    "sun_code": "525212b",
    "occupations": [
      {
        "concept_id": "euJP_wxo_skF",
        "name": "Dansare"
      }
    ]
  },
  {
    "sun_code": "525621c",
    "occupations": [
      {
        "concept_id": "egDr_i9z_xoT",
        "name": "Agronom"
      }
    ]
  },
  {
    "sun_code": "415851z",
    "occupations": [
      {
        "concept_id": "tKCe_Qpx_Thx",
        "name": "Arbetsmiljöingenjör"
      }
    ]
  },
  {
    "sun_code": "415812z",
    "occupations": [
      {
        "concept_id": "21B5_fF6_MTN",
        "name": "Resebyråchef"
      },
      {
        "concept_id": "3UjR_xoC_5D6",
        "name": "Turistbyråchef"
      },
      {
        "concept_id": "S1tx_E6k_G9N",
        "name": "Prissättare"
      }
    ]
  },
  {
    "sun_code": "535621f",
    "occupations": [
      {
        "concept_id": "JMd5_2p6_zQt",
        "name": "Djurskötare, häst"
      },
      {
        "concept_id": "Tufb_JbW_wS6",
        "name": "Hovslagare"
      },
      {
        "concept_id": "H9ej_iRx_9G6",
        "name": "Ridinstruktör/Ridlärare"
      }
    ]
  },
  {
    "sun_code": "415340x",
    "occupations": [
      {
        "concept_id": "Zwhm_5tT_Zms",
        "name": "Affärsutvecklare"
      }
    ]
  },
  {
    "sun_code": "525811b",
    "occupations": [
      {
        "concept_id": "EH8C_7Pm_SMZ",
        "name": "Hotellchef"
      },
      {
        "concept_id": "Z3zH_Cbd_bbC",
        "name": "Konferenschef"
      }
    ]
  },
  {
    "sun_code": "525543f",
    "occupations": [
      {
        "concept_id": "8r8B_8bP_usp",
        "name": "Utvecklingsingenjör, tillverkningsindustri"
      }
    ]
  },
  {
    "sun_code": "415621g",
    "occupations": [
      {
        "concept_id": "FtjZ_ATU_Sup",
        "name": "Djurvårdare"
      }
    ]
  },
  {
    "sun_code": "525623x",
    "occupations": [
      {
        "concept_id": "4fuh_Uf7_NAA",
        "name": "Naturvårdare"
      }
    ]
  },
  {
    "sun_code": "415526x",
    "occupations": [
      {
        "concept_id": "dxAK_mLr_bAa",
        "name": "Logistikingenjör"
      }
    ]
  },
  {
    "sun_code": "525840c",
    "occupations": [
      {
        "concept_id": "NfYe_q89_pY2",
        "name": "Fartygsbefäl"
      }
    ]
  },
  {
    "sun_code": "525321b",
    "occupations": [
      {
        "concept_id": "aRp4_qjZ_tPV",
        "name": "Informatör/Kommunikatör"
      }
    ]
  },
  {
    "sun_code": "415540x",
    "occupations": [
      {
        "concept_id": "KTVC_1PC_cJG",
        "name": "Ytbehandlare manuell, trä/Sprutlackerare, manuell, trä"
      },
      {
        "concept_id": "v2HV_VNh_D7s",
        "name": "Lackerare"
      }
    ]
  },
  {
    "sun_code": "405724e",
    "occupations": [
      {
        "concept_id": "ckkD_JhH_Sc6",
        "name": "Tandsköterska"
      }
    ]
  },
  {
    "sun_code": "405346a",
    "occupations": [
      {
        "concept_id": "J5oq_tNd_6RU",
        "name": "Läkarsekreterare/Vårdadministratör/Medicinsk sekreterare"
      }
    ]
  },
  {
    "sun_code": "535640x",
    "occupations": [
      {
        "concept_id": "JMd5_2p6_zQt",
        "name": "Djurskötare, häst"
      }
    ]
  },
  {
    "sun_code": "415149x",
    "occupations": [
      {
        "concept_id": "Zfgc_BYU_HM2",
        "name": "Lärarassistent"
      }
    ]
  },
  {
    "sun_code": "405489z",
    "occupations": [
      {
        "concept_id": "QQjZ_NAN_bDR",
        "name": "Interaktionsdesigner"
      }
    ]
  },
  {
    "sun_code": "405213b",
    "occupations": [
      {
        "concept_id": "FcaP_vhz_Cuy",
        "name": "Producent: kultur, media, film, dataspel"
      }
    ]
  },
  {
    "sun_code": "405581x",
    "occupations": []
  }
]
