['i.uoh.mdh.bma053.12008.20221',
 'i.uoh.mdh.bma073.12007.20221',
 'i.uoh.mdh.bma075.22049.20212',
 'i.uoh.mdh.bma089.22050.20212',
 'i.uoh.mdh.bma090.12026.20221',
 'i.uoh.mdh.bma091.22051.20212',
 'i.uoh.mdh.bma092.12023.20221',
 'i.uoh.mdh.bma095.12014.20221',
 'i.uoh.mdh.bma098.12054.20221',
 'i.uoh.mdh.bma099.12002.20221',
 'i.uoh.mdh.bma100.12037.20221',
 'i.uoh.mdh.bma101.12051.20221',
 'i.uoh.mdh.bma102.22068.20212',
 'i.uoh.mdh.bma104.12085.20221',
 'i.uoh.mdh.bma104.22004.20212',
 'i.uoh.mdh.bma105.22053.20212',
 'i.uoh.mdh.bma209.22052.20212',
 'i.uoh.mdh.bma210.22054.20212',
 'i.uoh.mdh.bta119.23024.20212',
 'i.uoh.mdh.bta121.23025.20212',
 'i.uoh.mdh.bta124.23081.20212',
 'i.uoh.mdh.bta125.23060.20212',
 'i.uoh.mdh.bta126.23014.20212',
 'i.uoh.mdh.bta129.13008.20221',
 'i.uoh.mdh.bta130.13011.20221',
 'i.uoh.mdh.bta134.13010.20221',
 'i.uoh.mdh.bta135.13002.20221',
 'i.uoh.mdh.bta136.13083.20221',
 'i.uoh.mdh.bta137.23089.20212',
 'i.uoh.mdh.bta138.23019.20212',
 'i.uoh.mdh.bta139.13004.20221',
 'i.uoh.mdh.bta202.23028.20212',
 'i.uoh.mdh.bta206.23050.20212',
 'i.uoh.mdh.bta209.23049.20212',
 'i.uoh.mdh.bta210.13037.20221',
 'i.uoh.mdh.bta211.13022.20221',
 'i.uoh.mdh.bta213.23003.20212',
 'i.uoh.mdh.cdt204.24033.20212',
 'i.uoh.mdh.cdt402.24027.20212',
 'i.uoh.mdh.cdt406.14080.20221',
 'i.uoh.mdh.cdt414.24028.20212',
 'i.uoh.mdh.dva117.24029.20212',
 'i.uoh.mdh.dva120.24030.20212',
 'i.uoh.mdh.dva128.24136.20212',
 'i.uoh.mdh.dva130.24035.20212',
 'i.uoh.mdh.dva131.24031.20212',
 'i.uoh.mdh.dva200.14025.20221',
 'i.uoh.mdh.dva203.24038.20212',
 'i.uoh.mdh.dva206.24103.20212',
 'i.uoh.mdh.dva218.14029.20221',
 'i.uoh.mdh.dva222.14031.20221',
 'i.uoh.mdh.dva222.24040.20212',
 'i.uoh.mdh.dva224.14032.20221',
 'i.uoh.mdh.dva229.14034.20221',
 'i.uoh.mdh.dva231.24042.20212',
 'i.uoh.mdh.dva232.24044.20212',
 'i.uoh.mdh.dva238.24046.20212',
 'i.uoh.mdh.dva240.14035.20221',
 'i.uoh.mdh.dva244.14132.20221',
 'i.uoh.mdh.dva244.24049.20212',
 'i.uoh.mdh.dva245.14090.20221',
 'i.uoh.mdh.dva246.14037.20221',
 'i.uoh.mdh.dva247.14038.20221',
 'i.uoh.mdh.dva250.14039.20221',
 'i.uoh.mdh.dva251.14026.20221',
 'i.uoh.mdh.dva252.14087.20221',
 'i.uoh.mdh.dva252.24034.20212',
 'i.uoh.mdh.dva254.14040.20221',
 'i.uoh.mdh.dva256.14042.20221',
 'i.uoh.mdh.dva257.24051.20212',
 'i.uoh.mdh.dva258.14045.20221',
 'i.uoh.mdh.dva259.24084.20212',
 'i.uoh.mdh.dva260.14044.20221',
 'i.uoh.mdh.dva300.14048.20221',
 'i.uoh.mdh.dva305.14049.20221',
 'i.uoh.mdh.dva305.24016.20212',
 'i.uoh.mdh.dva313.24052.20212',
 'i.uoh.mdh.dva315.14051.20221',
 'i.uoh.mdh.dva328.24053.20212',
 'i.uoh.mdh.dva331.14098.20221',
 'i.uoh.mdh.dva331.24054.20212',
 'i.uoh.mdh.dva332.24055.20212',
 'i.uoh.mdh.dva333.14066.20221',
 'i.uoh.mdh.dva333.24056.20212',
 'i.uoh.mdh.dva334.24057.20212',
 'i.uoh.mdh.dva336.24058.20212',
 'i.uoh.mdh.dva337.24059.20212',
 'i.uoh.mdh.dva338.14053.20221',
 'i.uoh.mdh.dva339.24063.20212',
 'i.uoh.mdh.dva340.14055.20221',
 'i.uoh.mdh.dva400.14059.20221',
 'i.uoh.mdh.dva435.14060.20221',
 'i.uoh.mdh.dva436.14061.20221',
 'i.uoh.mdh.dva437.24050.20212',
 'i.uoh.mdh.dva438.24074.20212',
 'i.uoh.mdh.dva439.14077.20221',
 'i.uoh.mdh.dva444.24076.20212',
 'i.uoh.mdh.dva449.14078.20221',
 'i.uoh.mdh.dva451.24577.20212',
 'i.uoh.mdh.dva452.14082.20221',
 'i.uoh.mdh.dva454.24113.20212',
 'i.uoh.mdh.dva455.14088.20221',
 'i.uoh.mdh.dva463.24080.20212',
 'i.uoh.mdh.dva474.24085.20212',
 'i.uoh.mdh.dva482.24091.20212',
 'i.uoh.mdh.dva484.14095.20221',
 'i.uoh.mdh.dva485.14103.20221',
 'i.uoh.mdh.dva488.14111.20221',
 'i.uoh.mdh.dva490.24098.20212',
 'i.uoh.mdh.dva491.14119.20221',
 'i.uoh.mdh.dva502.14106.20221',
 'i.uoh.mdh.dva502.24093.20212',
 'i.uoh.mdh.dva505.14112.20221',
 'i.uoh.mdh.efo235.13051.20221',
 'i.uoh.mdh.efo235.23035.20212',
 'i.uoh.mdh.eha002.23032.20212',
 'i.uoh.mdh.eha004.23033.20212',
 'i.uoh.mdh.eha006.23034.20212',
 'i.uoh.mdh.ela103.14068.20221',
 'i.uoh.mdh.ela103.24096.20212',
 'i.uoh.mdh.ela104.14133.20221',
 'i.uoh.mdh.ela104.24082.20212',
 'i.uoh.mdh.ela201.14073.20221',
 'i.uoh.mdh.ela203.24097.20212',
 'i.uoh.mdh.ela205.24135.20212',
 'i.uoh.mdh.ela206.24128.20212',
 'i.uoh.mdh.ela208.14079.20221',
 'i.uoh.mdh.ela209.24079.20212',
 'i.uoh.mdh.ela305.14081.20221',
 'i.uoh.mdh.ela400.14083.20221',
 'i.uoh.mdh.ela402.14085.20221',
 'i.uoh.mdh.ela408.14084.20221',
 'i.uoh.mdh.ela410.24111.20212',
 'i.uoh.mdh.ela411.24119.20212',
 'i.uoh.mdh.ela412.14091.20221',
 'i.uoh.mdh.ela427.24122.20212',
 'i.uoh.mdh.ela428.24083.20212',
 'i.uoh.mdh.ena115.11078.20221',
 'i.uoh.mdh.ena121.11053.20221',
 'i.uoh.mdh.ena121.21015.20212',
 'i.uoh.mdh.ena123.21076.20212',
 'i.uoh.mdh.ena124.21067.20212',
 'i.uoh.mdh.ena125.21017.20212',
 'i.uoh.mdh.ena141.21016.20212',
 'i.uoh.mdh.ena201.11054.20221',
 'i.uoh.mdh.ena202.11055.20221',
 'i.uoh.mdh.ena204.11046.20221',
 'i.uoh.mdh.ena208.11002.20221',
 'i.uoh.mdh.ena221.11021.20221',
 'i.uoh.mdh.ena241.11022.20221',
 'i.uoh.mdh.ena306.21080.20212',
 'i.uoh.mdh.ena311.11051.20221',
 'i.uoh.mdh.ena311.21075.20212',
 'i.uoh.mdh.ena312.21068.20212',
 'i.uoh.mdh.ena313.21069.20212',
 'i.uoh.mdh.ena314.21070.20212',
 'i.uoh.mdh.ena403.11056.20221',
 'i.uoh.mdh.ena404.11057.20221',
 'i.uoh.mdh.ena411.11059.20221',
 'i.uoh.mdh.ena501.11264.20221',
 'i.uoh.mdh.ena501.21072.20212',
 'i.uoh.mdh.ena504.11038.20221',
 'i.uoh.mdh.ena504.21044.20212',
 'i.uoh.mdh.ena512.21063.20212',
 'i.uoh.mdh.ena604.11020.20221',
 'i.uoh.mdh.ena605.21062.20212',
 'i.uoh.mdh.ena606.11019.20221',
 'i.uoh.mdh.ena801.11063.20221',
 'i.uoh.mdh.ena801.21081.20212',
 'i.uoh.mdh.ena802.11060.20221',
 'i.uoh.mdh.ena810.11182.20221',
 'i.uoh.mdh.era100.13027.20221',
 'i.uoh.mdh.era101.23036.20212',
 'i.uoh.mdh.era102.13042.20221',
 'i.uoh.mdh.era106.23079.20212',
 'i.uoh.mdh.era108.23084.20212',
 'i.uoh.mdh.era110.13043.20221',
 'i.uoh.mdh.era111.13046.20221',
 'i.uoh.mdh.era113.23093.20212',
 'i.uoh.mdh.era114.23094.20212',
 'i.uoh.mdh.era115.13047.20221',
 'i.uoh.mdh.era116.13048.20221',
 'i.uoh.mdh.era117.13049.20221',
 'i.uoh.mdh.era120.13052.20221',
 'i.uoh.mdh.era121.13020.20221',
 'i.uoh.mdh.era206.13056.20221',
 'i.uoh.mdh.era209.13057.20221',
 'i.uoh.mdh.era211.23111.20212',
 'i.uoh.mdh.era212.13077.20221',
 'i.uoh.mdh.era213.23113.20212',
 'i.uoh.mdh.era215.13059.20221',
 'i.uoh.mdh.era217.23021.20212',
 'i.uoh.mdh.era218.23108.20212',
 'i.uoh.mdh.era301.13064.20221',
 'i.uoh.mdh.era303.13067.20221',
 'i.uoh.mdh.era305.23114.20212',
 'i.uoh.mdh.era306.23118.20212',
 'i.uoh.mdh.era311.13073.20221',
 'i.uoh.mdh.era312.13079.20221',
 'i.uoh.mdh.era314.23122.20212',
 'i.uoh.mdh.era317.13087.20221',
 'i.uoh.mdh.era318.23106.20212',
 'i.uoh.mdh.era319.23128.20212',
 'i.uoh.mdh.era402.13082.20221',
 'i.uoh.mdh.era403.13089.20221',
 'i.uoh.mdh.fha028.22025.20212',
 'i.uoh.mdh.fha030.12032.20221',
 'i.uoh.mdh.fha031.12053.20221',
 'i.uoh.mdh.fha032.12044.20221',
 'i.uoh.mdh.fha041.22027.20212',
 'i.uoh.mdh.fha060.12035.20221',
 'i.uoh.mdh.fha071.22065.20212',
 'i.uoh.mdh.fha080.22035.20212',
 'i.uoh.mdh.fha081.22022.20212',
 'i.uoh.mdh.fha082.22023.20212',
 'i.uoh.mdh.fha083.12004.20221',
 'i.uoh.mdh.fha084.12006.20221',
 'i.uoh.mdh.fha085.12005.20221',
 'i.uoh.mdh.fha208.22063.20212',
 'i.uoh.mdh.fha210.22024.20212',
 'i.uoh.mdh.fha212.12000.20221',
 'i.uoh.mdh.fla103.24123.20212',
 'i.uoh.mdh.fla212.14105.20221',
 'i.uoh.mdh.fla300.14110.20221',
 'i.uoh.mdh.fla307.14107.20221',
 'i.uoh.mdh.fla307.24144.20212',
 'i.uoh.mdh.fla310.24086.20212',
 'i.uoh.mdh.fla400.24124.20212',
 'i.uoh.mdh.fla432.14108.20221',
 'i.uoh.mdh.fla433.24125.20212',
 'i.uoh.mdh.fla500.14109.20221',
 'i.uoh.mdh.fla500.24158.20212',
 'i.uoh.mdh.foa103.13085.20221',
 'i.uoh.mdh.foa103.23120.20212',
 'i.uoh.mdh.foa106.13076.20221',
 'i.uoh.mdh.foa106.23117.20212',
 'i.uoh.mdh.foa112.13072.20221',
 'i.uoh.mdh.foa114.23104.20212',
 'i.uoh.mdh.foa115.13061.20221',
 'i.uoh.mdh.foa115.23112.20212',
 'i.uoh.mdh.foa138.13065.20221',
 'i.uoh.mdh.foa138.23125.20212',
 'i.uoh.mdh.foa142.23100.20212',
 'i.uoh.mdh.foa143.23096.20212',
 'i.uoh.mdh.foa162.13053.20221',
 'i.uoh.mdh.foa168.23085.20212',
 'i.uoh.mdh.foa170.23080.20212',
 'i.uoh.mdh.foa171.13044.20221',
 'i.uoh.mdh.foa172.23076.20212',
 'i.uoh.mdh.foa173.13097.20221',
 'i.uoh.mdh.foa173.23101.20212',
 'i.uoh.mdh.foa174.23037.20212',
 'i.uoh.mdh.foa175.13095.20221',
 'i.uoh.mdh.foa175.23039.20212',
 'i.uoh.mdh.foa176.13096.20221',
 'i.uoh.mdh.foa176.23075.20212',
 'i.uoh.mdh.foa177.13098.20221',
 'i.uoh.mdh.foa178.13099.20221',
 'i.uoh.mdh.foa178.23040.20212',
 'i.uoh.mdh.foa179.23041.20212',
 'i.uoh.mdh.foa182.13112.20221',
 'i.uoh.mdh.foa183.13100.20221',
 'i.uoh.mdh.foa184.13030.20221',
 'i.uoh.mdh.foa185.23045.20212',
 'i.uoh.mdh.foa186.13116.20221',
 'i.uoh.mdh.foa186.23046.20212',
 'i.uoh.mdh.foa187.13031.20221',
 'i.uoh.mdh.foa188.13032.20221',
 'i.uoh.mdh.foa189.13033.20221',
 'i.uoh.mdh.foa190.23048.20212',
 'i.uoh.mdh.foa191.23051.20212',
 'i.uoh.mdh.foa218.13078.20221',
 'i.uoh.mdh.foa218.23069.20212',
 'i.uoh.mdh.foa220.23065.20212',
 'i.uoh.mdh.foa224.13038.20221',
 'i.uoh.mdh.foa224.23086.20212',
 'i.uoh.mdh.foa231.13035.20221',
 'i.uoh.mdh.foa232.23116.20212',
 'i.uoh.mdh.foa233.23061.20212',
 'i.uoh.mdh.foa234.23059.20212',
 'i.uoh.mdh.foa235.23057.20212',
 'i.uoh.mdh.foa236.23056.20212',
 'i.uoh.mdh.foa237.13034.20221',
 'i.uoh.mdh.foa238.23055.20212',
 'i.uoh.mdh.foa245.13110.20221',
 'i.uoh.mdh.foa247.13102.20221',
 'i.uoh.mdh.foa248.13103.20221',
 'i.uoh.mdh.foa251.23109.20212',
 'i.uoh.mdh.foa252.13069.20221',
 'i.uoh.mdh.foa260.13066.20221',
 'i.uoh.mdh.foa270.13055.20221',
 'i.uoh.mdh.foa310.23103.20212',
 'i.uoh.mdh.foa314.23102.20212',
 'i.uoh.mdh.foa315.23098.20212',
 'i.uoh.mdh.foa323.23090.20212',
 'i.uoh.mdh.foa324.23091.20212',
 'i.uoh.mdh.foa325.13094.20221',
 'i.uoh.mdh.foa327.23095.20212',
 'i.uoh.mdh.foa328.23097.20212',
 'i.uoh.mdh.foa329.23087.20212',
 'i.uoh.mdh.foa330.13104.20221',
 'i.uoh.mdh.foa331.23082.20212',
 'i.uoh.mdh.fya004.21107.20212',
 'i.uoh.mdh.fya007.11090.20221',
 'i.uoh.mdh.fya008.21109.20212',
 'i.uoh.mdh.fya010.11092.20221',
 'i.uoh.mdh.fya014.11081.20221',
 'i.uoh.mdh.fya016.11049.20221',
 'i.uoh.mdh.fys007.12086.20221',
 'i.uoh.mdh.fys007.22005.20212',
 'i.uoh.mdh.fys028.12084.20221',
 'i.uoh.mdh.fys028.22006.20212',
 'i.uoh.mdh.fys029.12087.20221',
 'i.uoh.mdh.fys029.22007.20212',
 'i.uoh.mdh.fys037.12016.20221',
 'i.uoh.mdh.fys039.22055.20212',
 'i.uoh.mdh.fys040.12009.20221',
 'i.uoh.mdh.fys041.12011.20221',
 'i.uoh.mdh.fys043.12043.20221',
 'i.uoh.mdh.fys045.22064.20212',
 'i.uoh.mdh.fys046.22069.20212',
 'i.uoh.mdh.fys048.12012.20221',
 'i.uoh.mdh.fys054.12034.20221',
 'i.uoh.mdh.fys054.22008.20212',
 'i.uoh.mdh.fys055.12099.20221',
 'i.uoh.mdh.fys055.22057.20212',
 'i.uoh.mdh.fys056.12027.20221',
 'i.uoh.mdh.fys056.22058.20212',
 'i.uoh.mdh.fys057.12024.20221',
 'i.uoh.mdh.fys057.22059.20212',
 'i.uoh.mdh.fys060.12057.20221',
 'i.uoh.mdh.fys060.22010.20212',
 'i.uoh.mdh.fys061.12059.20221',
 'i.uoh.mdh.fys061.22011.20212',
 'i.uoh.mdh.fys062.12088.20221',
 'i.uoh.mdh.fys062.22013.20212',
 'i.uoh.mdh.fys063.12089.20221',
 'i.uoh.mdh.fys063.22015.20212',
 'i.uoh.mdh.fys065.12013.20221',
 'i.uoh.mdh.haa104.13054.20221',
 'i.uoh.mdh.haa107.23127.20212',
 'i.uoh.mdh.haa108.23126.20212',
 'i.uoh.mdh.ieo102.23124.20212',
 'i.uoh.mdh.ieo107.13081.20221',
 'i.uoh.mdh.ieo110.13080.20221',
 'i.uoh.mdh.ieo111.13075.20221',
 'i.uoh.mdh.ieo112.23123.20212',
 'i.uoh.mdh.ieo300.13074.20221',
 'i.uoh.mdh.ieo301.23131.20212',
 'i.uoh.mdh.ieo302.13071.20221',
 'i.uoh.mdh.ieo304.23121.20212',
 'i.uoh.mdh.ieo400.13070.20221',
 'i.uoh.mdh.ino106.14058.20221',
 'i.uoh.mdh.ino106.24095.20212',
 'i.uoh.mdh.ino109.14130.20221',
 'i.uoh.mdh.ino109.24006.20212',
 'i.uoh.mdh.ino110.14075.20221',
 'i.uoh.mdh.ino110.24010.20212',
 'i.uoh.mdh.ino111.24008.20212',
 'i.uoh.mdh.ino113.14134.20221',
 'i.uoh.mdh.ino113.24000.20212',
 'i.uoh.mdh.ino115.14135.20221',
 'i.uoh.mdh.ino115.24001.20212',
 'i.uoh.mdh.ino123.24043.20212',
 'i.uoh.mdh.ino125.24045.20212',
 'i.uoh.mdh.ino200.24047.20212',
 'i.uoh.mdh.ino202.14002.20221',
 'i.uoh.mdh.ino212.24002.20212',
 'i.uoh.mdh.ino213.14047.20221',
 'i.uoh.mdh.ino214.24003.20212',
 'i.uoh.mdh.ino239.24005.20212',
 'i.uoh.mdh.ino240.14052.20221',
 'i.uoh.mdh.ino242.14071.20221',
 'i.uoh.mdh.ino332.14018.20221',
 'i.uoh.mdh.ino333.14003.20221',
 'i.uoh.mdh.ino334.14004.20221',
 'i.uoh.mdh.ino337.14027.20221',
 'i.uoh.mdh.ino402.24060.20212',
 'i.uoh.mdh.ino415.24015.20212',
 'i.uoh.mdh.ite113.24061.20212',
 'i.uoh.mdh.ite117.24062.20212',
 'i.uoh.mdh.ite118.14057.20221',
 'i.uoh.mdh.ite119.14062.20221',
 'i.uoh.mdh.ite124.24009.20212',
 'i.uoh.mdh.ite200.24011.20212',
 'i.uoh.mdh.ite207.14010.20221',
 'i.uoh.mdh.ite208.14005.20221',
 'i.uoh.mdh.ite210.14006.20221',
 'i.uoh.mdh.ite224.14008.20221',
 'i.uoh.mdh.ite226.24014.20212',
 'i.uoh.mdh.ite228.14009.20221',
 'i.uoh.mdh.ite231.24064.20212',
 'i.uoh.mdh.ite233.24071.20212',
 'i.uoh.mdh.ite234.14030.20221',
 'i.uoh.mdh.ite235.24066.20212',
 'i.uoh.mdh.ite237.24065.20212',
 'i.uoh.mdh.ite238.24068.20212',
 'i.uoh.mdh.ite239.24067.20212',
 'i.uoh.mdh.ite240.24070.20212',
 'i.uoh.mdh.ite241.14033.20221',
 'i.uoh.mdh.ite242.24073.20212',
 'i.uoh.mdh.ite245.24012.20212',
 'i.uoh.mdh.ite246.24013.20212',
 'i.uoh.mdh.ite247.14007.20221',
 'i.uoh.mdh.ite300.14028.20221',
 'i.uoh.mdh.ite328.24069.20212',
 'i.uoh.mdh.ite329.24117.20212',
 'i.uoh.mdh.ite331.14101.20221',
 'i.uoh.mdh.ite333.24116.20212',
 'i.uoh.mdh.ite334.14064.20221',
 'i.uoh.mdh.ite335.14036.20221',
 'i.uoh.mdh.ite336.14072.20221',
 'i.uoh.mdh.ite337.14099.20221',
 'i.uoh.mdh.ite338.24078.20212',
 'i.uoh.mdh.ite339.24110.20212',
 'i.uoh.mdh.ite340.24118.20212',
 'i.uoh.mdh.ite341.14041.20221',
 'i.uoh.mdh.ite342.14011.20221',
 'i.uoh.mdh.ite343.14012.20221',
 'i.uoh.mdh.ite344.14013.20221',
 'i.uoh.mdh.ite345.14014.20221',
 'i.uoh.mdh.ite400.24072.20212',
 'i.uoh.mdh.ite416.24075.20212',
 'i.uoh.mdh.ite420.14069.20221',
 'i.uoh.mdh.ite423.24114.20212',
 'i.uoh.mdh.ite424.24112.20212',
 'i.uoh.mdh.ite425.14063.20221',
 'i.uoh.mdh.ite426.14015.20221',
 'i.uoh.mdh.ite427.24017.20212',
 'i.uoh.mdh.kit126.14054.20221',
 'i.uoh.mdh.kmi032.21500.20212',
 'i.uoh.mdh.kmi033.11138.20221',
 'i.uoh.mdh.kmi034.21228.20212',
 'i.uoh.mdh.kmi035.21229.20212',
 'i.uoh.mdh.kmi036.21230.20212',
 'i.uoh.mdh.kmi037.21231.20212',
 'i.uoh.mdh.kmi080.21234.20212',
 'i.uoh.mdh.kmi081.21237.20212',
 'i.uoh.mdh.kmi085.11249.20221',
 'i.uoh.mdh.kmi085.21501.20212',
 'i.uoh.mdh.kmi086.11252.20221',
 'i.uoh.mdh.kmi086.21503.20212',
 'i.uoh.mdh.kmi095.11238.20221',
 'i.uoh.mdh.kmi098.21238.20212',
 'i.uoh.mdh.kmi099.21239.20212',
 'i.uoh.mdh.kmi107.11210.20221',
 'i.uoh.mdh.kmi107.21505.20212',
 'i.uoh.mdh.kmi108.11254.20221',
 'i.uoh.mdh.kmi108.21001.20212',
 'i.uoh.mdh.kmi113.11233.20221',
 'i.uoh.mdh.kmi114.11255.20221',
 'i.uoh.mdh.kmi114.21002.20212',
 'i.uoh.mdh.kmi115.11257.20221',
 'i.uoh.mdh.kmi115.21004.20212',
 'i.uoh.mdh.kmi122.11157.20221',
 'i.uoh.mdh.kmi123.11286.20221',
 'i.uoh.mdh.kmi123.21009.20212',
 'i.uoh.mdh.kmi125.21008.20212',
 'i.uoh.mdh.kmi126.11070.20221',
 'i.uoh.mdh.kpp053.24115.20212',
 'i.uoh.mdh.lia000.11050.20221',
 'i.uoh.mdh.lia009.21225.20212',
 'i.uoh.mdh.lia010.21082.20212',
 'i.uoh.mdh.lia011.21235.20212',
 'i.uoh.mdh.lia016.21236.20212',
 'i.uoh.mdh.lia018.11167.20221',
 'i.uoh.mdh.lia019.11168.20221',
 'i.uoh.mdh.lia021.11058.20221',
 'i.uoh.mdh.lia022.11096.20221',
 'i.uoh.mdh.lia027.11278.20221',
 'i.uoh.mdh.lia027.21084.20212',
 'i.uoh.mdh.lia028.11064.20221',
 'i.uoh.mdh.lia029.21085.20212',
 'i.uoh.mdh.lia030.21074.20212',
 'i.uoh.mdh.lia031.21198.20212',
 'i.uoh.mdh.lia032.11302.20221',
 'i.uoh.mdh.lia032.21214.20212',
 'i.uoh.mdh.maa000.11118.20221',
 'i.uoh.mdh.maa014.11125.20221',
 'i.uoh.mdh.maa014.21114.20212',
 'i.uoh.mdh.maa027.21073.20212',
 'i.uoh.mdh.maa029.11290.20221',
 'i.uoh.mdh.maa029.21019.20212',
 'i.uoh.mdh.maa031.11207.20221',
 'i.uoh.mdh.maa033.11003.20221',
 'i.uoh.mdh.maa034.11004.20221',
 'i.uoh.mdh.maa035.11005.20221',
 'i.uoh.mdh.maa035.21018.20212',
 'i.uoh.mdh.maa036.11006.20221',
 'i.uoh.mdh.maa037.11007.20221',
 'i.uoh.mdh.maa037.21247.20212',
 'i.uoh.mdh.maa038.11136.20221',
 'i.uoh.mdh.maa039.21071.20212',
 'i.uoh.mdh.maa040.21086.20212',
 'i.uoh.mdh.maa041.21098.20212',
 'i.uoh.mdh.maa042.11294.20221',
 'i.uoh.mdh.maa042.21099.20212',
 'i.uoh.mdh.maa044.11200.20221',
 'i.uoh.mdh.maa045.11201.20221',
 'i.uoh.mdh.maa046.21100.20212',
 'i.uoh.mdh.maa121.11084.20221',
 'i.uoh.mdh.maa121.21101.20212',
 'i.uoh.mdh.maa133.11085.20221',
 'i.uoh.mdh.maa136.21117.20212',
 'i.uoh.mdh.maa137.11086.20221',
 'i.uoh.mdh.maa137.21121.20212',
 'i.uoh.mdh.maa139.21122.20212',
 'i.uoh.mdh.maa140.11295.20221',
 'i.uoh.mdh.maa140.21128.20212',
 'i.uoh.mdh.maa141.11112.20221',
 'i.uoh.mdh.maa141.21105.20212',
 'i.uoh.mdh.maa142.21133.20212',
 'i.uoh.mdh.maa149.11102.20221',
 'i.uoh.mdh.maa149.21135.20212',
 'i.uoh.mdh.maa150.11103.20221',
 'i.uoh.mdh.maa150.21134.20212',
 'i.uoh.mdh.maa152.11104.20221',
 'i.uoh.mdh.maa152.21137.20212',
 'i.uoh.mdh.maa153.21139.20212',
 'i.uoh.mdh.maa154.21140.20212',
 'i.uoh.mdh.maa155.11105.20221',
 'i.uoh.mdh.maa156.11132.20221',
 'i.uoh.mdh.maa313.11106.20221',
 'i.uoh.mdh.maa315.11108.20221',
 'i.uoh.mdh.maa316.11109.20221',
 'i.uoh.mdh.maa317.21144.20212',
 'i.uoh.mdh.maa318.11134.20221',
 'i.uoh.mdh.maa320.21145.20212',
 'i.uoh.mdh.maa321.21136.20212',
 'i.uoh.mdh.maa323.21191.20212',
 'i.uoh.mdh.maa324.21108.20212',
 'i.uoh.mdh.maa507.11119.20221',
 'i.uoh.mdh.maa512.21115.20212',
 'i.uoh.mdh.maa513.11110.20221',
 'i.uoh.mdh.maa516.21192.20212',
 'i.uoh.mdh.maa517.21118.20212',
 'i.uoh.mdh.maa518.11088.20221',
 'i.uoh.mdh.maa600.11120.20221',
 'i.uoh.mdh.maa700.21153.20212',
 'i.uoh.mdh.maa704.21156.20212',
 'i.uoh.mdh.maa709.11121.20221',
 'i.uoh.mdh.maa711.21157.20212',
 'i.uoh.mdh.mfy006.21111.20212',
 'i.uoh.mdh.mfy007.11082.20221',
 'i.uoh.mdh.mfy010.11083.20221',
 'i.uoh.mdh.mma122.11122.20221',
 'i.uoh.mdh.mma122.21158.20212',
 'i.uoh.mdh.mma130.21159.20212',
 'i.uoh.mdh.mma132.21161.20212',
 'i.uoh.mdh.mma291.11203.20221',
 'i.uoh.mdh.mma291.21163.20212',
 'i.uoh.mdh.mma306.11124.20221',
 'i.uoh.mdh.mma308.11127.20221',
 'i.uoh.mdh.mma500.21170.20212',
 'i.uoh.mdh.mma501.21171.20212',
 'i.uoh.mdh.mma503.11137.20221',
 'i.uoh.mdh.mma701.21175.20212',
 'i.uoh.mdh.mma702.11062.20221',
 'i.uoh.mdh.mma707.21119.20212',
 'i.uoh.mdh.mma708.11126.20221',
 'i.uoh.mdh.mma712.11065.20221',
 'i.uoh.mdh.mma712.21181.20212',
 'i.uoh.mdh.mma713.21021.20212',
 'i.uoh.mdh.mta101.24081.20212',
 'i.uoh.mdh.mta200.14043.20221',
 'i.uoh.mdh.mta201.14129.20221',
 'i.uoh.mdh.mtk105.13060.20221',
 'i.uoh.mdh.mtk202.13068.20221',
 'i.uoh.mdh.mtk203.13050.20221',
 'i.uoh.mdh.mtk321.23107.20212',
 'i.uoh.mdh.mtk323.23073.20212',
 'i.uoh.mdh.mtk326.23072.20212',
 'i.uoh.mdh.mtk328.23070.20212',
 'i.uoh.mdh.mtk329.13041.20221',
 'i.uoh.mdh.mtk330.13045.20221',
 'i.uoh.mdh.mtk332.13039.20221',
 'i.uoh.mdh.mtk337.23064.20212',
 'i.uoh.mdh.mtk339.23063.20212',
 'i.uoh.mdh.mtk340.23062.20212',
 'i.uoh.mdh.mtk345.23132.20212',
 'i.uoh.mdh.mtk347.23130.20212',
 'i.uoh.mdh.naa115.23058.20212',
 'i.uoh.mdh.naa120.23054.20212',
 'i.uoh.mdh.naa122.23053.20212',
 'i.uoh.mdh.naa129.23052.20212',
 'i.uoh.mdh.naa134.23044.20212',
 'i.uoh.mdh.naa135.23043.20212',
 'i.uoh.mdh.naa136.23042.20212',
 'i.uoh.mdh.naa137.13105.20221',
 'i.uoh.mdh.naa138.13106.20221',
 'i.uoh.mdh.naa139.13107.20221',
 'i.uoh.mdh.naa140.13108.20221',
 'i.uoh.mdh.naa207.13029.20221',
 'i.uoh.mdh.naa305.13028.20221',
 'i.uoh.mdh.naa306.13026.20221',
 'i.uoh.mdh.oah104.23031.20212',
 'i.uoh.mdh.oah106.23027.20212',
 'i.uoh.mdh.oah110.23026.20212',
 'i.uoh.mdh.oah111.13113.20221',
 'i.uoh.mdh.oah111.23129.20212',
 'i.uoh.mdh.oah113.13025.20221',
 'i.uoh.mdh.oah306.13023.20221',
 'i.uoh.mdh.oau000.21120.20212',
 'i.uoh.mdh.oau011.11023.20221',
 'i.uoh.mdh.oau013.11029.20221',
 'i.uoh.mdh.oau015.21123.20212',
 'i.uoh.mdh.oau035.11011.20221',
 'i.uoh.mdh.oau053.11303.20221',
 'i.uoh.mdh.oau053.21227.20212',
 'i.uoh.mdh.oau058.11010.20221',
 'i.uoh.mdh.oau071.11097.20221',
 'i.uoh.mdh.oau071.21022.20212',
 'i.uoh.mdh.oau073.21129.20212',
 'i.uoh.mdh.oau074.21124.20212',
 'i.uoh.mdh.oau075.11030.20221',
 'i.uoh.mdh.oau075.21055.20212',
 'i.uoh.mdh.oau076.11009.20221',
 'i.uoh.mdh.oau077.21167.20212',
 'i.uoh.mdh.oau082.11035.20221',
 'i.uoh.mdh.oau082.21141.20212',
 'i.uoh.mdh.oau141.11279.20221',
 'i.uoh.mdh.oau141.21024.20212',
 'i.uoh.mdh.oau142.11117.20221',
 'i.uoh.mdh.oau142.21125.20212',
 'i.uoh.mdh.oau146.21025.20212',
 'i.uoh.mdh.oau155.11193.20221',
 'i.uoh.mdh.oau155.21026.20212',
 'i.uoh.mdh.oau158.21028.20212',
 'i.uoh.mdh.oau170.11015.20221',
 'i.uoh.mdh.oau174.11128.20221',
 'i.uoh.mdh.oau174.21196.20212',
 'i.uoh.mdh.oau177.21200.20212',
 'i.uoh.mdh.oau182.21027.20212',
 'i.uoh.mdh.oau192.11133.20221',
 'i.uoh.mdh.oau194.11016.20221',
 'i.uoh.mdh.oau195.11204.20221',
 'i.uoh.mdh.oau195.21032.20212',
 'i.uoh.mdh.oau197.21154.20212',
 'i.uoh.mdh.oau199.21146.20212',
 'i.uoh.mdh.oau200.11283.20221',
 'i.uoh.mdh.oau200.21033.20212',
 'i.uoh.mdh.oau206.21168.20212',
 'i.uoh.mdh.oau208.11146.20221',
 'i.uoh.mdh.oau210.11017.20221',
 'i.uoh.mdh.oau210.21150.20212',
 'i.uoh.mdh.oau212.11195.20221',
 'i.uoh.mdh.oau212.21155.20212',
 'i.uoh.mdh.oau213.21034.20212',
 'i.uoh.mdh.oau215.11156.20221',
 'i.uoh.mdh.oau218.11165.20221',
 'i.uoh.mdh.oau218.21035.20212',
 'i.uoh.mdh.oau219.11304.20221',
 'i.uoh.mdh.oau219.21240.20212',
 'i.uoh.mdh.oau221.11194.20221',
 'i.uoh.mdh.oau221.21037.20212',
 'i.uoh.mdh.oau224.11024.20221',
 'i.uoh.mdh.oau224.21183.20212',
 'i.uoh.mdh.oau225.21184.20212',
 'i.uoh.mdh.oau228.11018.20221',
 'i.uoh.mdh.oau229.11025.20221',
 'i.uoh.mdh.oau229.21039.20212',
 'i.uoh.mdh.oau235.21041.20212',
 'i.uoh.mdh.oau236.11027.20221',
 'i.uoh.mdh.oau237.21042.20212',
 'i.uoh.mdh.oau238.21043.20212',
 'i.uoh.mdh.oau239.11026.20221',
 'i.uoh.mdh.oau239.21040.20212',
 'i.uoh.mdh.oau240.11042.20221',
 'i.uoh.mdh.oau242.11044.20221',
 'i.uoh.mdh.oau242.21162.20212',
 'i.uoh.mdh.oau243.11045.20221',
 'i.uoh.mdh.oau244.11292.20221',
 'i.uoh.mdh.oau244.21047.20212',
 'i.uoh.mdh.oau245.11047.20221',
 'i.uoh.mdh.oau245.21049.20212',
 'i.uoh.mdh.oau246.11048.20221',
 'i.uoh.mdh.oau246.21053.20212',
 'i.uoh.mdh.oau247.11154.20221',
 'i.uoh.mdh.oau247.21051.20212',
 'i.uoh.mdh.oau249.11031.20221',
 'i.uoh.mdh.oau256.11153.20221',
 'i.uoh.mdh.oau263.21173.20212',
 'i.uoh.mdh.oau264.21176.20212',
 'i.uoh.mdh.oau265.21177.20212',
 'i.uoh.mdh.oau266.11028.20221',
 'i.uoh.mdh.oau267.21029.20212',
 'i.uoh.mdh.oau268.11196.20221',
 'i.uoh.mdh.oau269.11197.20221',
 'i.uoh.mdh.oau269.21248.20212',
 'i.uoh.mdh.oau270.11198.20221',
 'i.uoh.mdh.oau271.21179.20212',
 'i.uoh.mdh.oau272.21186.20212',
 'i.uoh.mdh.oau273.11129.20221',
 'i.uoh.mdh.oau273.21245.20212',
 'i.uoh.mdh.oau274.11212.20221',
 'i.uoh.mdh.oau275.11141.20221',
 'i.uoh.mdh.oau276.11144.20221',
 'i.uoh.mdh.oau277.21190.20212',
 'i.uoh.mdh.oau279.21193.20212',
 'i.uoh.mdh.oau280.11149.20221',
 'i.uoh.mdh.oau281.11145.20221',
 'i.uoh.mdh.oau282.11296.20221',
 'i.uoh.mdh.oau282.21194.20212',
 'i.uoh.mdh.oau283.21197.20212',
 'i.uoh.mdh.oau284.11301.20221',
 'i.uoh.mdh.oau284.21213.20212',
 'i.uoh.mdh.oav001.22060.20212',
 'i.uoh.mdh.oav002.22072.20212',
 'i.uoh.mdh.oav003.22061.20212',
 'i.uoh.mdh.oav005.12031.20221',
 'i.uoh.mdh.oav006.22066.20212',
 'i.uoh.mdh.oav007.22067.20212',
 'i.uoh.mdh.pea000.11169.20221',
 'i.uoh.mdh.pea039.11236.20221',
 'i.uoh.mdh.pea039.21243.20212',
 'i.uoh.mdh.pea044.11235.20221',
 'i.uoh.mdh.pea044.21242.20212',
 'i.uoh.mdh.pea046.21020.20212',
 'i.uoh.mdh.pea082.11130.20221',
 'i.uoh.mdh.pea082.21203.20212',
 'i.uoh.mdh.pea083.11176.20221',
 'i.uoh.mdh.pea083.21054.20212',
 'i.uoh.mdh.pea088.11032.20221',
 'i.uoh.mdh.pea088.21205.20212',
 'i.uoh.mdh.pea091.11298.20221',
 'i.uoh.mdh.pea091.21206.20212',
 'i.uoh.mdh.pea092.21127.20212',
 'i.uoh.mdh.pea093.11152.20221',
 'i.uoh.mdh.pea093.21211.20212',
 'i.uoh.mdh.pea097.11299.20221',
 'i.uoh.mdh.pea097.21207.20212',
 'i.uoh.mdh.pea098.11033.20221',
 'i.uoh.mdh.pea098.21152.20212',
 'i.uoh.mdh.pea101.11066.20221',
 'i.uoh.mdh.pea101.21087.20212',
 'i.uoh.mdh.pea102.11239.20221',
 'i.uoh.mdh.pea102.21147.20212',
 'i.uoh.mdh.pea124.11174.20221',
 'i.uoh.mdh.pea124.21220.20212',
 'i.uoh.mdh.pea163.11293.20221',
 'i.uoh.mdh.pea163.21088.20212',
 'i.uoh.mdh.pea189.11205.20221',
 'i.uoh.mdh.pea190.21056.20212',
 'i.uoh.mdh.pea378.11277.20221',
 'i.uoh.mdh.pea378.21060.20212',
 'i.uoh.mdh.ppu210.24088.20212',
 'i.uoh.mdh.ppu214.24018.20212',
 'i.uoh.mdh.ppu215.24019.20212',
 'i.uoh.mdh.ppu216.14016.20221',
 'i.uoh.mdh.ppu217.14017.20221',
 'i.uoh.mdh.ppu300.14050.20221',
 'i.uoh.mdh.ppu305.14102.20221',
 'i.uoh.mdh.ppu307.14104.20221',
 'i.uoh.mdh.ppu309.24090.20212',
 'i.uoh.mdh.ppu407.14065.20221',
 'i.uoh.mdh.ppu409.24104.20212',
 'i.uoh.mdh.ppu410.14067.20221',
 'i.uoh.mdh.ppu414.24089.20212',
 'i.uoh.mdh.ppu415.24105.20212',
 'i.uoh.mdh.ppu416.24094.20212',
 'i.uoh.mdh.ppu417.24099.20212',
 'i.uoh.mdh.ppu418.24101.20212',
 'i.uoh.mdh.ppu419.24108.20212',
 'i.uoh.mdh.ppu420.24109.20212',
 'i.uoh.mdh.ppu421.14074.20221',
 'i.uoh.mdh.ppu422.14076.20221',
 'i.uoh.mdh.ppu424.24120.20212',
 'i.uoh.mdh.ppu425.14089.20221',
 'i.uoh.mdh.ppu426.24127.20212',
 'i.uoh.mdh.ppu432.24131.20212',
 'i.uoh.mdh.ppu436.14070.20221',
 'i.uoh.mdh.ppu438.24130.20212',
 'i.uoh.mdh.ppu439.24132.20212',
 'i.uoh.mdh.ppu442.24020.20212',
 'i.uoh.mdh.ppu445.14020.20221',
 'i.uoh.mdh.ppu446.24023.20212',
 'i.uoh.mdh.ppu447.14021.20221',
 'i.uoh.mdh.ppu448.14022.20221',
 'i.uoh.mdh.ppu456.14023.20221',
 'i.uoh.mdh.ppu457.24025.20212',
 'i.uoh.mdh.ppu500.14024.20221',
 'i.uoh.mdh.ppu502.14127.20221',
 'i.uoh.mdh.ppu503.14113.20221',
 'i.uoh.mdh.psa101.12076.20221',
 'i.uoh.mdh.psa101.22044.20212',
 'i.uoh.mdh.psa104.12074.20221',
 'i.uoh.mdh.psa104.22003.20212',
 'i.uoh.mdh.psa110.22045.20212',
 'i.uoh.mdh.psa111.12045.20221',
 'i.uoh.mdh.psa111.22000.20212',
 'i.uoh.mdh.psa116.12036.20221',
 'i.uoh.mdh.psa116.22046.20212',
 'i.uoh.mdh.psa118.12078.20221',
 'i.uoh.mdh.psa118.22017.20212',
 'i.uoh.mdh.psa119.12067.20221',
 'i.uoh.mdh.psa119.22047.20212',
 'i.uoh.mdh.psa122.12010.20221',
 'i.uoh.mdh.psa122.22014.20212',
 'i.uoh.mdh.psa123.22009.20212',
 'i.uoh.mdh.psa124.12003.20221',
 'i.uoh.mdh.psa125.12046.20221',
 'i.uoh.mdh.psa309.22071.20212',
 'i.uoh.mdh.psa311.22083.20212',
 'i.uoh.mdh.psa312.12039.20221',
 'i.uoh.mdh.psa312.22073.20212',
 'i.uoh.mdh.psa313.12019.20221',
 'i.uoh.mdh.saa041.22036.20212',
 'i.uoh.mdh.saa042.22037.20212',
 'i.uoh.mdh.saa043.12021.20221',
 'i.uoh.mdh.saa044.22074.20212',
 'i.uoh.mdh.saa045.22075.20212',
 'i.uoh.mdh.saa055.12048.20221',
 'i.uoh.mdh.saa055.22018.20212',
 'i.uoh.mdh.saa056.12047.20221',
 'i.uoh.mdh.saa056.22019.20212',
 'i.uoh.mdh.saa076.12079.20221',
 'i.uoh.mdh.saa076.22020.20212',
 'i.uoh.mdh.saa078.12090.20221',
 'i.uoh.mdh.saa078.22026.20212',
 'i.uoh.mdh.saa079.12091.20221',
 'i.uoh.mdh.saa079.22028.20212',
 'i.uoh.mdh.saa081.12092.20221',
 'i.uoh.mdh.saa081.22029.20212',
 'i.uoh.mdh.saa082.12093.20221',
 'i.uoh.mdh.saa082.22030.20212',
 'i.uoh.mdh.saa083.12094.20221',
 'i.uoh.mdh.saa083.22031.20212',
 'i.uoh.mdh.saa084.12095.20221',
 'i.uoh.mdh.saa084.22032.20212',
 'i.uoh.mdh.saa088.12096.20221',
 'i.uoh.mdh.saa088.22033.20212',
 'i.uoh.mdh.saa089.12097.20221',
 'i.uoh.mdh.saa089.22034.20212',
 'i.uoh.mdh.saa090.22084.20212',
 'i.uoh.mdh.ska121.23099.20212',
 'i.uoh.mdh.ska125.13021.20221',
 'i.uoh.mdh.ska126.23020.20212',
 'i.uoh.mdh.ska127.23017.20212',
 'i.uoh.mdh.ska128.23016.20212',
 'i.uoh.mdh.ska130.23013.20212',
 'i.uoh.mdh.ska131.23012.20212',
 'i.uoh.mdh.ska132.23011.20212',
 'i.uoh.mdh.ska133.23010.20212',
 'i.uoh.mdh.ska135.23009.20212',
 'i.uoh.mdh.ska205.13019.20221',
 'i.uoh.mdh.ska206.13018.20221',
 'i.uoh.mdh.ska207.13017.20221',
 'i.uoh.mdh.ska208.23008.20212',
 'i.uoh.mdh.ska300.23115.20212',
 'i.uoh.mdh.ska301.23110.20212',
 'i.uoh.mdh.soa121.12040.20221',
 'i.uoh.mdh.soa121.22021.20212',
 'i.uoh.mdh.soa133.22038.20212',
 'i.uoh.mdh.soa134.12065.20221',
 'i.uoh.mdh.soa134.22012.20212',
 'i.uoh.mdh.soa135.12020.20221',
 'i.uoh.mdh.soa135.22016.20212',
 'i.uoh.mdh.soa138.12042.20221',
 'i.uoh.mdh.soa138.22001.20212',
 'i.uoh.mdh.soa142.22039.20212',
 'i.uoh.mdh.soa209.22002.20212',
 'i.uoh.mdh.soa408.12038.20221',
 'i.uoh.mdh.soa409.22077.20212',
 'i.uoh.mdh.sps102.12029.20221',
 'i.uoh.mdh.sps114.22040.20212',
 'i.uoh.mdh.sqa000.11034.20221',
 'i.uoh.mdh.sqa064.11178.20221',
 'i.uoh.mdh.sqa068.11179.20221',
 'i.uoh.mdh.sqa101.21065.20212',
 'i.uoh.mdh.sqa102.11180.20221',
 'i.uoh.mdh.sqa109.21208.20212',
 'i.uoh.mdh.sqa115.21209.20212',
 'i.uoh.mdh.sqa116.21210.20212',
 'i.uoh.mdh.sqa117.21215.20212',
 'i.uoh.mdh.sqa118.11181.20221',
 'i.uoh.mdh.sqa119.21219.20212',
 'i.uoh.mdh.sqa120.11183.20221',
 'i.uoh.mdh.sqa122.11184.20221',
 'i.uoh.mdh.sqa123.11185.20221',
 'i.uoh.mdh.sqa126.11186.20221',
 'i.uoh.mdh.sqa127.21221.20212',
 'i.uoh.mdh.sqa128.11160.20221',
 'i.uoh.mdh.sqa129.21216.20212',
 'i.uoh.mdh.sqa130.11161.20221',
 'i.uoh.mdh.sqa131.21218.20212',
 'i.uoh.mdh.sqa132.11162.20221',
 'i.uoh.mdh.sqa133.11163.20221',
 'i.uoh.mdh.sqa134.21217.20212',
 'i.uoh.mdh.sqa135.11190.20221',
 'i.uoh.mdh.sqa136.11191.20221',
 'i.uoh.mdh.sqa137.11192.20221',
 'i.uoh.mdh.sqa140.21222.20212',
 'i.uoh.mdh.sqa141.21223.20212',
 'i.uoh.mdh.ssa002.11067.20221',
 'i.uoh.mdh.ssa006.11068.20221',
 'i.uoh.mdh.ssa007.11147.20221',
 'i.uoh.mdh.ssa008.21078.20212',
 'i.uoh.mdh.ssa009.21030.20212',
 'i.uoh.mdh.ssa219.11069.20221',
 'i.uoh.mdh.ssa219.21089.20212',
 'i.uoh.mdh.ssa220.21097.20212',
 'i.uoh.mdh.ssa223.11098.20221',
 'i.uoh.mdh.ssa223.21166.20212',
 'i.uoh.mdh.ssa225.11100.20221',
 'i.uoh.mdh.ssa228.21169.20212',
 'i.uoh.mdh.ssa233.21172.20212',
 'i.uoh.mdh.ssa234.21174.20212',
 'i.uoh.mdh.ssa236.11187.20221',
 'i.uoh.mdh.ssa238.11188.20221',
 'i.uoh.mdh.ssa240.21178.20212',
 'i.uoh.mdh.ssa243.11113.20221',
 'i.uoh.mdh.ssa243.21095.20212',
 'i.uoh.mdh.ssa244.21180.20212',
 'i.uoh.mdh.ssa245.21182.20212',
 'i.uoh.mdh.ssa246.11071.20221',
 'i.uoh.mdh.ssa246.21091.20212',
 'i.uoh.mdh.ssa248.11115.20221',
 'i.uoh.mdh.ssa249.11189.20221',
 'i.uoh.mdh.ssa250.21090.20212',
 'i.uoh.mdh.sta103.13016.20221',
 'i.uoh.mdh.sta105.13015.20221',
 'i.uoh.mdh.sta106.13014.20221',
 'i.uoh.mdh.sva000.21038.20212',
 'i.uoh.mdh.sva014.21092.20212',
 'i.uoh.mdh.sva015.21093.20212',
 'i.uoh.mdh.sva017.21094.20212',
 'i.uoh.mdh.sva022.11073.20221',
 'i.uoh.mdh.sva022.21224.20212',
 'i.uoh.mdh.sva023.11199.20221',
 'i.uoh.mdh.sva024.11074.20221',
 'i.uoh.mdh.sva031.11075.20221',
 'i.uoh.mdh.sva034.11037.20221',
 'i.uoh.mdh.sva035.11177.20221',
 'i.uoh.mdh.sva036.11077.20221',
 'i.uoh.mdh.sva037.11080.20221',
 'i.uoh.mdh.sva039.11089.20221',
 'i.uoh.mdh.sva040.11036.20221',
 'i.uoh.mdh.sva040.21226.20212',
 'i.uoh.mdh.sva041.11039.20221',
 'i.uoh.mdh.sva042.11040.20221',
 'i.uoh.mdh.sva042.21249.20212',
 'i.uoh.mdh.sva044.11206.20221',
 'i.uoh.mdh.sva045.21036.20212',
 'i.uoh.mdh.sva046.11300.20221',
 'i.uoh.mdh.sva046.21212.20212',
 'i.uoh.mdh.sva049.21244.20212',
 'i.uoh.mdh.sva108.21103.20212',
 'i.uoh.mdh.sva301.21102.20212',
 'i.uoh.mdh.sva303.11076.20221',
 'i.uoh.mdh.sva304.11079.20221',
 'i.uoh.mdh.sva412.11107.20221',
 'i.uoh.mdh.vaa006.12098.20221',
 'i.uoh.mdh.vaa006.22041.20212',
 'i.uoh.mdh.vae014.22062.20212',
 'i.uoh.mdh.vae021.12033.20221',
 'i.uoh.mdh.vae057.22042.20212',
 'i.uoh.mdh.vae074.12025.20221',
 'i.uoh.mdh.vae096.12041.20221',
 'i.uoh.mdh.vae097.22043.20212',
 'i.uoh.mdh.vae209.12015.20221',
 'i.uoh.mdh.vae227.12017.20221',
 'i.uoh.mdh.vae232.12001.20221',
 'i.uoh.mdh.vae246.22079.20212',
 'i.uoh.mdh.vae257.12028.20221',
 'i.uoh.mdh.vae258.22080.20212',
 'i.uoh.mdh.vae259.22081.20212',
 'i.uoh.mdh.vae260.22082.20212']