{"exclude": true, "education_headline": "Maskinutbildning Grävmaskin START VARJE VECKA", "education_text":  "Utbildningen riktar sig till dig som vill lära dig att köra grävmaskin och arbeta med maskinen så som att gräva kabelschakt, planera ut schaktmassor, göra återställningar och köra maskinen på ett tryggt och säkert sätt. Du får lära dig om arbetsmiljö, säkerhet, riskbedömning, daglig tillsyn, manövrering, och anläggning. Utbildningen ger dig grundliga kunskaper för att köra grävmaskin \n\nEfter avslutad kurs och godkänd utbildning utfärdas Jtech utbildningsintyg. Har du kunskaper sedan tidigare kan kursen bli kortare då kan det bli validering på maskinutbildningen. Alltså ett kunskapsprov avges samt en uppkörning.\n\nJtech utfärdar utbildningsbevis efter godkänd och avslutad kurs. Jtech tillhandahåller med grundläggande kunskapsutbildning på olika maskinslag. Efter godkänd och avslutad kurs har kursdeltagaren grundläggande kunskaper i maskinutbildningen för att framföra maskinen på ett tryggt och säkert sätt. För just det maskinslaget som kursdeltagare har genomgått. Och på detta sätt har kursdeltagaren grundliga kunskaper för att utvecklas som maskinförare.", "expected_occupations":  [{"occupation_label": "Grävmaskinförare"}, {"occupation_label": "Hjullastarförare, godshantering"},{"occupation_label": "Hjullastarförare, godshantering"},{"occupation_label": "Bygg- och anläggningsförare"},{"occupation_label": "Liftdumper- och lastväxlarförare"},{"occupation_label": "Lastmaskinförare"},{"occupation_label": "Traktorförare, industri"},{"occupation_label": "Traktormekaniker"}]}
{"exclude": false, "education_headline": "Paketutbildning Grävmaskin & Hjullastare", "education_text":  "Information Grävmaskin. Utbildningen riktar sig till dig som vill lära dig att köra grävmaskin och arbeta med maskinen så som att gräva kabelschakt, planera ut schaktmassor, göra återställningar och köra maskinen på ett tryggt och säkert sätt.\n\nDu får  lära dig om arbetsmiljö, säkerhet, riskbedömning, daglig tillsyn, manövrering, och anläggning. \n\nUtbildningen ger dig grundliga kunskaper för att köra grävmaskin\n\nInformation Hjullastare\n\nKursen riktar sig till dig som vill lyfta samt lasta eller lossa med hjullastare och använda maskinen i ditt dagliga arbete. Köra fyllnadsmassor och planera massor.\n\nDu får lära dig att köra maskinen på ett säkert och tryggt sätt samt lära dig teori och risker med maskinen.\n\nJtech utfärdar utbildningsbevis efter godkänd och avslutad kurs. Jtech tillhandahåller med grundläggande kunskapsutbildning på olika maskinslag. Efter godkänd och avslutad kurs har kursdeltagaren grundläggande kunskaper i maskinutbildningen för att framföra maskinen på ett tryggt och säkert sätt. För just det maskinslaget som kursdeltagare har genomgått. Och på detta sätt har kursdeltagaren grundliga kunskaper för att utvecklas som maskinförare.", "expected_occupations": [{"occupation_label": "Grävmaskinförare"},{"occupation_label": "Väg- och anläggningsarbetare"},{"occupation_label": "Hjullastarförare, godshantering"},{"occupation_label": "Bygg- och anläggningsförare"},{"occupation_label": "Lastmaskinförare"},{"occupation_label": "Grovarbetare, bygg och anläggning"},{"occupation_label": "Drift- och vägunderhållsarbetare"},{"occupation_label": "Maskinförare, lantbruk/Traktorförare, lantbruk"},{"occupation_label": "Liftdumper- och lastväxlarförare"},{"occupation_label": "Kranbilsförare"}]}
{"exclude": false, "education_headline": "Programmerare - Grundläggande programmering", "education_text":  "I denna kursen kommer du få lära dig grunderna som krävs för att kunna utveckla spel, webbsidor eller appar. Vi går igenom C#, som bland annat används i Spelmotorn Unity, men också html, css och Javascript, som används för att bygga webbsidor.  När du är klar med kursen kommer du kunna grunderna som krävs för att bygga enkla webbapplikationer och kan enkelt utbilda dig vidare genom exempelvis praktik eller eget arbete. När ni gjort klart utbildningen kommer ni ha alla kunskaper som krävs för att bygga enkla webbapplikationer. Efter genomförd utbildning kommer du få ökad kunskap om och även kunna praktisera:  Grundläggande programmering i C# Variabler If-satser Villkor Loopar Input & Output Kodstruktur & kommentare Grundläggande webbutveckling HTML CSS Javascript Fördjupning i programmering i C# Funktioner Objekt & klasser Listor Felsökning & debugging Felhantering Webbutveckling med C# Projekttypen MVC Kombinera HTML, CSS & Javascript Databaser MongoDB Spara, hämta, och visa data från användare", "expected_occupations":  [{"occupation_label": "Systemutvecklare/Programmerare"},{"occupation_label": "Civilingenjör, systemutveckling"},{"occupation_label": "Programmerare, webbspel"},{"occupation_label": "Mjukvaruutvecklare"},{"occupation_label": "Applikationsutvecklare/Apputvecklare"},{"occupation_label": "Frontend-utvecklare"},{"occupation_label": "Backend-utvecklare"}]}
{"exclude": false, "education_headline": "Första hjälpen och Hjärt-lungräddning på Barn", "education_text":  "Vad gör du om ett barn plötsligt sätter i halsen och inte kan andas? Eller ramlar i trappan och blir medvetslöst? Kursen ger dig grundläggande kunskaper i första hjälpen till barn, inklusive hjärt-lungräddning, och kunskap om hur du kan förebygga barnolycksfall. Förebygga olycksfall L-ABC (Livsfarligt läge, Andning, Blödning och Cirkulationssvikt) Kontroll av livstecken Medvetslöshet – stabilt sidoläge Larma Utföra hjärt-lungräddning Åtgärder vid luftvägsstopp Stoppa blödning Förebygga cirkulationssvikt Organisera och handla på en olycksplats Grunder i psykologisk första hjälp Första hjälpen vid sår- och brännskador Första hjälpen vid förgiftningar.", "expected_occupations":  [{"occupation_label": "Badmästare/Badbevakare/Badvakt/Simhallsvakt/Strandvakt"},{"occupation_label": "Företagssjuksköterska/Företagssköterska"},{"occupation_label": "Badvaktmästare"},{"occupation_label": "Friskvårdsledare"},{"occupation_label": "Brandman"},{"occupation_label": "Badmästare"},{"occupation_label": "Badbevakare"}]}
{"exclude": false, "education_headline": "Intensiv projektledarutbildning", "education_text":  "Känner du ibland en osäkerhet då du ska arbeta i projekt? Följande scenarier är inte helt ovanligt:  Din närmsta chef kommer in i ditt rum och berättar att ni har fått ett projekt och att du ska vara projektledare. Detta är ett väldigt viktigt projekt och du får inte misslyckas. Det ska vara klart om tre månader och du ska leverera enligt kontaktet du får av din chef.   Följande frågeställning är ganska vanliga:  Vad gör jag nu? Tre månader är ju ganska snart och det är påsk med tillhörande ledighet Hur startar jag projektet? Vilka är mina medarbetare och vad ska vi leverera? Hur ska jag angripa denna arbetsuppgift? Under utbildningen ger Ledar & Projekthantering Sverige dig svaren på alla dessa och många andra frågor. Du kommer att lära dig att hantera alla tänkbara situationer som uppstår.", "expected_occupations":  [{"occupation_label": "Projektledare, IT"}, {"occupation_label": "Projektledare: kultur, media, film"}, {"occupation_label": "Projektledare, bygg och anläggning"}, {"occupation_label": "Projektledare, reklam"}, {"occupation_label": "Projekteringsingenjör, maskin"}, {"occupation_label": "Byggledare"}, {"occupation_label": "Projekteringsingenjör, elkraft"}, {"occupation_label": "Exploateringsingenjör"}, {"occupation_label": "Civilingenjör, anläggning, elkraft"}, {"occupation_label": "Arbetsledare, VVS"}]}
{"exclude": false, "education_headline": "Utveckling av Grupp och Ledare", "education_text":  "Kursens övergripande syfte är att deltagarna ska kunna bli effektivare som ledare och som medarbetare. UGL bygger på upplevelsebaserad inlärning där kursdeltagarna går igenom en följd av enskilda och gemensamma uppgifter. Efter genomförandet av uppgifterna sker reflektion av upplevelserna och dessa diskuteras tillsammans i gruppen. UGL syftar till att ge reflektionsverktyg för hur du själv påverkas av och påverkar andra i en arbetssituation samt hur en grupp mognar och utvecklas, vad som händer i gruppen under utvecklingens gång och vad som främjar respektive hämmar en positiv utveckling. Kursen handlar även om ledarskapets möjligheter och problematik relaterat till gruppens mognadsutveckling. Vad är det som underlättar respektive försvårar uppgiftens lösande och gruppens utveckling ur ett ledarperspektiv? Under kursen sker detta genom att du själv får uppleva situationer som speglar gruppdynamik för att förstå din egna roll. Målsättning/kursinnehåll. Arbeta med reflektion och lärande enskilt och i grupp. Hantera och förstå konflikter\nKunna kommunicera direkt och klart. Förstå känslors inverkan på individ- som gruppnivå. Kunna ta och ge utvecklande feedback. Förstå hur värderingar påverkar relationer och ledarskap. Kunna urskilja olika stadier i en grupps utveckling och det egna förhållningssättet relaterat till dessa. Förstå att det finns behov av olika ledarstilar", "expected_occupations":  [{"occupation_label": "Förskollärare"},{"occupation_label": "Grundlärare, 4-6"},{"occupation_label": "Grundlärare, förskoleklass och 1-3"},{"occupation_label": "Ämneslärare, 7-9"},{"occupation_label": "Grundlärare, fritidshem"},{"occupation_label": "Familjebehandlare/Familjepedagog"},{"occupation_label": "Enhetschef inom socialtjänst"},{"occupation_label": "Socialsekreterare"},{"occupation_label": "Specialpedagog"},{"occupation_label": "Barnskötare"}]}
{"exclude": false, "education_headline": "Elsäkerhet i industrianläggningar", "education_text":  "En elektriskt driven maskin ska vara utformad, konstruerad och utrustad på ett sådant sätt att alla risker på grund av elektricitet undviks eller kan undvikas. Den vanligaste elektriska risken är elchock. Elektrisk ström kan leda till brännskador och skador på nerv- och muskelsystemet som inte går att bota. Dessutom kan bränder uppstå genom överbelastning, ljusbågar eller statiska urladdningar. De som tillverkar, importerar, exporterar eller använder industrimaskiner och kopplingsanläggningar och är ansvariga för säkerheten kring dem måste kontrollera dem enligt EN IEC 60204.  Syftet med utbildningen är att förmedla grunderna i elsäkerhet för maskiner och anläggningar till deltagarna. Kraven i standarden EN IEC 60204 för maskiners elsäkerhet presenteras. Du lär dig vilka krav som måste beaktas vid utformning, konstruktion eller underhåll av elektrisk, elektronisk och programmerbar elektronisk utrustning och system i maskiner. Översikt över de elektriska standarderna för säker konstruktion av maskiner och anläggningar krav på elinstallationer elektriska risker/åtgärder för att skydda mot elektriska stötar beprövade kopplingsexempel krav på operatörsgränssnitt med maskinstyrningsutrustning och -anordningar krav på placering och montering av styrenheter validering och verifiering", "expected_occupations": [{"occupation_label": "Industrielektriker"},{"occupation_label": "Elkrafttekniker/Distributionstekniker"},{"occupation_label": "Ledande montör, el"},{"occupation_label": "Stationsmontör, elkraft/Stationstekniker, elkraft"},{"occupation_label": "Elkonstruktör"},{"occupation_label": "Elmontör"},{"occupation_label": "Arbetsledare, elkraft"},{"occupation_label": "Instrumentelektriker/Instrumenttekniker"},{"occupation_label": "Elkraftingenjör"},{"occupation_label": "Installationselektriker"}]}
{"exclude": false, "education_headline": "Chef i äldreomsorgen\n", "education_text":  "Chefsutbildning med fokus på kommunal vård och omsorg för äldre. \n\nVid Uppsala universitet har vi inom ramen för Äldreomsorgslyftet utvecklat en utbildning för dig som är chef inom vård- och omsorgsförvaltningen. \n\nSärskilt fokus sätts på rollen som chef i en politiskt styrd organisation, på strategier för och effekter av styrning och kontroll, samt hantering av verksamhetsförändring i syfte att utveckla chefs- och ledarskap.\n\nAnpassa till den egna organisationen\nUpplägget främjar anpassning till den egna verksamheten då deltagarnas individuella uppgifter tas fram i dialog mellan deltagarna och deras närmaste chefer. Dessa chefer medverkar också i ett avslutande, framåtriktat seminarium.\n\nVidare ges möjlighet för förvaltningschef eller liknande att inleda programmet med ett anförande samt för andra nyckelpersoner inom verksamheten att medverka vid föreläsningar.", "expected_occupations": [{"occupation_label": "Verksamhetschef, hälso- och sjukvård"}, {"occupation_label": "Äldreomsorgschef"}, {"occupation_label": "Områdeschef, äldre- och handikappomsorg"}, {"occupation_label": "Föreståndare, äldreboende"}, {"occupation_label": "Enhetschef inom social omsorg"}, {"occupation_label": "Avdelningschef, kommun"}, {"occupation_label": "Enhetschef, hemtjänst/Områdeschef, hemtjänst"}, {"occupation_label": "Enhetschef, hälso- och sjukvård"}]}
{"exclude": false, "education_headline": "Byggprojektledning", "education_text":  "Vill du utveckla dig som projektledare?  Då är SBRs kursprogram för Byggprojektledare något för dig. Utbildningen kommer innehålla 4 fristående kursblock där samtliga block pågår under 4 dagar i sträck. De olika kursblocken är uppdelade i behörighetsområdena Projektutveckling,  Projektering, Produktion samt ett fördjupningsblock inom Byggprojektledning, detta block sträcker sig över samtliga delar av projektet.  Blocket med inriktning Byggprojektledning, hela byggprocessen (4 dagar):Ledarskap, initiering hela byggprocessen, styrning, planering, ekonomi, myndighet och planprocessen, genomförande, avslut samt juridik.", "expected_occupations": [{"occupation_label": "Projektledare, bygg och anläggning"}, {"occupation_label": "Byggledare"}, {"occupation_label": "Exploateringsingenjör"}]}
{"exclude": false, "education_headline": "Microsoft Project online", "education_text":  "Microsoft Project Online  Microsoft Project är det självklara valet när Du ska administrera ett projekt och kommunicera dess innehåll till olika personer i organisationen!  Programmet är lättlärt, lättanpassat och oerhört kraftfullt för allt från tidsplanering och resurshantering till uppföljning av projektet. Genom aktivt arbete i Microsoft Project kommer din projektinformation aldrig vara längre bort än ett par knapptryckningar!  När du väl vant dig vid att använda Microsoft Project kommer du undra hur du klarade dig tidigare!”Syfte  Utbildningen genomförs online.  Syftet Syftet med kursen är att deltagarna ska få en bra start i det marknadsledande projektplaneringsprogrammet MS Project (version  2010, 2013,2016)  För att effektivt driva ett projekt krävs ett kraftfullt projektplaneringsverktyg som frigör tid från medarbetarna som istället kan fokusera på projektets framdrift.   Microsoft Project är näst intill branschstandard för projektplanering och erbjuder kraftfulla verktyg för att planera, presentera och följa upp typer av projekt.   Utbildningsmetod Utbildningen genomförs som en föreläsning där utbildaren, Thomas Josefson, går igenom momenten via OH-kanon och deltagarna följer med på egna datorer. Därigenom har deltagarna möjlighet att ställa frågor på aktuella moment och testa dem i prakiken. Microsoft Project - en dag Introduktion till projektplanering med MS Project Programmiljön Hjälpfunktioner Skapa aktivitetslista Organisera aktiviteter Länka samman aktiviteter Tidssätta aktiviteter Ange milstolpar Återkommande aktiviteter Ange milstolpar Återkommande aktiviteter Resurslistor Allokera resurser Skapa originalplan Ange resurs- och aktivitetsinformation Arbeta med projektuppföljning Skapa resurspool Länka samman information till samlingsprojekt Genomföra resursutjämning Följa upp tid och kostnader i projektet Skapa anpassade tabeller Skapa egna filter Skapa anpassade vyer Grafiskt anpassa GANTT-scheman Använda rapporter Anpassa kalender och tidsaxel Arbeta med villorade aktiviteter", "expected_occupations": [{"occupation_label": "Projekteringsingenjör, maskin"}, {"occupation_label": "Projekteringsingenjör, bygg och anläggning"}, {"occupation_label": "Planeringschef"}, {"occupation_label": "Projektledare, IT"}, {"occupation_label": "Administrativ assistent"}, {"occupation_label": "Projektledare, bygg och anläggning"}, {"occupation_label": "Produktionsingenjör, maskin"}, {"occupation_label": "Entreprenadingenjör"}, {"occupation_label": "Fordonsingenjör"}, {"occupation_label": "Produktionsingenjör, elektronik"}]}
{"exclude": false, "education_headline": "Certifierad ekonomiassistent", "education_text":  "Läs distansutbildningen Certifierad ekonomiassistent! Med allt hårdare konkurrens och ökat fokus på lönsamhet, mer eller mindre oavsett bransch, har kraven på ekonomiarbetet ökat. Det handlar om att optimera lönsamheten genom att veta var man tjänar mer/mindre i verksamheten eller tex. mer korrekta kalkyler och bevakning av nyckeltal. Genom denna kurs får du både förståelse för denna del av ekonomiarbetet och kommer lära dig hur det ska gå till. Kopplingen mellan verksamhet och ekonomi På i princip alla företag har man personer som är duktiga på det som företaget gör men mer sällan har man förståelsen för kopplingen mellan verksamheten och ekonomin, hur ska vi fördela ut kostnaderna på leveranserna så vi verkligen vet lönsamheten i varje affär, vad är det som gör en affär mer lönsam än en annan och förändringen vi gjorde i verksamheten, hur mäter vi om det blev en förbättring ekonomiskt?  Oavsett vad du vill arbeta med så är konkurrensen hård och många är duktiga på företagets produkt, oavsett vad produkten är. Det råder dock ofta brist på personer som både kan produkten och förstår ekonomin i ett företag inklusive hur man upprättar/läser olika ekonomiska underlag. Så både om du vill arbeta renodlat med ekonomin i företaget eller du vill vara en nyttigare medarbetare som bättre utvecklar företaget i riktning mot ökad lönsamhet så är detta den utbildning du behöver.  Ekonomi behöver inte vara svårt Vad många upptäcker är att ekonomi inte alls är så svårt när man väl får hjälp med att förstå vad det handlar om, och det är en väldigt rolig del av ett företags sysslor. Utbildningen till Certifierad ekonomiassistent är en utbildning som tar upp allt från tänket bakom företagande och hur bokföringen fungerar till hur man ökar lönsamheten genom korrekta kalkyler och förståelse för olika nyckeltal. Kursen består av 7 lektioner som täcker de områden som du behöver känna till för att förstå företagets ekonomi och kunna titulera dig Certifierad ekonomiassistent.  Efter genomförd kurs har du fått kunskap inom:   Ekonomiarbetet generellt, vad handlar det om Företagets Affärsidé Budgetering Resultatplanering  Kalkylmetoder Bidragskalkyl Lönsamhetsoptimering Påläggskalkylering ABC-kalkylering Investeringskalkylering med Pay-off-metoden Grunder i bokföring Periodiseringar Avskrivningar Läsa en Resultat- och Balansräkning De vanligaste ekonomiska nyckeltalen Du kommer också att ha färdighet och kompetenser att:    Kostnadsbestämma produkter och tjänster  Prissätta produkter och tjänster utifrån satta lönsamhetskrav Bestämma olika varors/tjänsters lönsamhet Ta fram beslutsunderlag avseende investeringar (pay-off-metoden) Upprätta en budget Bokföra enklare händelser", "expected_occupations": [{"occupation_label": "Ekonomiassistent"},{"occupation_label": "Budgetassistent"}]}
{"exclude": false, "education_headline": "Kommunikativt ledarskap med Elaine Eksvärd", "education_text":  "Lär dig hantera de kommunikativa utmaningarna en chef/ledare alltid möter, förr eller senare. På en och samma dag kan du behöva leverera besvärlig information till en anställd, för att i nästa stund hålla en inspirerande presentation för teamet.  Har du känslig feedback att ge, folk som berättar saker du redan vet eller utmaningar att få med dig medarbetarna i en presentation? Som ledare behöver du inte bara kunna bemästra svåra samtal, du behöver också kunna skapa en arbetskultur fri från härskartekniker, sexism, rasism och andra jargonger som motverkar ett konstruktivt arbetsklimat. Du lär dig presentationsteknik, konstruktiv och uppbyggande feedback samt modern retorik – kroppsspråk, röst, ordval. Med hjälp av våra verktyg kan du skapa en arbetskultur som bygger på feedback, uppmuntran och laganda. Högt i tak för feedback och lågt i tak för skitsnack. Huvudsyftet med utbildningen är att ge dig som chef eller ledare verktyg för att tackla de kommunikativa utmaningarna du ofta möter. Elaine Eksvärd är själv chef sedan 13 år tillbaka, men också Sveriges mest anlitade retoriker.  Den 23 februari lanserade vi även denna kurs som heldag! Nu får du inte bara lära dig kommunikativt ledarskap utan även konsten att leda på distans.  För dig som är ledare och inte bara tycker det är svårt att hålla engagemanget uppe utan dessutom tycker det är utmanande att hålla folk engagerade under ett digitalt möte. Nu har vi goda nyheter! På kursen digitalt ledarskap får du tillsammans med andra chefer får lära er tackla svåra samtal och dessutom de digitala utmaningarna som en ledare tvingats lära sig nu. Skapa digitala möten som medarbetarna ser fram emot, ge mötesramar och digitala regler som folk kan följa för bästa stämning bland medarbetarna. Efter kursen står du rustad med både retoriska formler för vad du ska säga, men också manualer för hur du som ledare gör det bäst digitalt. Modern retorik – vikten av kroppsspråk, budskap och röst Så ger du konstruktiv feedback som bygger upp Konstruktivt arbetsklimat – Identifiera destruktiva jargonger och få bort dem Slagkraftig presentationsteknik Tydlig kommunikation som medarbetarna kommer ihåg Bedriftberättande (positivt skryt) som skapar rättvis behandling av medarbetare Effektiv konflikthantering Så leder du genom personliga kriser Uppsägningar – på ett sätt Konsten att erkänna fel och ta emot kritik som chef", "expected_occupations": [{"occupation_label": "Utbildningsledare"},{"occupation_label": "HR-specialist/HR-advisor"},{"occupation_label": "Verksamhetskonsult"},{"occupation_label": "Försäljningschef"},{"occupation_label": "Administrativ chef"},{"occupation_label": "HR-konsult/PA-konsult"},{"occupation_label": "Kommunikationsstrateg"},{"occupation_label": "Utbildningskoordinator"},{"occupation_label": "Arbetsledare, kontorspersonal/Gruppledare, kontorspersonal"},{"occupation_label": "Marknadschef"}]}
{"exclude": false, "education_headline": "Allmän Elbehörighet distans", "education_text": "Bli behörig elektriker! Efter att ha genomgått kursen Allmän Elbehörighet (ABL) kommer du ha rätt att som elinstallatör själv utföra eller ansvara för en annan yrkesmans elinstallationer. Denna behörighet gäller för alla typer av elanläggningar på upp till 1000V. Efter slutförd utbildning i allmän behörighet för el kommer du även ha rätt att starta ditt eget elföretag, utföra eltjänster samt att ta mer ansvar på din arbetsplats.   Kursmål för Allmän Elbehörighet (ABL) distans Våra kurser ger dig de teoretiska kunskaper som krävs för att få behörighet att utföra elinstallationsarbeten. Efter att du gått utbildningen och blivit godkänd ansöker du direkt hos El-säkerhetsverket, som är de som utfärdar den allmänna behörighet som krävs för att bli behörig elektriker.  Att ha allmän elbehörighet öppnar upp flera nya möjligheter för dig som elektriker. Bland annat kommer du att kunna starta eget, arbeta som ansvarig behörig elektriker på arbetsplatser samt på större elföretag. Detta gör dig mycket attraktiv på arbetsmarknaden.  Innehåll för kursen Allmän Elbehörighet (ABL) distans Utbildningen hon Distansia följer Elsäkerhetsverkets krav gällande kunskaps- och färdighetskrav för föreskrifter enligt ELSÄK FS 2013:1 som trädde i kraft 2014-01-01.  Om du läser kursen i normal studietakt och jobbar samtidigt tar kursen ungefär 6-8 månader att slutföra. Förutom momenten som listas nedan ingår i kursen även ett obligatoriskt laborationsprov. Provet kan genomföras under en heldag på någon av följande orter: Malmö-Göteborg-Stockholm eller Gällivare/ Malmberget.. Du väljer själv vilken av orterna du vill göra provet på.   Kursen är indelad i fyra kunskapsområden: Elinstallationer i byggnader Anläggningar för produktion och överföring av el samt industriella anläggningar Elmaskiner Regler och standarder", "expected_occupations": [{"occupation_label": "Driftmontör, elkraft"}, {"occupation_label": "Driftelektriker"}, {"occupation_label": "Arbetsledare, elkraft"}, {"occupation_label": "Automationsingenjör, maskin"}, {"occupation_label": "Elverkschef"}, {"occupation_label": "Anläggningsingenjör, elkraft"}, {"occupation_label": "Servicetekniker, elektronik"}, {"occupation_label": "Industrielektriker"}]}
{"exclude": false, "education_headline": "Certifierad Mental Tränare via TMB", "education_text":  "Trainer of Mind and Brain, förkortat TMB, är en ny och komplett utbildning till mental tränare. Utbildningen ger dig den kunskap du behöver för att framgångsrikt hjälpa människor i deras utvecklingsprocess. Fokus ligger på kunskapen om hjärnan och dess funktioner och hur vi genom mental träning kan öka vår livskvalitet. Grunden i TMB är att öka medvetenheten om kroppen som helhet och hur vårt mentala tillstånd påverkar vår hälsa.   I Trainer of Mind and Brain möter den traditionella mentala träningen framtidens verktyg neuroplasticity training och ger en oslagbar kombination. Förutom detta rustar utbildningen också för att kunna arbeta professionellt med samtal och handledning av klienter.    Yrket ger dig möjligheten att arbeta i den form som du trivs bäst, vare sig det handlar om gruppsamtal, föreläsningar eller via en helt egen online baserad mottagning. Utbildningen riktar sig till dig som har ett stort intresse för personlig utveckling och som vill jobba med individer som vill gå från ”good to great”. Inga direkta förkunskaper krävs men ett intresse för psykologi och hur vår hjärna fungerar, samt en tilltro till individers förmåga att förändras, är grundläggande.  Trainer of Mind and Brain är dessutom ett utmärkt alternativ till vidareutbildning för redan verksamma coacher, terapeuter och beteendevetare. Utbildningens innehåll:  Modul 1:1 - Hjärnan, plasticitet, biologi & medvetande  I modul 1:1 fokuserar vi på att lägga grunden och få en förståelse för hjärnan och dess uppbyggnad. Vi slänger oss också direkt in i det viktigaste området av alla inom mental träning - positive neuroplasticity training (NPT). Trots betoning på teori läggs vikten vid att knyta kunskapen till mental träning samt att belysa psykologiska myter som bör undvikas  Modul 1:2 - Förändrat medvetandetillstånd och interoception  Modul 1:2 fokuserar på de delar som ingår i grundläggande mental träning, nämligen förändrat medvetandetillstånd. Vi ser på vad forskningen säger om vårt medvetande och vilka metoder som aktivt berör, eller till och med kräver, det förändrade medvetandetillståndet. Vi ser närmre på innebörden av begreppet ©TheReceivingMode och dess många fördelar.  Modul 2:1 Mental träning & det professionella samtalet  Denna modul är uppdelad i två ämnen. Vi börjar med en djupdykning inom mental träning där vi lär oss grunderna i den svenska modellen utifrån Lars-Eric Uneståhl. Därefter lär vi oss om samtalet som verktyg och hur vi blir säkra i vår roll som samtalsledare. Vi pratar om kroppsspråk, priming liksom om etik & moral. Intentionen är att du som deltagare ska börja ta dig an en övningsklient (eller flera) där du prövar någon av de metoder vi gått igenom i tidigare moduler.  Modul 2:2 - Mental träning & det professionella samtalet  I modul 2:2 tittar vi på tillvägagångssätt att kombinera olika metoder utifrån specifika områden som stress, självkänsla eller prestation. Parallellt pratar vi om samtalets upplägg utifrån ©Samtalsfyrkanten och får en egen studiedag tillägnad litteratur & cases. Efter denna modul är det dags att öka på klienterna och på så sätt trappa upp samtalsträningen.  Modul 3:1 - Hjärnhälsa / Neurohacking   I modul 3:1 går vi in på området hjärnhälsa och ser vad forskningen har att säga om neurohacking. Hur påverkar vår livsstil hjärnans plasticitet och kognitiva funktioner och vad kan vi göra för att säkerställa optimal funktion?  Modul 3:2 - Framtidsvisioner, avslut & certifiering   I den allra sista delen lär vi oss mer om företagande och entreprenörskap. Hur kan vi nu använda oss av mental träning som yrkesverksamma? Vi blickar framåt och diskuterar olika tillvägagångssätt för att snabbt komma ut och praktisera det vi lärt oss. Betoning ligger på grundläggande kunskap om marknadsföring, försäljning och tjänsteupplägg.", "expected_occupations": [{"occupation_label": "Instruktör inom specialidrott/Tränare inom specialidrott"}, {"occupation_label": "Instruktör/Tränare inom specialidrott"}, {"occupation_label": "Personlig tränare/PT"}]}
{"exclude": false, "education_headline": "AAA-Projektledarutbildning. För de som vill ha det bästa?", "education_text":  "Certifieringsgrundande projektledarutbildning I ett led att höja statusen för projektledning i Sverige har vi nu tagit nästa steg. Vi har nu registrerat vår utbildning hos IPMA. Vi är endast sex stycken utbildningsföretag som genomfört denna registrering och vi är det företag som har den längsta utbildningen.  En registrerad utbildning är kartlagd vad gäller längd, innehåll, utbildningsmetod och den effekt utbildningen förväntas ge på deltagarens kompetensnivå  Kartläggningen är verifierad av Svenskt Projektforum. En registrering kan ses som en varudeklaration granskad av en oberoende part. Ett av de främsta målen med registreringen är att göra det enklare för företag och individer att välja rätt utbildning.  Känner du ibland en osäkerhet då du ska arbeta i projekt? Det är inte helt ovanligt med följande scenario. Du får veta av din närmsta chef att ni har fått ett projekt och att du ska vara projektledare. Projektet är väldigt viktigt och du får inte misslyckas. Det ska vara klart om tre månader och du ska leverera enligt kontraktet du får av din chef. FÖLJANDE FRÅGESTÄLLNINGAR ÄR VANLIGA: – Vad gör jag nu? Tre månader är ganska snart och det är    påskledighet under tiden. – Hur startar jag projektet? – Vilka är mina medarbetare och vad ska vi leverera? – Hur ska jag angripa den här arbetsuppgiften?  Under utbildningen ger vi dig svaren på alla dessa frågor och på många fler. Du kommer att lära dig att hantera alla tänkbara situationer som uppstår.  UPPLÄGG Vi har erfarenhet från alla typer av projekt. Våra lärare är certifierade och aktiva som projektledare och har sammantaget utbildat över 2000 projektledare som certifierat sig på olika nivåer enligt IPMA.  Dessutom har vi utbildat ett stort antal projektledare som inte gått vidare till certifiering samt projektmedarbetare och projektägare.  Vår utbildning börjar med kickcoff två dagar internat och genomföres därefter  enligt lagt schema under en period om ca 2,5 månad.  Utbildningen avslutas med kickout där vi äter gemensam middag kvällen dag 10.  Utbildningen omfattar elva kursdagar varav sex dagar är projektkunskap och fem dagar är ledarskapsutbildning. Vi är rörande överens om att dessa båda delar måste hänga ihop. Därför har vi tagit fram en ledarskapsutbildning som är specialanpassad för de projektdelar vi lär ut.  Vi har även ett alternativ som omfattar fem dagar, se intensivutbildning.  Kursdeltagarna omsätter de teoretiska kunskaper de erhåller i praktiska erfarenheter genom att parallellt med den teoretiska utbildningen arbeta med ett projekt på hemmaplan. Detta återkopplas löpande i utbildningen för att dra lärdomar.  Hos oss får du l support även efter utbildningen slut..  I utbildningen ingår dokumentation i form av kompendier, pärmar eller böcker. Målgrupp Vår projektledarutbildning riktar sig till ALLA som arbetar eller vill arbeta som projektledare, inom ALLA yrkesområden och branscher. Vi är erfarna lärare både inom projektdelen och ledaskapsdelen, alla är specialister och handplockade till oss och vår utbildning för att ge er det bästa.  Utbildningen ger er insikt i projektprocessen och hur den ska användas. Projektledararens roll och vilka krav som kan ställas på beställare och styrgruppsmedlemmar, en viktig kunskap för att lyckas med sina projekt.  Vi erbjuder också inte bara stöd genom coachning under hela utbildning utan även ett livslångt stöd, där ni kan kontakta era lärare och inte behöva känna er ensamma.  Vi arbetar och strävar efter att alla medarbetare oavsett nivå, ska kunna nå optimal utdelning när man jobbar i projekt. Därför utbildar vi både projektledare, projektägare, styrgrupper och projektmedarbetare.  Oavsett projekt, projektmodell, organisation är målsättningen med vår utbildning att skapa rätt förutsättningar, för att använda projekt som arbetsform på ett framgångsrikt sätt.  Deltagarna får med sig kunskaper som utgör grunden för att kunna sätta upp ett projekt som säkerställer framgång i alla typer av organisationer. Vi lär ut hur du ska ta dig an alla typer av projekt, allt från Bygg och anläggning till IT–Projekt, plus alla projekt där emellan.  Vår projektledarutbildning är till för dig som vill veta hur det egentligen fungerar att arbeta  som projektledare på ett riktigt sätt så att du erhåller optimal utdelning.  Vi har tagit fram ett speciellt ledarskapspaket som är anpassat till hur projekt ska bedrivas. fem dagar ledarskap och sex dagar projekthantering, där allt hänger ihop och deltagarna är samma genom hela utbildningen. Detta skapar möjligheter utöver det vanliga då vi lägger stort fokus på gruppdynamiken.  Utbildningen vänder sig till alla både om du vill certifiera dig enligt IPMA, PMI eller inte certifiera dig alls.  Välkomna och testa oss.  Vi har avtal med Trygghetsrådet.  Ytterligare information hittar du på vår hemsida.  Kursinnehåll Projektledning – sex dagar Vi utgår från en vattenfallsmodell och bygger på den med olika verktyg beroende på typ av projekt. Vi utgår från de nio kunskapsområden en projektledare måste kunna hantera:  Projektintegration Målstyrning Kvalitetsstyrning Planering och tidsstyrning Ekonomistyrning Ledarskap Kommunikation Osäkerhetshantering Resursupphandling och inköp  Innehåll i projektdelen:  Varför projekt – Hur ser en projektmodell ut – Ansvar och befogenheter – Samarbete – Konflikter – Faserna i projektinledning, Planering, Osäkerhetshantering, både risker och möjligheter, Kvalitetsplan, Genomförande, Projekt på rätt kurs, och Avslut – Olika verktyg och metoder i alla faser – Effektiva möte – Kravhantering - Genomförande av projekt – Överlämning – Reflektion och lärande.  LEDARSKAP – FEM DAGAR Innehåll i ledarskapsdelen:  Vem är jag och hur leder jag andra – Kommunikation, Feedback, Att bygga kultur, Motivationsteorier – Konflikthantering – De svara samtalen – Situationsanpassat ledarskap – Stresshantering – Det moderna ledarskapet – Grupper utveckling – Övningar – Rollspel – Dialoger och reflektioner.  Eget projektarbete Cirka 80 timmar eget projekt som drivs i den egna organisationen, detta för att erhålla ett lärande och för att omsätta teorier i praktik. Vanligtvis finns det en arbetsuppgift eller ett projekt som passar att ha som projekt.", "expected_occupations": [{"occupation_label": "Projektledare, bygg och anläggning"},{"occupation_label": "Projektledare, IT"},{"occupation_label": "Projektledare, reklam"}]}
{"exclude": false, "education_headline": "Överlåtelsebesiktning av fast egendom", "education_text":  "Kurs i överlåtelsebesiktning av fast egendom  Undervisningen är uppdelad i två delar med hemuppgifter mellan del 1 och del 2. Målet med utbildningen är att ge deltagarna grundläggande information om regler kring fastighetsköp, främst med utgångspunkt från besiktningens betydelse och besiktningsmannens ansvar, säljarens uppgiftsskyldighet och begreppet dolda fel.  Kursinnehåll: Deltagaren kommer att få kunskap om byggteknik, kritiska konstruktioner, skador och dess orsaker, fukt och mögel samt byggnormernas förändringar genom åren.  Kursmål: Deltagaren ska förstå hur en överlåtelsebesiktning ska utföras med riktlinjer för uppdragsbekräftelse och utlåtande.  Datum: Del 1 8-9 mars, del 2 19 april, tentamen 20 april", "expected_occupations": [{"occupation_label": "Besiktningsman, försäkring/Skadeinspektör, försäkring"},{"occupation_label": "Byggnadskonsult"},{"occupation_label": "Fastighetstekniker/Drifttekniker, fastighet"},{"occupation_label": "Fukttekniker"},{"occupation_label": "Besiktningsingenjör"}]}
{"exclude": false, "education_headline": "Brandfarliga Arbeten (heta arb.)", "education_text":  "Kursbeskrivning Brandfarliga arbeten (Heta arbeten) Alla arbeten som utförs med verktyg som avger värme, gnistor eller eld kallas för Brandfarliga arbeten Sedan 1991 ställer försäkringsbranschen krav på alla som arbetar med Brandfarliga Arbeten har utbildning. Det krävs att man skall känna till vad som menas med Brandfarliga Arbeten, vad som ska göras enligt checklista, kunna hantera handbrandsläckare samt gasflaskor vid brand.   Tema Utbildnings kurs för Brandfarliga Arbeten omfattar samtliga områden som krävs för att erhålla ett utbildningsbevis från Svenska Brandskyddsföreningen (certifikat). Detta certifikat måste förnyas vart femte år vilket innebär att man måste gå utbildning inom Brandfarliga arbeten vart femte år för att få ett förnyat certifikat.   Kursinnehåll brandfarliga arbeten  - Lagar och regler - Allmänt om vad brandfarliga arbeten innebär - Brandkunskap - Förebyggande brandskydd - Säkerhetsregler för brandfarliga arbeten - Släckutrustning och praktiska övningar.", "expected_occupations": [{"occupation_label": "Brandtekniker"},{"occupation_label": "Brandman"},{"occupation_label": "Bostadsförvaltare"}]}
{"exclude": false, "education_headline": "Kontrollansvarig enligt PBL", "education_text":  "Kontrollansvarig enligt PBL – kurs anpassad efter Boverkets krav. Inga förkunskaper krävs, men för certifiering finns krav på utbildning eller arbetslivserfarenhet m.m enligt Boverkets regel BFS 2001:14 KA 4 med ändringar. Kursen ger kunskaper om bl.a.  Plan- och bygglagen (PBL) SFS 2010:900 särskilt kontrollplan kap. 10 3-14§§, 189-21§§ samt bygglovsprocessen kap. 9-10§§ Boverkets byggregler BBR  Boverkets föreskrift av europeiska konstruktionsstandarder EKS  Övriga regler boverkets krav på kännedom för kontrollansvariga Entreprenadjuridik/avtal som AB04, ABT06, ABS09, Konsumenttjänstlagen mm Kvalitets- och miljöledningssystem SS-EN ISO 9001:2015 samt SS-EN ISO 14001:2004", "expected_occupations": [{"occupation_label": "Bygglovshandläggare"}, {"occupation_label": "Byggnadsingenjör"}, {"occupation_label": "Byggnadsinspektör"}, {"occupation_label": "Byggnadskonsult"}, {"occupation_label": "Civilingenjör, bygg"}, {"occupation_label": "Byggnadskonstruktör"}, {"occupation_label": "Projektledare, bygg och anläggning"}, {"occupation_label": "Planeringsarkitekt/Fysisk planerare"}, {"occupation_label": "Planarkitekt"}]}
{"exclude": false, "education_headline": "Eldrift av tyngre fordon: lastbilar, bussar och arbetsmaskiner", "education_text":  "Utmaningarna och möjligheterna med eldrift av tunga vägfordon. Drivlinor för olika typer av tunga vägfordon: elektriska bussar, lastbilar och arbetsmaskiner. Effekt och energibehov, verkningsgrad, felfall och säkerhet. Tunga eldrivna vägfordon som används idag. Relevanta samhälleliga, miljöaspekter och etiska aspekter.", "expected_occupations": [{"occupation_label": "Civilingenjör, elkraft"}, {"occupation_label": "Fordonstekniker/Bilmekaniker/Personbilsmekaniker"}, {"occupation_label": "Produktutvecklare"}, {"occupation_label": "Maskinmekaniker/Skogsmaskinmekaniker"}, {"occupation_label": "Traktormekaniker"}, {"occupation_label": "Diversearbetare"}, {"occupation_label": "Verkstadschef"}, {"occupation_label": "Verkstadsmekaniker/Verkstadstekniker"}, {"occupation_label": "Maskinmekaniker, industri/Maskinmekaniker, varvsindustri"}, {"occupation_label": "Servicetekniker, tåg"}]}
{"exclude": false, "education_headline": "Grundläggande Psykoterapiutbildning med KBT-inriktning (Steg 1) med digital behandling", "education_text":  "Grundläggande Psykoterapiutbildning med KBT-inriktning (Steg 1) med Digital behandling. Vår bredaste utbildning ger dig omfattande förståelse för de principer och metoder som används inom kognitiv beteendeterapi. Du utvecklar nya strategier i mötet med andra människor och kan hjälpa både individer och grupper att forma och bibehålla en bättre vardag. Utbildningens bredd och omfattning ger dig en kompetens som är användbar i många branscher. Den erbjuder en hög akademisk kompetens och en gedigen kliniska kompetensen där du lär dig hantverket.  Du får de verktyg och den kompetens du behöver för att bedriva psykoterapeutisk behandling under handledning. För dig som arbetar med människor inom exempelvis vård, skola, företagande, idrott etc. blir din nya förståelse för bemötande och kommunikation en stor tillgång. Ger dig möjligheten att arbeta med digital behandling Ger dig möjligheten att vidareutbilda dig inom den Legitimationsgrundade utbildningen i psykoterapi (Pykoterapeutprogrammet, Steg-2) och bli legitimerad psykoterapeut. Se universitetens hemsidor. Utbildningens målsättning  Målsättningen med utbildningen är att ge bred och omfattande kunskap i den kognitiva beteendeterapins teoretiska utgångspunkter, analys, kliniska tillämpningsområden, psykoterapeutiska arbetsmetoder och empirisk forskning. Den studerande förväntas efter slutförd utbildning besitta de grundläggande kunskaper och färdigheter som krävs för att under handledning kunna arbeta med KBT både individuellt och i grupp.  Utbildningen är godkänd av Socialstyrelsen att tillgodoräknas inom ramen för läkares specialistutbildning i psykiatri. Slutförd och godkänd utbildning ger behörighet att söka legitimationsgrundande psykoterapeututbildningar med behörighetskrav på grundläggande psykoterapiutbildning med inriktning kognitiv beteendeterapi (exempelvis steg 2).  Universitets och Högskolerådet ser över och godkänner utbildningar inom universitet och högskolor. För privat utbildningar finns ingen översyn. Man bör utgå från bl.a. utbildningsansvarigs kliniska erfaren och erfarenhet av att genomföra utbildningar.  KBT teamet har sedan 2005 haft flertal deltager som studerat vidare på Psykoterapeutprogrammet.  Upplägg: Du får vid start en inbjudan och du kan sedan påbörja när du vill. Varje moment med olika avsnitt öppnas upp men ca 5 veckors mellanrum för att sedan ligga uppe under hela utbildningen. Detta innebär att du följer en kursplan för att du skall lära in i rätt ordning men kan läsa när du vill och alltid återgå till allt material.   Vid start har gruppen ett digitalt möte där vi träffas och presenteras för varandra.  Under varje avsnitt finns quiz för att testa din kunskaper och möjlighet till att ställa frågor. Under terminen ges tillfälle till digitala möten för frågor.  Examination ges i slutet av var termin. Examinationers utförande varierar från digital sals tenta, hemtenta till grupp övningar och muntliga presentationer.   Kognitiv beteendeterapi Kognitiv beteendeterapi (KBT) beskrivs som en strukturerad, mål- och problemorienterad, aktiv och pedagogiskt upplagd. Betoning på empiriskt grundade teorier och behandlingsformer. Man utgår ifrån analysen av individens funktion i sitt sammanhang såväl vid problem i livssituationen som vid olika typer av psykopatologi.   Behandlingsmetoderna innehåller såväl beteende inriktade som kognitiva inslag och tar ständigt till sig ny empiriskt grundad kunskap. Listan på tillämpningsområden där KBT visat goda behandlingsresultat är många och innehåller: Ångesttillstånd, Depression, Psykos, ASD och ADHD, Ätstörningar, Beroendeproblematik, Stressproblematik, Psykosomatiska problem, Hälsopsykologi m.fl. Psykoterapeutiska teorier och metoder inom KBT: Depression, Panikångest, Specifik fobi, Social ångest, OCD / Tvångssyndrom, Hälsoångest, Generaliserat ångestsyndrom, Smärta, Stress, Sömn, PTSD, ASD / ADHD, Ätstörningar, Missbruk, Psykos, Samtalsmetodik, Mindfulness, ACT,  Digital KBT behandling  Forsknings – utvärderingsmetoder ,Psykiatrisk diagnostik,  Psykopatologi, Psykoterapi under handledning   Föreläsningsdagar / Övningsdagar termin1-3 i Stockholm (förläggs till mitten oktober till slutet november).  Själv reflektion och professionell utveckling: Finns som egen kurs , se denna. Introduktion Genomgång av utbildningens innehåll och litteratur, presentation av kognitiv beteendeterapi och dess historik och utveckling.   KBT-relaterade teorier Genomgång av grundläggande teoretiska begrepp, teorier och modeller inom KBT vilket lär deltagaren att förstå och genomföra analyser och behandlingsplanering och att genomföra olika KBT behandlingsalternativ.   Problemformulering, problemanalys, konceptualisering, diagnostik och psykopatologi Utbildningsmomenten har tonvikt på analysmetoder inom KBT, problemanalys och funktionell analys samt psykoterapeutiska teorier och metoder inom kognitiv beteendeterapi.   Självkännedom och professionell utveckling (tidigare egenterapi) Det tidigare egen terapimomentet ersätts numera av en kurs med fokus på självkännedom och professionell utveckling. Denna del ingår ej i vår utbildning men finns att tillgå.   Psykoterapeutiska teorier och metoder för förändring Övningsdagar med föreläsningar och praktisk träning i de vanligast förekommande behandlingsmetoderna och analyser.   Forskningsmetodik och vetenskapsteori Forskning och forskningsmetodik i allmänhet och forskning relaterad till KBT. Förmågan att bedöma forskning på området är en viktig faktor för att kunna ta ställning till forskningsrön och tillägna sig kunskaper från evidensbaserad forskning.   Psykofarmakologi  Dennas ges om och när möjlighet finns. Kunskap om psykofarmaka och i relation till psykoterapeutisk behandling.   Problemområden och metoder som ingår Depression, Panikångest, Specifik fobi, Social fobi, OCD / Tvångssyndrom, Hälsoångest, Generaliserat ångestsyndrom, Smärta, Stress, Sömn, PTSD, ASD / ADHD, Ätstörningar, Missbruk, Psykos, Samtalsmetodik, Mindfulness, ACT,", "expected_occupations": [{"occupation_label": "Psykolog"}, {"occupation_label": "Psykoterapeut"}, {"occupation_label": "Kurator"}, {"occupation_label": "Sjuksköterska, psykiatrisk vård"}, {"occupation_label": "PTP-psykolog"}, {"occupation_label": "Samtalsterapeut"}, {"occupation_label": "Socionom"}, {"occupation_label": "Familjebehandlare"}, {"occupation_label": "Primärvårdskurator"}]}
{"exclude": false, "education_headline": "Motorsåg A+B\n", "education_text":  "Utbildning på motorsåg nivå A och nivå B.  På nivå A lär vi oss om de grundläggande momenten vid användandet av motorsåg. När vi tar klivet upp till nivå B går vi in på att planera och genomföra fällning, kapning och kvistning av träd på ett säkert sätt.  Vi håller ett lugnt tempo så att alla är med, oavsett förkunskaper. För er som använder eller skall använda en motorsåg inom yrket och som berörs av. Utbildningen syftar till att ge de kunskaper och färdigheter som utöver nivå A krävs för att på ett säkert sätt använda motorkedjesåg vid normalt skogsarbete såsom trädfällning, kvistning och kapning. (Observera att trädfällning av speciellt svåra träd, tillvaratagande av vindfällda träd och nertagning av fastfällda träd endast behandlas översiktligt). Dag 1 -Teoretisk del  Dag 2 och 3 - Praktiskt del  Material deltagarna behöver ha med sig är:  Motorsåg med bränsle och tillbehör så som kombinyckel, filar och fil mall. Personlig skyddsutrustning så som huggarbyxor, stövlar eller kängor som är godkända för motorsågshantering. Varselkläder på överkroppen. Hjälm med visir och handskar. Ett förstaförband skall finnas med som bärs i kläderna. Kilar för fällning, helst 3 stycken. Något att slå in kilarna med. Gärna sax, krok och måttband. Det kommer att göras både ett teoretisk och ett praktiskt prov. ", "expected_occupations": [{"occupation_label": "Skogsarbetare, röjning"},{"occupation_label": "Skogsarbetare, motormanuell avverkning"},{"occupation_label": "Parkarbetare/Utemiljöarbetare/Miljövärd"}]}
{"exclude": false, "education_headline": "Socialpedagogik, inriktning ungdoms- och missbruksvård", "education_text": "Ett program för dig som vill arbeta inom ungdoms- och missbruksvården eller närliggande områden som t.ex. skolan, socialtjänsten, kriminalvården och psykiatrin. Programmet vid Linnéuniversitetet ger landets enda specialiserade högskoleutbildning med inriktning mot ungdoms- och missbruksvård.Kursernas innehåll främjar utvecklingen av ett professionellt förhållningssätt och en tvärvetenskaplig kompetens, där erfarenhetsbaserad och teoretisk kunskap prövas mot varandra med målet att utveckla reflekterande praktiker. Förutom att du fördjupar dig i olika teoretiska perspektiv i relation till ungdoms- och missbruksproblem innehåller utbildningen färdighetsträning samt moment där det egna förhållningssättet gentemot människor i utsatta livssituationer behandlas. Det ger dig tillfälle att reflektera över bemötandets betydelse i det socialpedagogiska arbetet.Under det första året ges en introduktion till fältet ungdoms- och missbruksvård. Professionellt förhållningssätt i socialpedagogiskt arbete är i fokus under det andra året som också innehåller en praktikperiod om 17 veckor. Det finns möjligheter till praktik såväl i Sverige som utomlands. Det tredje året består av fördjupning och specialisering inom olika aspekter av ungdoms- och missbruksvård.", "expected_occupations": [{"occupation_label": "Behandlingsassistent/Socialpedagog"}, {"occupation_label": "Enhetschef inom social omsorg/Föreståndare inom social omsorg"}, {"occupation_label": "Enhetschef inom socialtjänst"}, {"occupation_label": "Socionom"}, {"occupation_label": "Gruppledare inom socialtjänst"}, {"occupation_label": "Ungdomssekreterare, socialtjänst"}, {"occupation_label": "Socialsekreterare"}, {"occupation_label": "Familjebehandlare/Familjepedagog"}, {"occupation_label": "Familjehemssekreterare/Familjehemskonsulent"}, {"occupation_label": "Avdelningschef, statlig"}]}
{"exclude": false, "education_headline": "Platsgjutning klass II-U\n", "education_text": "Platsgjutning Klass II-U är en utbildning för dig som t.ex. är arbetsledare, plats- eller produktionschef, byggledare eller kontrollant. Kursen behandlar grundläggande betongteknologi, armeringsteknik, formbyggnad och ritningsläsning samt en översikt av betongens olika användningsområden. Kritiska moment vid utförande med inriktning mot husbyggnadsarbeten betonas.\n\nErhållet intyg ger kompetens att leda betongarbeten i kompetensklass II. Utbildningen är uppdelad i två delar, med en mellanliggande vecka innan de två sista kursdagarna. Kursen följer Betongrapport 8 och är en godkänd utbildning av Betongföreningen.\n\nHär kan du hämta Betongrapport 8 som pdf. ", "expected_occupations": [{"occupation_label": "Betongelementmontör"},{"occupation_label": "Betongarbetare"}, {"occupation_label": "Betongarbetare, utan yrkesbevis"}, {"occupation_label": "Gruppchef, teknik"}, {"occupation_label": "Projekteringsingenjör, bygg och anläggning"}, {"occupation_label": "Projektledare, IT"}, {"occupation_label": "Arbetsledare, anläggning"}, {"occupation_label": "Träarbetare/Snickare"}, {"occupation_label": "Projektledare, bygg och anläggning"}, {"occupation_label": "Betongvaruarbetare"}, {"occupation_label": "Byggledare"}]}
{"exclude": false, "education_headline": "EBR Kabelförläggning i mark\n", "education_text": "EBR Kabelförläggning i mark  Den som medverkar vid arbeten med kabelförläggning ska ha lämplig utbildning enligt publikationen EBR Krav vid kabelförläggning. I utbildningen går våra instruktörer igenom allt från el-faran och relevant lagstiftning till kabelförläggning enligt publikationen KJ 41:21.  De företag som genomför kabelförläggningsarbeten ska kunna visa att alla som medverkar har genomgått lämplig utbildning. Utbildningen ska utföras enligt gällande dokument och kunskapen ska kunna styrkas med utbildningsintyg från utbildningen EBR Kabelförläggning. Kursen vänder sig till dig som skall förlägga jordkabel i mark, sätta upp kabelskåp och stolpar samt förlägga jordtag. Utbildningen kallades tidigare för Begränsad behörighet – BB3.  Kursmoment  • El-faran och arbetsmiljörisker • Relevanta lagar, förordningar och föreskrifter • EBR Kompetenskrav och egenkontroll • Miljöaspekter vid ledningsschakt och ledningsarbeten • Arbetsmetoder och kabelförläggning enligt EBR-rapporten Kabelförläggning max 145 • kV (KJ41) • Schaktning i anslutning till befintlig kabel • Slutprov  Kursmål Efter kursen ska deltagarna förstå och kunna tillämpa anskaffad kunskap enligt de krav som ställs av Elnätsbranschens riktlinjer (EBR) vid kabelförläggning.  Målgrupp Kursen EBR Kabelförläggning i mark vänder sig bland annat till dig som är grävmaskinist, anläggningsarbetare, lastbilsförare, arbetsledare eller planeringspersonal. ", "expected_occupations": [{"occupation_label": "Distributionselektriker"}, {"occupation_label": "Elkrafttekniker"}, {"occupation_label": "Grävmaskinförare"}, {"occupation_label": "Elverksmontör"}, {"occupation_label": "Ledande montör, el"}, {"occupation_label": "Elmontör"}, {"occupation_label": "Driftmontör, elkraft"}, {"occupation_label": "Kabelmontör, elkraft"}, {"occupation_label": "Väg-och anläggningsarbetare"}, {"occupation_label": "Linjemontör, elkraft"}]}
