{
  "$schema": "https://docs.renovatebot.com/renovate-schema.json",
  "extends": [
    "config:base"
  ],
  "automerge": true,
  "autoApprove": true,
  "automergeType": "pr",
  "packageRules": [
    {
      "matchUpdateTypes": ["minor", "patch", "pin", "digest"],
        "automerge": true,
        "autoApprove": true
    }
  ]
}
