 Hej,

Jag heter Test Testsson och jag är mycket intresserad av er lediga tjänst som lageransvarig i Arlöv. Med min bakgrund inom programutveckling och nätverksutveckling tror jag att jag skulle kunna bidra till era team på ett positivt sätt.

Jag har en magisterexamen i datavetenskap från Uppsala universitet och över två decenniers erfarenhet inom programutveckling, nätverksutveckling och datalogi. Jag är en engagerad person som är stark för att lösa komplexa tekniska problem och arbeta i team.

Jag har tidigare arbetat som nätverksutvecklare på Ericsson, där jag var ansvarig för utvecklingen av nätverkslösningar för telekommunikationsprodukter. Jag samarbetade med tväravdelningsgrupper för att säkerställa en smidig implementering av nätverksfunktioner och bidrog till optimering av nätverksprestanda och säkerhetsfunktioner.

Jag är övertygad om att min erfarenhet inom programutveckling och nätverksutveckling kommer att vara en fördel i rollen som lageransvarig på Testia. Jag tror också att jag skulle kunna bidra till era team genom mitt starka samarbets- och problemlösningsförmåga.

Tack för er tid och vänliga hälsningar,

Test Testsson

