Ansökan:

Test Testsson
test@testsson.se
Telefon: 111-1111111
Adress: Testvägen 1

Ansökning för Lageransvarig i Arlöv, Testia

Dear HR-personal,

Med denna ansökan vill jag söka efter en position som Lageransvarig hos Testia i Arlöv. Jag är imponerad av Testias arbete för att skapa ett bättre samhälle genom kontrakterad kollektivtrafik och är övertygad om att jag kan bidra med sin erfarenhet inom programutveckling, nätverksutveckling och datorlingvistik.

Som Magister i Datavetenskap från Uppsala universitet har jag en stark akademisk bakgrund som jag tror kan vara nyttig i en roll där teknik och organisation spelar en viktig roll. Mitt 20 år långa arbetsliv har gett mig erfarenhet av att arbeta i team och leverera högkvalitativa resultat, vilket jag tror skulle vara fördelaktigt i en position som Lageransvarig.

I min tidigare anställning hos Ericsson var jag ansvarig för utveckling av nätverkslösningar för telekommunikationsprodukter och arbetade aktivt med tväravdelningsgrupper för att säkerställa en smidig implementering av nätverksfunktioner. Jag bidrog också till optimering av nätverksprestanda och säkerhetsfunktioner, vilket jag tror skulle vara relevant i en roll som Lageransvarig hos Testia.

Jag är intresserad av att delta i Testias vision att "Alla vill resa med oss" och har länge varit fascinerad av kollektivtrafik och dess betydelse för samhället. Jag tror att min erfarenhet inom programutveckling, nätverksutveckling och datorlingvistik kan bidra med nyckelinsikter i en roll som Lageransvarig hos Testia.

Tack för din tid och övervägande av min ansökan. Jag är beredd att delta i en personlig intervju för att diskutera mina kompetenser och vad jag kan bidra med till Testias verksamhet.

Med vänliga hälsningar,

Test Testsson

