 Hej!

Jag heter Test Testsson och jag är mycket intresserad av den öppna positionen som lageransvarig hos er. Med min gedigna akademiska bakgrund inom datavetenskap och över två decenniers erfarenhet inom programutveckling, nätverksutveckling och datorlingvistik, tror jag att jag kan bidra med mycket till era team.

Jag har tidigare arbetat som nätverksutvecklare hos Ericsson där jag var ansvarig för utvecklingen av nätverkslösningar för telekommunikationsprodukter och samarbete med tväravdelningsgrupper för att säkerställa en smidig implementering av nätverksfunktioner. Jag bidrog också till optimering av nätverksprestation och säkerhetsfunktioner, vilket ger mig erfarenhet inom både teknik och ekonomi.

Jag är en engagerad programmerare med stark förmåga att arbeta i team och leverera högkvalitativa lösningar. Jag tror också att min passion för att lösa komplexa tekniska problem kan bidra till er framgång inom kollektivtrafikbranschen.

Jag är mycket intresserad av Testias affärsidé och vision, och jag tror att jag skulle kunna passa väl in i er miljö med min fokus på professionell utveckling och strävan efter månghandelse. Jag ser fram emot möjligheten att arbeta tillsammans med Testias team för att skapa ett bättre samhälle genom ökad rörlighet, minskat miljöbelastning och lägre samhällskostnader.

Med vänliga hälsningar,
Test Testsson

