1. Ansökningsbrev (svenska):
```vbnet
Källa: Jobbannonsen och CVt

---

Namn: Test Testsson
Adress: Testvägen 1
Telefon: 111-1111111
E-post: test@testsson.se

Sammanfattning:
Jag söker en tjänst som lageransvarig på Testia i Arlöv. Jag har över två decennier erfarenhet inom programutveckling, nätverksutveckling och datorlingvistik samt en gedigen akademisk bakgrund. Som programmerare är jag engagerad och har stark förmåga att lösa komplexa tekniska problem.

Utbildning:
Magisterexamen i Datavetenskap, Uppsala universitet, 2000

Arbetserfarenhet:
Nätverksutvecklare, Ericsson, 2001
Ansvarig för utveckling av nätverkslösningar för telekommunikationsprodukter. Samarbetade med tvärafdelningsgrupper för att säkerställa en smidig implementering av nätverksfunktioner. Bidrog till optimering av nätverksprestanda och säkerhetsfunktioner.

Kompetenser:
Teknisk kompetens

Personliga egenskaper:
Engagerad, passionerad programmerare med lösningsfokus och stärkt teamarbete. Stark förmåga att arbeta i team och leverera högkvalitativa lösningar.

Referenser:
Tillhandahålls vid förfrågan.
```

