 Hej!

Jag heter Test Testsson och jag är mycket intresserad av den aktuella lediga tjänsten som Lageransvarig hos Testia. Med min mer än två decenniers erfarenhet inom programutveckling, nätverksutveckling och datalingvistik tror jag att jag skulle kunna bidra med mycket till detta team.

Jag är en engagerad och erfaren programmerare med en gedigen akademisk bakgrund från Uppsala universitet, där jag tog magisterexamen i datavetenskap 2000. Sedan dess har jag arbetat som nätverksutvecklare på Ericsson och bidragit till utvecklingen av nätsolutions för telekomprodukter, samarbete med tväravdelningsgrupper för att säkerställa en smidig implementering av nätverksfunktioner och optimering av nätprestanda och säkerhetsfunktioner.

Jag tror verkligen på att förenkla kundens vardagsresor, vilket är Testias affärside och vision. Som lageransvarig skulle jag vara ansvarig för kontrollering och granskning av fakturor som rör underhållet, säkerställa att reservdelar köps in kostnadseffektivt och enligt fastlagda rutiner, samt optimera reservdellagret löpande.

Som person är jag engagerad, har teknisk kompetens och uppfattas som ett bra lagmedlem av mina kollegor och chefer. Jag är övertygad om att min erfarenhet och färdigheter skulle göra mig till en mycket lämpad kandidat för denna tjänst, och jag hoppas verkligen få möjligheten att bidra till Testias fortsatta framgång.

Tack för er tid, och om du har några frågor eller vill diskutera min ansökan vidare, är jag mer än välkommen att göra detta vid ett senare tillfälle.

Med vänlig hälsning,
Test Testsson

