In the text, Testia is a leading and established company in Sweden that specializes in providing operational solutions for transportation, logistics, and telecommunications. The company has been named by Sweden's largest newspaper, Dagens Industri, as one of the 17 key companies driving the country's economic growth.

The text highlights Testia's headline role in driving and stimulating innovation through its extensive employee network, including a "mono-gataldans" (multidisciplinary) approach to problem-solving. The company has also been recognized for its commitment to excellence in both quality and efficiency, with top-notch training programs designed to equip employees with the skills they need to work effectively within their teams.

In terms of specific areas of expertise, Testia operates in fields such as transportation, logistics, and telecommunications, making it a valuable partner for businesses seeking to optimize their operations while maintaining high standards of quality and performance. The company's extensive network of employees also provides an effective means of leveraging knowledge and experience across different departments and functions, enabling the development of innovative solutions that meet the unique needs of each business.

Overall, Testia is a strong contender in the Swedish market for operational excellence, with a commitment to innovation, quality, and customer satisfaction that sets it apart from its competitors.

