 Dear [Recipient],

I am writing to you as an expert in job applications and resumes, specializing in the Swedish language. I have read your CV and job announcement, and I am impressed by your extensive experience and technical skills. 

You are a skilled programmer with over two decades of experience in program management, network analysis, and computer science. You possess a strong passion for solving complex technical problems and delivering high-quality solutions. Your education includes an MSc in Data Science from the University of Stockholm, which is a prestigious degree in this field.

Your work experience includes working as a netscaler engineer at Ericsson, where you were responsible for designing and implementing network solutions for telecommunications companies. This experience shows your ability to work collaboratively with teams and deliver results.

In addition to your technical skills, you have a strong analytical mindset and an excellent understanding of the business side of technology. You have worked as a team leader in Ericsson's IT department, where you were responsible for leading and managing a team of engineers.

I would be delighted to discuss your qualifications with you further and learn more about your career aspirations. Please feel free to reach out to me at [Your Email Address] or [Your Phone Number] if you have any questions or need additional information.

