 | Name  | Ages                               | Contact                                                    | CV                                                                            |
| --- | --- | --- | --- |
| Testia Testsson | 50                              | test@testerson.se                                                | <strong>CV: Curriculum Vitae</strong><br/><br/>Namn: Test Testsson<br/>Alder: 50 år<br/>Kontakt: test@testerson.se<br/>Adress: Testvägen 1<br/>Telefon: 111-111111<br/>E-post: test@testerson.se |
| Expertise: Programmerare, nätverkutvecklare, datorlingvistas.                                                                                                                                                                                                   <br/>Gediga förmåga till att arbeta i team<br/>Starka förmåga att lösa komplexa tekniska problem. |
| Education: Magisterexamen i Datavetenskap, Uppsala universitet, 2000                                                                                                                                                   <br/>Utbildning: Nätverksutvecklare (2001)<br/>
| Work Experience: Nätverksutvecklare (2001-2004), Ericsson, 2001 |

