Högre chefsbefattningar
Testia AB
Att : E-post: recruitment@testia.se
Dato : 2023-04-17

Kära Testia,

Med intresse har jag läst om lediga tjänsten som Lageransvarig på er webbplats och ville därför personligen söka till positionen. Med min bakgrund inom programutveckling och nätverksutveckling tror jag att jag kan bidra med värdefulla färdigheter som lageransvarig i er organisation.

Under min utbildningstid på Uppsala universitet specialiserade jag mig inom datavetenskap och erhöll magisterexamen år 2000. Därefter började jag arbeta som nätverksutvecklare hos Ericsson där jag var ansvarig för utveckling av nätverkslösningar för telekommunikationsprodukter. I rollen bidrog jag till att säkerställa en smidig implementering av nätverksfunktioner och arbetade med tväravdelningsgrupper för att optimera nätverksprestanda och säkerhetsfunktioner.

Mina tekniska färdigheter, erfarenhet av att arbeta i team samt min passion för att lösa komplexa problem gör mig till en framgångsrik kandidat till posten som Lageransvarig på Testia. Jag är övertygad om att jag kan sätta sin erfarenhet och tekniska kompetens till användning för att bidra med värde för er organisation genom att främja effektivitet, optimering och säkerheten inom lagerverksamheten.

Tack för ert intresse och jag ser fram emot möjligheten att diskutera min ansökan och bakgrund i mer detalj. Om behov av ytterligare information eller referenser, tveka inte att kontakta mig via test@testsson.se eller telefon 111-1111111.

Med respekt,
Test Testsson

