 Hej!

Jag är Test Testsson och jag söker platsen som lageransvarig i Arlöv hos er. Jag tror verkligen att min erfarenhet inom programutveckling, nätverksutveckling och datalingvistik kommer att gagna mig i denna roll.

Jag har en gedigen akademisk bakgrund med en magisterexamen i datavetenskap från Uppsala universitet och över två decennier erfarenhet inom programutveckling och nätverksutveckling. Jag har arbetat som nätverksutvecklare hos Ericsson där jag ansvarade för utvecklingen av nätsolutions för telekomprodukter.

Jag tror att min stora erfarenhet inom teknik och samarbete i team kommer att göra mig till en värdefull medarbetare på Testia. Jag är övertygad om att jag kan bidra med kunskaper och erfarenheter som kommer att hjälpa Testia att nå sina mål och förverkliga sin vision "Alla vill resa med oss".

Jag ser fram emot möjligheten att utveckla mig professionellt i denna roll och arbeta tillsammans med ett team av dedikerade kollegor som är engagerade i att främja mångfald och ta tillvara kompetens hos alla.

Tack för att du läste min ansökan! Jag ser fram emot möjligheten att diskutera hur jag kan bidra till Testia på ett närmare plan.

Med vänlig hälsning,
Test Testsson

