Ansökningsbrevet:

Dear [Name of the HR manager or recruiter],

I am excited to apply for the position of Warehouse Manager at Testia in Arlöv. With over 20 years of experience in software development, network development, and computer linguistics, I believe my expertise aligns well with the requirements of this role.

As mentioned on Testia's website, your company strives to create a better society by providing efficient public transportation services. My background in solving complex technical problems and commitment to teamwork make me confident that I can contribute significantly to Testia's mission.

In my last position as a Network Developer at Ericsson, I was responsible for developing network solutions for telecommunication products. This involved collaborating with cross-functional teams to ensure smooth implementation of network features and contributing to the optimization of network performance and security.

I have a Master's degree in Computer Science from Uppsala University (2000) and possess excellent teamwork skills, as well as a strong academic background. I am confident that my expertise and dedication would be valuable assets to Testia.

Thank you for considering my application. I am looking forward to discussing my qualifications further and learning more about the opportunities at Testia.

Best regards,

[Your Name]

