Dear [Job Bank],

Here is your job announcement for a Senior Traffic Manager in the Malmö area:

Headline: [Lageanstalt] Arlöv

Traffic Area: Malmö

Vendor Name: Testia

Traffic Objective: Drive and manage a team of traffic managers, ensuring optimal operation, safety, and efficiency in all transportation activities.

Training & Qualifications:
- Master's degree or equivalent in Traffic Management, Transportation Engineering, or related field
- 17+ years of experience in traffic management with at least 8 years in a supervisory capacity
- Strong knowledge and experience in all aspects of traffic management, including road safety, traffic signaling, congestion management, accident prevention, and traffic operations.

Job Responsibilities:
- Lead the daily coordination of all traffic activities at Arlövsquare (Malmö)
- Provide strategic direction to senior traffic managers on traffic operations and safety
- Coordinate traffic planning and scheduling for a wide range of transportation modes, including road, rail, waterway, and air
- Monitor traffic flow and performance and take appropriate corrective action as necessary
- Supervise the traffic management team at Arlövsquare (Malmö) and ensure optimal operations
- Participate in ongoing training programs to keep up with industry best practices
- Manage all aspects of traffic operations, including accidents, incidents, and emergencies
- Coordinate traffic and public transportation services
- Communicate effectively with stakeholders and authorities, including government agencies and local businesses
- Continuously improve traffic operations through the use of technology, data analysis, and best practices

Candidates must have a Bachelor's degree or equivalent in Traffic Management, Transportation Engineering, or related field. Candidates should also have 8+ years of experience in traffic management with at least 4 years in supervisory roles. A Master's degree or equivalent experience is preferred.

Apply by submitting your CV and a cover letter to [Job Bank] by [date]. This position requires a minimum of six months of continuous employment, and the successful candidate will be offered a full-time, permanent position with competitive salary and benefits package.

Please send inquiries or questions about this job announcement to [Job Bank], and we thank you for your interest in Testia's services.

Best regards,

[Your Name]
[Your Title]
[Job Bank]


