🌐 Testia - Lageransvarig Arlöv 🌐
==================================

Dear Hiring Manager,

I am writing to express my keen interest in the position of Lageransvarig Arlöv at Testia. I found the job advertisement on your company's website and was immediately drawn to the opportunity to work for Sweden's largest and most experienced operator in the public transport sector. Your commitment to providing a better quality of life through increased mobility, reduced environmental impact, and lower societal costs resonates with my values and career aspirations.

With over two decades of experience in program development, network development, and computer science, I am confident that my technical expertise and passion for solving complex problems make me an ideal candidate for this role. My strong background in teamwork, combined with a solid education in Datavetenskap from Uppsala University, has equipped me with the necessary skills to contribute effectively to your organization's goals.

In my current position as a Nätverksutvecklare at Ericsson, I have gained extensive experience in developing network solutions for telecommunications products. I have also been responsible for ensuring seamless implementation of network functions across different teams, which has honed my problem-solving abilities and ability to work effectively with diverse groups of professionals.

I am excited about the opportunity to apply my skills and experience in a new and challenging environment that values diversity and promotes professional growth. I believe that my technical competencies, combined with your company's commitment to innovation, will enable me to make a significant impact on Testia's success.

I would be delighted to discuss my qualifications further in an interview and look forward to contributing to your organization's continued growth and success. Thank you for considering my application, and I am available at your convenience for any additional information or clarification.

Sincerely,

[Your Name]

