Ansökan:

Test Testsson
test@testsson.se
012 345 6789

Arlöv, 2023-05-15

Testia AB

Kära ansvarige,

 Jag är en erfaren och engagerad lageransvarig med omkring två decenniers erfarenhet inom logistik och materialhantering. Mitt syfte är att använda min tekniska kompetens och min erfarenhet för att bidra till en effektiv och kostnadseffektiv kollektivtrafik i Testias trafikområde Malmö.

Enligt dina önskemål skulle jag ansvara för kontering och granskning av fakturor, säkerställa löpande att inskrivning av reservdelar sker och att lagersaldon är korrekta, samt arbeta aktivt med 5S-metoden. Jag är också bekant med SQA (Supplier Quality Assurance) och har erfarenhet av att arbeta tätt med team för att leverera högkvalitativa lösningar.

Mina yrkeserfarenheter inkluderar arbete som nätverksutvecklare hos Ericsson, där jag var ansvarig för utveckling av nätverkslösningar och samarbetade med tväravdelningsgrupper för att säkerställa en smidig implementering av nätverksfunktioner.

Med min akademiska bakgrund, min passion för teknik och min erfarenhet inom teamarbete tror jag att jag skulle vara en lämplig kandidat för denna position. Jag skulle älska möjligheten att arbeta med Testia för att bidra till ökad rörlighet, minskad miljöbelastning och lägre samhällskostnader i Malmös kollektivtrafik.

Tack för övervägandet av mitt ansökande. Jag är uppmuntrad och väntar på möjlighet att diskutera mina möjligheter med Testia vidare i ansökningsprocessen.

Med vänliga hälsningar,

Test Testsson

