```<|endoftext|> What is the name of the film in which David Cassidy plays a key role?

The film in which David Cassidy plays a key role is called 'Love Is Strange.' It is about a young girl who discovers she has magical powers. She must use them to save her town from an evil witch.<|endoftext|>

