Here is a draft of the application letter:

Lageransvarig Arlöv

Testia, Trafikområde Malmö

Jag vill härmed söka tjänsten som Lageransvarig vid Testia i Arlöv. Med min tekniska kompetens och erfarenhet inom programutveckling och nätverksutveckling är jag övertygad om att kunna bidra till effektiviteten och kvaliteten i er lagerhantering.

Jag har en gedigen akademisk bakgrund med en magisterexamen i Datavetenskap från Uppsala universitet. Under min karriär som nätverksutvecklare på Ericsson har jag utvecklat starka färdigheter inom teamarbete, problemlösning och kommunikation.

I min nuvarande roll har jag ansvarat för utveckling av nätverkslösningar för telekommunikationsprodukter, vilket har gett mig erfarenhet av att hantera komplexa tekniska problem. Jag är övertygad om att mina färdigheter och kunskaper kommer att vara till stor nytta i rollen som Lageransvarig.

Jag är imponerad av Testias vision och affärsidé att "Förenkla kundens vardagsresor" och strävan mot att "Alla vill resa med oss". Jag delar er tro på mångfald och att det berikar personer, grupper och företag. Jag är övertygad om att mina personliga egenskaper och erfarenhet kommer att passa väl in i Testias team.

Jag har läst igenom ansvarsområdena för Lageransvarig och är säker på att kunna hantera uppgifter som kontering och granskning av fakturor, inköp av reservdelar, lagersaldo och inventeringar. Jag är också redo att arbeta aktivt med 5S-lager och samarbeta med SQA-ansvarig för att ge förutsättningar/material att driva SQA.

Jag vill tacka för möjligheten att söka tjänsten som Lageransvarig vid Testia. Jag ser fram emot att diskutera min ansökan vidare.

Med vänliga hälsningar,

Test Testsson

