Subjekt: Ansökning om tjänsten Lageransvarig i Arlöv

Dear Testia-team,

I am writing to express my strong interest in the position of Lageransvarig at your Arlöv location. With more than two decades of experience in programming, network development, and computational linguistics, I believe that I possess the required technical competencies and teamworking skills necessary for this role.

Having earned a Master's degree in Computer Science from Uppsala University in 2000, I am well-versed in the technical aspects of software development and network engineering. In addition to my strong academic background, I have accumulated a wealth of hands-on experience during my tenure at Ericsson, where I was responsible for developing networking solutions for telecommunications products.

Throughout my career, I have consistently demonstrated my ability to collaborate with cross-functional teams and deliver high-quality solutions that meet or exceed expectations. In particular, I am proud of my contributions to the optimization of network performance and security features in my previous role at Ericsson.

I am confident that my technical expertise, problem-solving skills, and experience working in a team environment make me an ideal candidate for the Lageransvarig position at Testia. Your commitment to fostering a diverse workforce and promoting a culture of innovation is especially appealing to me. I look forward to the opportunity to discuss how my background and skills can contribute to your continued success in providing reliable and efficient bus transportation services throughout Malmö and beyond.

Please find attached a copy of my Curriculum Vitae for your reference. Should you require any further information or references, please do not hesitate to contact me at test@testsson.se or (111) 111-111111.

Thank you for considering my application. I eagerly await the opportunity to discuss my qualifications in more detail and learn about the exciting opportunities that await a Lageransvarig at Testia.

Sincerely,

Test Testsson

