´Hej Test Testsson,

Jag ansöker om jobbet som lageransvarig i Arlöv. Jag har över två decenniers erfarenhet inom programutveckling, nätverksutveckling och datorlingvistik, vilket jag tror kommer att vara av stor värde i din roll som lageransvarig.

Min akademiska bakgrund är magisterexamen i Datavetenskap från Uppsala universitet och jag har en stark passion för att lösa komplexa tekniska problem. Jag har också erfarenhet av att arbeta i team och leverera högkvalitativa lösningar.

Jag är övertygad om att min tekniska kompetens skulle vara ett starkt tillskott till din verksamhet och jag ser fram emot att få utforska möjligheten att arbeta med Testia som lageransvarig i Arlöv.

Med vänliga hälsningar,
Test Testsson

