🧐 Erbjudande: Ansökan som Sökande (se nedan):

---

Namn: Test Testsson   Ålder: 50 år   Kontakt: [test@testsson.se](mailto:test@testsson.se)   Adress: Testvägen 1, 111 111 111    Telefon: 111-111 111    E-post: [test@testsson.se](mailto:test@testsson.se)

Sammanfattning:
En erfaren och engagerad programmerare med över två decenniers erfarenhet inom programutveckling, nätverksutveckling och datorlingvistik. Har en gedigen akademisk bakgrund och en passion för att lösa komplexa tekniska problem. Stark förmåga att arbeta i team och leverera högkvalitativa lösningar.

Utbildning:
Magisterexamen i Datavetenskap, Uppsala universitet, 2000

Arbetserfarenhet:
Nätverksutvecklare   Ericsson, 2001   Ansvarig för utveckling av nätverkslösningar för telekommunikationsprodukter. Samarbetade med tvärafdelningsgrupper för att säkerställa en smidig implementering av nätverksfunktioner. Bidrog till optimering av nätverksprestanda och säkerhetsfunktioner.

Referenser:   Tillhandahålls vid förfrågan.

---

🧐 Ansökan:

Hej Testia,

Jag skriver till er med mitt CV som ansökan angående ledigheten som Lageransvarig i Arlöv. Jag tror att min erfarenhet och kompetenser gör mig en lämplig kandidat för denna roll.

Under mina över tio års erfarenhet inom programutveckling, nätverksutveckling och datorlig vetenskap har jag utvecklat en gedigen akademisk bakgrund och en passion för att lösa komplexa tekniska problem. Jag har också utvecklat en stark förmåga att arbeta i team och leverera högkvalitativa lösningar.

Min tidigare roll som nätverksutvecklare på Ericsson gav mig flera erfarenheter inom programutveckling, säkerhetskopieringar och nätverksimplementering för telekommunikationsprodukter. Jag har också arbetat med att samarbeta med tväräldersgrupper för att säkerställa en smidig implementering av nätverksfunktioner. Dessutom har jag bidragit till att optimera nätverksprestanda och säkerhetsfunktioner.

Jag är övertygad om att min erfarenhet och kompetenser skulle vara en värdefull tillgång för Testia i rollen som Lageransvarig i Arlöv. Jag ser fram emot att höra av mig från er och diskutera mina chanser mer i detalj.

Med vänliga hälsningar,
Test Testsson

