Dear Hiring Manager,

I was delighted to find your job posting for the Lageransvarig position in Arlöv at Testia. As an experienced programmer with over two decades of experience in software development, network engineering, and computer linguistics, I am excited about the opportunity to contribute my skills to your team. My academic background in Computer Science from Uppsala University complemented by my proven track record make me a strong candidate for this role.

In my previous role as a Network Engineer at Ericsson, I was responsible for developing network solutions for telecommunication products. Collaborating with cross-functional teams ensured seamless integration of network functions. I also contributed to improving network performance and security features.

I am impressed by Testia's commitment to providing contracted public transportation services and contributing to a better society through increased mobility, reduced environmental impact, and lower social costs. As someone who is passionate about solving complex technical problems and working in teams to deliver high-quality solutions, I believe that my skills can be of great value to your company.

Please find attached my CV for your review. I am confident that my experience and qualifications make me a strong fit for the Lageransvarig position at Testia. I would appreciate the opportunity to discuss how I might contribute to your organization's success further. Thank you for considering my application.

Sincerely,
Test Testsson

