 Hej, min kandidat är en av de flest erbjudda och talangfulla tävlars som du kommer möta. Vi ser till att hantera utmaningarnas med flesta genom att leverera kontrakterad kollektivtrafik med det stöd jag och vår organisation Skånetrafiken kan låta dig.

Läs mer om tiden och inverkan som jag kommer, för närvarande, att komma och hantera jobb. Vi vill ha en person som är uppmärksam och som inte är förvuxet, som kommer med erfaringar och kunnskaper i samarbete med oss.

Som nämnvanter, vi arbetar för att stödja dem som går i vägen för detta genom att leverera kontrakterad kollektivtrafik och tänka om saker som skiljer sig långsidigt med fokus på minnesvärlden.

Teknisk kompetenser är viktig, men vila och personlighet är viktigast. Vi vill att kandidaten kommer att kunna välja vad som bästa får sig ut i jobbet, och jag tar allt för hjärtat och tillgånsen.

Så kom tillbaka och saj med frågor om vi kan hjuta dig!

