 Hej,

Jag heter Test Testsson och jag är mycket intresserad av er lediga position som Lagersvarig i Arlöv hos Testia. Med över två decenniers erfarenhet inom programutveckling, nätverksutveckling och datalingvistik tror jag att jag har den relevanta bakgrunden för att bidra till er framgångsrika verksamhet.

Jag är en engagerad programmerare med en gedigen akademisk bakgrund och en passion för att lösa komplexa tekniska problem. Jag har arbetat som nätverksutvecklare på Ericsson där jag ansvarade för utvecklingen av nätverkslösningar för telekommunikationsprodukter. Min starka förmåga att arbeta i team och leverera högkvalitativa lösningar har bidragit till optimering av nätsprästationer och säkerhetsfunktioner.

Jag ser fram emot möjligheten att utvecklas professionellt i en utmanande roll och stimulerande miljö som kombinerar människor, ekonomi och teknik hos Testia. Jag är övertygad om att min tekniska kompetens och erfarenhet kan bidra till att förbättra kontrollen av fakturor och inköp av reservdelar på ett kostnadseffektivt sätt, samtidigt som jag garanterar korrekta lagersaldon och optimalisering av reservdellagret.

Jag är engagerad i att främja mångfald och ta tillvara kompetens hos alla medarbetare oavsett kön, sexuell läggning, könsöverskridande identitet eller uttryck, etnicitet, ålder, religion eller annan trosuppfattning. Jag ser fram emot att samarbeta med SQA ansvarig för att ge förutsättningar/material till en effektiv och smidig implementering av nätsfunktioner.

Jag är övertygad om att jag skulle kunna bidra positivt till Testias verksamhet som Lagersvarig i Arlöv och jag ser fram emot möjligheten att diskutera min kandidatur vidare. Tack för er tid och uppmärksamhet.

Med vänliga hälsningar,
Test Testsson

