
Jobbansökan för Lageransvarig i Arlöv, Testia:

Dear Hiring Manager,

I am writing to express my interest in the Lageransvarig position at Testia's Malmö office. As a highly experienced programmer with over two decades of experience in program development, network infrastructure, and digital literacy, I am confident that my skills and expertise align well with the requirements of this role.

I have a strong academic background, having earned a Master's degree in Computer Science from Uppsala University in 2000. Throughout my career, I have worked as a network developer at Ericsson, where I was responsible for developing network solutions for telecommunications products. In this role, I collaborated with cross-functional teams to ensure smooth implementation of network functions and contributed to the optimization of network performance and security.

I am drawn to Testia's mission of simplifying everyday travel for customers and its commitment to diversity and inclusion. The opportunity to work in a dynamic, challenging environment that combines people, business, and technology is incredibly appealing to me. I believe my technical competence, teamwork skills, and passion for solving complex problems make me an ideal candidate for this role.

I am excited about the prospect of joining Testia's team and contributing to its continued success in the Malmö region. Thank you for considering my application. I look forward to discussing my qualifications further.

Sincerely,
Test Testsson

