 Du är en expert på att skriva svenska ansökningsbrev, given ett CV och en jobbannons, så att det så gott som möjligt förstås att den sökande är en lämplig kandidat för jobbet givet sin bakgrund. Du skriver breven på svenska.

Ansökningsbrev:
HEADLINE: Lageransvarig Arlöv
TEXT: Testia är Nordens största och mest erfarna operatör inom kollektivtrafik. Vi ser till att över en miljon människor dagligen kommer till sitt jobb, sin skola eller andra aktiviteter genom att leverera kontrakterad kollektivtrafik på uppdrag av samhället.
Vår framgång skapar ett bättre samhälle i form av ökad rörlighet, minskad miljöbelastning och lägre samhällskostnader. Läs mer på www.testia.se

Trafikområde Malmö är ett av Testia 17 trafikområden i Sverige. Med drygt 800 medarbetare och 260 bussar ansvarar vi för att, i samarbete med vår uppdragsgivare Skånetrafiken, driva och utveckla busstrafiken i Malmö.

Vi erbjuder
Vi ger dig möjligheten att utvecklas professionellt i en utmanande roll och stimulerande miljö som kombinerar människor, ekonomi och teknik.

Alla medarbetare på Testia får en bra introduktion och stora möjligheter till utveckling som person. Hela vårt arbetssätt präglas av vår affärsidé att ”Förenkla kundens vardagsresor” och strävan mot vår vision att ”Alla vill resa med oss”.
Testia är ett mångfaldens företag. Vi tror på mångfald och att det berikar personer, grupper och oss som företag. På Testia arbetar vi aktivt med att främja mångfald och att ta tillvara kompetens hos alla medarbetare oavsett kön, sexuell läggning, könsöverskridande identitet eller uttryck, etnicitet, ålder, religion eller annan trosuppfattning. Vi välkomnar olikheter!

Ansvarsområden:
Ansvarig för kontering och granskning av fakturor tillhörande Underhållet
Ansvarig för att reservdelar köps in kostnadseffektivt och enligt fastlagda rutiner
Säkerställa löpande att inskrivning av reservdelar sker och att lagersaldon är korrekta
Ansvarig för att säkerställa att alla resurser som behövs för Underhållets verksamhet levereras på tid och kostnad
Ansvarig för att utveckla och genomföra strategier för effektiv logistik inom Underhållet

Kvalifikationer:
Minimum en kandidatexamen i ingenjörsvetenskap, ekonomi eller motsvarande
Minimum 5 år erfarenhet inom logistik, leverans och/eller underhåll av storförbrukningsefterlevnadsresurser
Erfarenhet från arbete med projekt- eller processhantering
Erfarenhet från att jobba i ett team och samarbeta med andra funktioner inom organisationen

Personliga egenskaper:
Förnyelseverksam, resultatinriktad, kundinriktad, integritet, ledarskicklighet, kompetensutveckling

CV:

(Observera att ansökningsbrevet ska skrivas på svenska)

