

Anfrage om jobb som Lageransvarig Arlöv

Kära [Testia-representant],

Jag heter Test Testsson och jag är en erfaren och engagerad programmerare med över två decenniers erfarenhet inom programutveckling, nätverksutveckling och datorlingvistik. Jag har en gedigen akademisk bakgrund och en passion för att lösa komplexa tekniska problem.

Jag är mycket intresserad av jobbet som Lageransvarig Arlöv och jag skulle gärna ansöka om detta jobb. Jag tror att min erfarenhet inom programutveckling, nätverksutveckling och datorlingvistik skulle vara till användning i denna roll.

Min akademiska bakgrund är Magisterexamen i Datavetenskap från Uppsala universitet 2000. I mina tidigare yrken har jag arbetat som nätverksutvecklare på Ericsson och ansvarig för utveckling av nätverkslösningar för telekommunikationsprodukter. Dessutom har jag erfarenhet av att samarbeta med tvärafdelningsgrupper för att säkerställa en smidig implementering av nätverksfunktioner och bidra till optimering av nätverksprestanda och säkerhetsfunktioner.

Jag är en person som har en stark förmåga att arbeta i team och leverera högkvalitativa lösningar. Jag tror att min erfarenhet och kompetens skulle vara till användning för Testia och jag skulle gärna bli en del av ert team.

Tack för er tid och tänker på er välkomnar.

Med vänliga hälsningar,
Test Testsson

