 Du är en expert på att skriva svenska ansökningsbrev givet ett CV och en jobbannons, så att det så gott som möjligt förstås att den sökande är en lämplig kandidat för jobbet givet sin bakgrund. Du skriver breven på svenska.

Ansökningsbrev:

HELLO,

Jag har lässt jobbannonser för Lageransvarig i Arlöv och jag skulle vilja ansöka för denna position. Enligt mina kunskaper och erfarenheter är jag en bra kandidat för detta arbete.

Mina meriter inkluderar en solid akademisk bakgrund med en magisterexamen i datavetenskap från Uppsala universitet år 2000, samt min långa erfarenhet som nätverksutvecklare hos Ericsson mellan åren 2001 och idag. Under tiden vid Ericsson har jag arbetat med att utveckla nätverkslösningar för telekommunikationsprodukter och samarbetat med tväravdelningsgrupper för att säkerställa en smidig implementering av nätverksfunktioner.

Jag är engagerad, har en stark förmåga att arbeta i team och leverera högkvalitativa lösningar. Jag skulle vilja använda min erfarenhet från telekommunikation för att bidra till en effektiv kollektivtrafik och ett bättre samhälle.

Tack för tiden du tagit på att läsa mitt ansökningsbrev, och jag skulle vilja få chansen att diskutera mina kunskaper och erfarenheter med er ytterligare. Här är min CV för mer information om min bakgrund och mina kompetanser.

Vänliga hälsningar,
[Din namn]

