🌐 Testia - Nordens största och mest erfarna operatör inom kollektivtrafik ➡️ Vi samlar in CV:ar för vårt trafikområde Malmö!

Hej [Namn på sökande],

Vi har hittat ditt fullständiga CV och tycker att du skulle vara en lämplig kandidat att ansöka om jobbet som Lageransvarig Arlöv i vårt trafikområde Malmö. Vi ser fram emot att höra mer om din erfarenhet och hur du kan bidra till vår fortsatta framgång.

Ditt fullständiga CV finns på [Länk till CV:t].

Vi har också tagit reda på att du har en gedigen akademisk bakgrund i datavetenskap samt mer än två decenniers erfarenhet inom programutveckling, nätverksutveckling och datorlingvistik. Dessutom har du stark förmåga att arbeta i team och leverera högkvalitativa lösningar, vilket passar perfekt med vår affärsidé "Förenkla kundens vardagsresor".

Vi är övertygade om att du skulle göra en utmärkt Lageransvarig Arlöv och skulle vara en stor fördel för vårt trafikområde Malmö. Vi ser fram emot att höra av dig!

Ha det fint,
Testia - Nordens största och mest erfarna operatör inom kollektivtrafik

Nästa steg: Ansök till jobbannonsen via länken nedan ➡️ [Länk till ansökningsformuläret]

Vi vill påminna dig om att du inte ska använda några personuppgifter i din ansökan. Vi ser fram emot att höra från dig!

