👋 Test Testsson
Ålder: 50 år
Adress: Testvägen 1, 111-1111111 (Malmö)
E-post: [test@testsson.se](mailto:test@testsson.se) | Telefon: +46 46-123 45 67
CV: <http://www.testsson.se/curriculum-vitae>

Namn: Test Testsson
Ålder: 50 år
Adress: [Testvägen 1, 111-1111111 (Malmö)]
E-post: [test@testsson.se](mailto:test@testsson.se) | Telefon: +46 46-123 45 67
CV: <http://www.testsson.se/curriculum-vitae>

[Test Testsson, 50 år]
Malmö, Sverige
Telefonsamtal: +46 46-123 45 67 | Epost: [test@testsson.se](mailto:test@testsson.se)

Anmäl dig till rollen som Lageransvarig Arlöv på Testia!

Kontryfterna: Erfaren teknisk kompetens & engagemang i att säkerställa löpande och kostnadseffektiva transportsystemer.

Minnessång om din erfarenhet inom programutveckling, nätverksutveckling och datorteknik kan stärka mig! För detta är jag vänligst och ber om chansen att visa upp min kompetens i en utmanande roll som Lageransvarig Arlöv på Testia.

Som teknisk kompetent medarbetare har jag över två decennierers erfarenhet inom programutveckling, nätverksutveckling och datorteknik. Mina tidigare yrken som nätverksutvecklare på Ericsson och senast ansvarig för utveckling av programsystem har gett mig en gedigen akademisk bakgrund och ett passionerat engagemang att lösa komplexa tekniska problem.

Min styrka som teamspelare, tillsammans med min starka förmåga att leverera högkvalitativa lösningar, har gjort mig till en ledande tekniker inom mitt tidigare arbetsliv. Jag är övertygad om att dessa egenskaper kommer att vara av värde i rollen som Lageransvarig Arlöv på Testia, där jag kan samarbeta med er framgångsrika team för att säkerställa en effektiv och kvalificerad lagerverksamhet.

Testias vision om att skapa ett bättre samhälle genom kontinuerlig utveckling av kollektivtrafiken är inspirerande. Jag tror på Testias affärsidé, att förenkla människors resor och strävar efter er vision att Alla vill resa med oss. Som person med erfarenhet inom teknik och teamarbete inser jag värdet av att arbeta tillsammans för en gemensam uppgift, och jag är övertygad om att Testia kan bjuda på en utmanande och givande miljö där min kompetens blir en värdefull tillskott.

Jag ser fram emot att få utmana mig i rollen som Lageransvarig Arlöv på Testia. Jag skulle vara ert glada anställda, beredd att arbeta hårt för att säkerställa en lönsam och framgångsrik verksamhet.

Med er vänliga tveksamhet,
Test Testsson

