Here is a job application letter in Swedish, tailored to the Lageransvarig Arlöv position at Testia:

**Ansökan om Lageransvarig Arlöv**

[Your Name]
[Your Address]
[City, Postal Code]
[Email Address]
[Phone Number]

[Datum]

Testia
Trafikområde Malmö
[Aadress]
[Malmö, Postal Code]

Kära rekryterare,

Jag är mycket intresserad av att söka tjänsten som Lageransvarig Arlöv på Testia. Med min tekniska bakgrund och erfarenhet inom logistik och kvalitetskontroll är jag övertygad om att jag kan bidra till att förbättra effektiviteten i ert lagerarbete.

Som erfaren programmerare med över två decenniers erfarenhet inom programutveckling, nätverksutveckling och datorlingvistik har jag utvecklat en stark förmåga att analysera komplexa problem och leverera högkvalitativa lösningar. Min gedigna akademiska bakgrund i datavetenskap från Uppsala universitet har gett mig en solid grund för att hantera tekniska utmaningar.

I min tidigare roll som nätverksutvecklare på Ericsson har jag haft ansvar för utveckling av nätverkslösningar för telekommunikationsprodukter, vilket har gett mig värdefull erfarenhet inom området. Jag har även arbetat i tväravdelningsgrupper för att säkerställa en smidig implementering av nätverksfunktioner.

Jag är imponerad av Testias vision att "Alla vill resa med oss" och är övertygad om att min erfarenhet och kunskap kan bidra till att förbättra kundens vardagsresa. Jag delar också företagets mångfaldsåsikter och ser fram emot att arbeta i en miljö som uppmuntrar olikheter.

Jag har bifogat mitt CV för din referens. Jag vill gärna diskutera hur min erfarenhet och kunskap kan bidra till Testias framgång.

Tack för din tid och jag ser fram emot att höra från dig snart.

Med vänliga hälsningar,

Test Testsson

