 Dear [Herr|@],

I hope this email finds you well! We're currently in the process of reviewing your application for a job at Testia. I understand that this company seems exciting and could potentially offer a rewarding career to anyone who is passionate about delivering exceptional service. 

As an expert on how to write Swedish CVs, I am familiar with the guidelines for writing such documents in Sweden. I would like to give you some feedback on your application and explain what we need from you. 

Firstly, please ensure that your text is written in a clear and concise manner. In this case, the text seems to be somewhat lengthy and could benefit from being broken into smaller sections or sentences. Additionally, the use of capital letters for important terms such as titles and positions may seem unnecessary at this stage. 

Secondly, you mention that you have experience in various areas such as programming, network engineering, and project management. While this is generally a strong foundation, it might be helpful to briefly describe your specific achievements or contributions in each of these fields. This could help our team better understand how your skills can contribute to the success of Testia's projects.

As for the work you have done at [Company|@], please provide examples of projects or tasks you have taken on that demonstrate your passion and expertise. It would also be helpful if you could include information about any certifications or awards you may have received as a result of your contributions. 

Lastly, please ensure that all references are accurate and relevant to your job application. We will need the contact information for each reference and we want to make sure they are available to provide us with their endorsement.

Please be advised that your responses must be submitted as a single PDF file. To ensure timely processing, please send your documents through email. Once received, we will review your application and respond accordingly. 

Thank you for considering Testia's opportunity to support your professional development. We look forward to hearing from you!

Sincerely,
[Your Name|@]

