Dear Hiring Manager,

I am writing to express my interest in the Lageransvarig position at Testia in Arlöv. As a highly experienced programmer with over two decades of experience in program development, network engineering, and digital linguistics, I am confident that my skills and expertise make me an ideal candidate for this role.

I hold a Master's degree in Computer Science from Uppsala University, where I developed a passion for solving complex technical problems. My strong ability to work in teams and deliver high-quality solutions has been honed through my experience as a Nätverksutvecklare at Ericsson, where I was responsible for developing network solutions for telecommunications products.

I am particularly drawn to Testia's mission of simplifying daily commutes and striving towards the vision of "All want to travel with us." As someone who values diversity and inclusion, I appreciate Testia's commitment to promoting mangfold and taking competence development seriously for all employees, regardless of their background.

I am confident that my technical skills, experience, and passion for problem-solving make me an excellent fit for the Lageransvarig position at Testia in Arlöv. Thank you for considering my application. I look forward to discussing how my skills can contribute to your team.

Sincerely,
Test Testsson

