Dear Hiring Manager,

I am writing to express my interest in the position of Warehouse Manager at Testia, as advertised on your job announcement for Arlöv. As an experienced professional with a solid background in logistics and warehouse management, I believe that my skills and expertise would be a valuable addition to your team.

Throughout my career, I have consistently demonstrated strong leadership abilities, excellent organizational skills, and a keen eye for process improvements. In my current role as Warehouse Manager at XYZ Corporation, I am responsible for overseeing the daily operations of our 20,000 square foot warehouse facility, which serves over 50 clients across multiple industries. My responsibilities include inventory management, procurement, quality assurance, staff supervision, and cost control.

In addition to my hands-on experience, I hold a Bachelor's degree in Business Administration with a focus on Supply Chain Management from the University of Upsala. This academic background has provided me with a comprehensive understanding of logistics principles and best practices, which I have successfully applied in various warehouse environments throughout my career.

Some key achievements from my time at XYZ Corporation include:

- Successfully implementing an inventory management system that reduced stockouts by 30% and increased order accuracy to 99%.
- Streamlining procurement processes, resulting in a 15% reduction in purchasing costs.
- Developing and leading a team of 10 warehouse personnel, fostering a culture of continuous improvement and accountability.

I am confident that my skills and experience make me an ideal candidate for the Warehouse Manager position at Testia. I would welcome the opportunity to further discuss how my qualifications align with your organization's goals and needs.

Thank you for considering my application. I look forward to the possibility of meeting with you to discuss this exciting opportunity in greater detail.

Sincerely,

Test Testsson

