 Ansökningsbrev för Lageransvarig i Arlöv med bakgrund från CV:

Dear Testia,

Jag är intresserad av den öppna positionen som Lageransvarig i Arlöv och jag tror att min bakgrund gör mig en lämplig kandidat för jobbet. Enligt mitt CV jag har ett riktigt bakhåll av erfarenhet inom programmering, nätverksutveckling och datorlingvistik. Med mer än två decenniers erfarenhet inom branschen är jag en säker val i denna roll.

Jag har en magisterexamen i datavetenskap från Uppsala universitet år 2000 och mitt arbete innefattar tidigare erfarenheter som nätverksutvecklare hos Ericsson mellan 2001 och nu. Här jag har varit ansvarig för utveckling av nätverkslösningar för telekommunikationsprodukter och samarbetat med olika avdelningar inom företaget för att säkerställa en smidig implementering av nätverksfunktioner. Min erfarenhet har gett mig en stark förmåga att arbeta i team och leverera högkvalitativa lösningar.

Jag skulle vilja tillhandahållas med mer information om jobbet och vad du ser som mina ansvarsområden och uppgifter, så att jag kan se om mitt CV fyller in de krav du söker. Hela tiden är jag intresserad av att delta i ett team där jag kan använda min erfarenhet och kunskap för att bidra till Testias framgång och kontinuerliga utveckling.

Tack för din tid och översikt över er jobbannonser, och jag hoppas höra från dig snart.

Hövligast,

Test Testsson

