>>ABSTRACT<<
>>ABSTRACT<<
>>ABSTRACT<<
>>ABSTRACT<<
>>ABSTRACT<<>>ABSTRACT<<>>ABSTRACT<<>>ABSTRACT<<>>ABSTRACT<<>>ABSTRACT<<>>ABSTRACT<<>>ABSTRACT<<>>ABSTRACT<<>>ABSTRACT<<>>ABSTRACT<<>>ABSTRACT<<>>ABSTRACT<<>>ABSTRACT<<>>ABSTRACT<<>>ABSTRACT<<\

