 Ansökningsbrev baserat på den given jobbannonsen och CV:t

Dear testia,

Jag har lässt genom din annons om Lageransvarig i Arlöv och mitt intresse för denna position har blivit uppriktigt. Ännu mer intresserad jag mig av er organisation och vision att "alla vill resa med oss" och min egen bakgrund i programmering, nätverksutveckling och datorlingvistik gör mig förtrogen med tekniska lösningar som kan bidra till en effektiv kollektivtrafik.

Med mer än två decenniers erfarenhet inom datavetenskap, närvarande på Uppsala universitet, och ett stort intresse för att lösa komplexa tekniska problem tror jag att jag skulle kunna bidra med en stark kombination av min tekniska bakgrund och erfarenhet inom teamarbetet.

Jag har tidigare arbetat som Nätverksutvecklare för Ericsson där jag var ansvarig för utvecklingen av nätverkslösningar för telekommunikationsprodukter och samarbetade med tväravdelningsgrupper för att säkerställa en effektiv implementering av nätverksfunktioner. Min erfarenhet inom nätverksprestanda och säkerhetsfunktioner har gett mig en djup insikt i vad det tar att optimera system för hög prestanda och trygghet.

Jag tror att min bakgrund i programmering, nätverksutveckling och datorlingvistik passar bra för rollen som Lageransvarig hos Testia och jag skulle värda en möjlighet att prata mer om denna position. Hittills har jag inte haft chansen att arbeta inom kollektivtrafik, men jag är intresserad av ett nytt utmanande miljö och en möjlighet att använda min teknisk bakgrund för att påverka positiva ändringar i den dagliga rutinen för människor över hela Norden.

Tack för er tid och intresse, jag ser långt framof att jobba tillsammans med Testia för att öka rörligheten, minska miljöbelastningen och lägre samhällskostnader i regionen.

Vänligt hälsningar och hoppfullyt,

Test Testsson

