👋 Hej!

Jag, Test Testsson, 50 år gammal programmerare och magisterexamen i Datavetenskap från Uppsala universitet (2000), söker en ny utmaning som lageransvarig på Testia i Arlöv. Jag har över två decenniers erfarenhet inom programutveckling, nätverksutveckling och datorlig vetenskap, samt en stark passion för att lösa komplexa tekniska problem.

Under mina senaste år på jobbet har jag utvecklat min expertis i att arbeta i team och leverera högkvalitativa lösningar. Som nätverksutvecklare på Ericsson (2001) ansvarig för utveckling av nätverkslösningar för telekommunikationsprodukter, bidrog jag till optimering av nätverksprestanda och säkerhetsfunktioner.

Jag tror på Testias vision att ”Alla vill resa med oss” och är övertygad om att min erfarenhet och kompetens skulle vara en värdefull tillskott för teamet i Arlöv. Jag ser fram emot att ha en aktuell roll där jag kan använda mina färdigheter för att säkerställa löpande och optimala lagerfunktioner samt arbeta aktivt med 5S-metoden.

Med detta ansökningsbrev visar jag min engagemang för jobbet som lageransvarig på Testia i Arlöv, och hoppas att få möjligheten att prata mer om mina kompetenser och erfarenheter under en intervju.

Med vänliga hälsningar,
Test Testsson

