1. Ansökningsbrev (Svenska):
```vbnet
KONTRACTERAD ANSÖNING

För att be om jobbet som Lageransvarig vid Testia i Arlöv

Namn:   Test Testsson
Adress:  Testvägen 1, 301 87 Arlöv
E-post:  [test@testsson.se](mailto:test@testsson.se)
Telefon: +46 42 123 4567

Sammanfattning:
Jag, Test Testsson, söker jobbet som Lageransvarig vid Testia i Arlöv. Jag har över två decennier erfarenhet inom programutveckling, nätverksutveckling och datorlingvistik samt en gedigen akademisk bakgrund. Mina starka förmågor att arbeta i team och leverera högkvalitativa lösningar gör mig till en lämplig kandidat för denna roll.

Utbildning:
Magisterexamen i Datavetenskap, Uppsala universitet, 2000

Arbetserfarenhet:
Nätverksutvecklare, Ericsson, 2001
Ansvarig för utveckling av nätverkslösningar för telekommunikationsprodukter. Samarbetade med tväravdelningsgrupper för att säkerställa en smidig implementering av nätverksfunktioner. Bidrog till optimering av nätverksprestanda och säkerhetsfunktioner.

För att få mer information om mitt arbetsliv, se referenser som tillhandahålls vid förfrågan.

Med vänliga hälsningar,
Test Testsson
```
1. Referens (Svenska):

Namn: Test Testsson
Adress: [test@testsson.se](mailto:test@testsson.se)
Telefon: +46 42 123 4567
E-post: [test@testsson.se](mailto:test@testsson.se)

Sammanfattning:
Test Testsson har över två decennier erfarenhet inom programutveckling, nätverksutveckling och datorlingvistik samt en gedigen akademisk bakgrund. Som nätverksutvecklare vid Ericsson ansvarig för utveckling av nätverkslösningar för telekommunikationsprodukter, samarbetade Test med tväravdelningsgrupper för att säkerställa en smidig implementering av nätverksfunktioner. Bidrog till optimering av nätverksprestanda och säkerhetsfunktioner.

Med vänliga hälsningar,
[Referensnamn]

