📄 Ansökningsbrev (Svenska)

Namn: Test Testsson
Adress: Testvägen 1, [Postadress]
Telefon: 111-1111111
E-post: test@testsson.se

HEADLINE: Ansökan på Lageransvarig Arlöv

TEXT:
Kära [Recruiteringsansvarig],

Jag skriver för att ansöka om befattningen som Lageransvarig i Arlöv, eftersom jag tror att min erfarenhet och kompetens passar perfekt för denna roll. Jag har över 20 års erfarenhet inom programutveckling, nätverksutveckling och datorlig teknik samt en gedigen akademisk bakgrund.

Under mina tidigare arbetsuppgifter på Ericsson som nätverksutvecklare, säkerställde jag en smidig implementering av nätverksfunktioner och bidrog till optimering av nätverksprestanda och säkerhetsfunktioner. Dessutom har jag även arbetat i team och levererat högkvalitativa lösningar.

Mina personliga egenskaper inkluderar en stark förmåga att arbeta i team, en passion för att lösa komplexa tekniska problem samt en förmåga att samarbeta med olika grupper och individer. Jag tror på att främja mångfald och att ta tillvara kompetens hos alla medarbetare, oavsett kön, sexuell läggning, könsöverskridande identitet eller uttryck, etnicitet, ålder, religion eller annan trosuppfattning.

Jag har en teknisk kompetens och är övertygad om att jag kan bidra till att säkerställa en effektiv lagerhantering genom att följa fastlagda rutiner för köp av reservdelar, inventeringar och registervård.

Jag ser fram emot att få diskutera hur min erfarenhet och kompetens kan bidra till Testia:s framgång i Malmö. Jag hoppas att vi kan diskutera detta personligen vid en mötesanhörig tidpunkt.

Med vänliga hälsningar,
Test Testsson

