{
  "allow_notifications": true,
  "avg_response": 87950,
  "check_interval": 60,
  "checkins": [],
  "created_at": "2022-04-21T11:09:11.050840466Z",
  "domain": "https://nystartsjobb-sjalvtest.arbetsformedlingen.se",
  "expected": "",
  "expected_status": 200,
  "failures": [
    {
      "id": 35229,
      "issue": "Could not get IP address for domain https://nystartsjobb-sjalvtest.arbetsformedlingen.se, lookup nystartsjobb-sjalvtest.arbetsformedlingen.se on 10.142.6.10:53: read udp 10.126.2.106:60734->10.142.6.10:53: i/o timeout",
      "error_code": 200,
      "ping": 21133,
      "reason": "lookup",
      "created_at": "2023-03-27T21:54:11.687870856Z"
    },
    {
      "id": 35226,
      "issue": "Could not get IP address for domain https://nystartsjobb-sjalvtest.arbetsformedlingen.se, lookup nystartsjobb-sjalvtest.arbetsformedlingen.se on 10.142.6.10:53: read udp 10.126.2.106:56677->10.142.6.10:53: i/o timeout",
      "error_code": 200,
      "ping": 21133,
      "reason": "lookup",
      "created_at": "2023-03-27T21:52:41.358906135Z"
    },
    {
      "id": 35223,
      "issue": "Could not get IP address for domain https://nystartsjobb-sjalvtest.arbetsformedlingen.se, lookup nystartsjobb-sjalvtest.arbetsformedlingen.se on 10.142.6.10:53: read udp 10.126.2.106:51897->10.142.6.10:53: i/o timeout",
      "error_code": 200,
      "ping": 21133,
      "reason": "lookup",
      "created_at": "2023-03-27T21:51:01.077831004Z"
    },
    {
      "id": 35220,
      "issue": "Could not get IP address for domain https://nystartsjobb-sjalvtest.arbetsformedlingen.se, lookup nystartsjobb-sjalvtest.arbetsformedlingen.se on 10.142.6.10:53: read udp 10.126.2.106:60761->10.142.6.10:53: i/o timeout",
      "error_code": 200,
      "ping": 21133,
      "reason": "lookup",
      "created_at": "2023-03-27T21:49:20.801861177Z"
    },
    {
      "id": 35217,
      "issue": "Could not get IP address for domain https://nystartsjobb-sjalvtest.arbetsformedlingen.se, lookup nystartsjobb-sjalvtest.arbetsformedlingen.se on 10.142.6.10:53: read udp 10.126.2.106:34704->10.142.6.10:53: i/o timeout",
      "error_code": 200,
      "ping": 21133,
      "reason": "lookup",
      "created_at": "2023-03-27T21:47:40.440027808Z"
    },
    {
      "id": 35214,
      "issue": "Could not get IP address for domain https://nystartsjobb-sjalvtest.arbetsformedlingen.se, lookup nystartsjobb-sjalvtest.arbetsformedlingen.se on 10.142.6.10:53: read udp 10.126.2.106:56571->10.142.6.10:53: i/o timeout",
      "error_code": 200,
      "ping": 21133,
      "reason": "lookup",
      "created_at": "2023-03-27T21:45:59.970431947Z"
    },
    {
      "id": 35211,
      "issue": "Could not get IP address for domain https://nystartsjobb-sjalvtest.arbetsformedlingen.se, lookup nystartsjobb-sjalvtest.arbetsformedlingen.se on 10.142.6.10:53: read udp 10.126.2.106:60448->10.142.6.10:53: i/o timeout",
      "error_code": 200,
      "ping": 21133,
      "reason": "lookup",
      "created_at": "2023-03-27T21:44:19.624832269Z"
    },
    {
      "id": 35208,
      "issue": "Could not get IP address for domain https://nystartsjobb-sjalvtest.arbetsformedlingen.se, lookup nystartsjobb-sjalvtest.arbetsformedlingen.se on 10.142.6.10:53: read udp 10.126.2.106:34299->10.142.6.10:53: i/o timeout",
      "error_code": 200,
      "ping": 21133,
      "reason": "lookup",
      "created_at": "2023-03-27T21:42:39.221411682Z"
    },
    {
      "id": 35205,
      "issue": "Could not get IP address for domain https://nystartsjobb-sjalvtest.arbetsformedlingen.se, lookup nystartsjobb-sjalvtest.arbetsformedlingen.se on 10.142.6.10:53: read udp 10.126.2.106:58314->10.142.6.10:53: i/o timeout",
      "error_code": 200,
      "ping": 21133,
      "reason": "lookup",
      "created_at": "2023-03-27T21:40:58.818465759Z"
    },
    {
      "id": 35202,
      "issue": "Could not get IP address for domain https://nystartsjobb-sjalvtest.arbetsformedlingen.se, lookup nystartsjobb-sjalvtest.arbetsformedlingen.se on 10.142.6.10:53: read udp 10.126.2.106:38165->10.142.6.10:53: i/o timeout",
      "error_code": 200,
      "ping": 21133,
      "reason": "lookup",
      "created_at": "2023-03-27T21:39:18.342365928Z"
    },
    {
      "id": 35199,
      "issue": "Could not get IP address for domain https://nystartsjobb-sjalvtest.arbetsformedlingen.se, lookup nystartsjobb-sjalvtest.arbetsformedlingen.se on 10.142.6.10:53: read udp 10.126.2.106:36209->10.142.6.10:53: i/o timeout",
      "error_code": 200,
      "ping": 21133,
      "reason": "lookup",
      "created_at": "2023-03-27T21:37:37.995899675Z"
    },
    {
      "id": 35196,
      "issue": "Could not get IP address for domain https://nystartsjobb-sjalvtest.arbetsformedlingen.se, lookup nystartsjobb-sjalvtest.arbetsformedlingen.se on 10.142.6.10:53: read udp 10.126.2.106:56654->10.142.6.10:53: i/o timeout",
      "error_code": 200,
      "ping": 21133,
      "reason": "lookup",
      "created_at": "2023-03-27T21:35:57.678907023Z"
    },
    {
      "id": 35193,
      "issue": "Could not get IP address for domain https://nystartsjobb-sjalvtest.arbetsformedlingen.se, lookup nystartsjobb-sjalvtest.arbetsformedlingen.se on 10.142.6.10:53: read udp 10.126.2.106:54680->10.142.6.10:53: i/o timeout",
      "error_code": 200,
      "ping": 21133,
      "reason": "lookup",
      "created_at": "2023-03-27T21:34:17.20460123Z"
    },
    {
      "id": 35190,
      "issue": "Could not get IP address for domain https://nystartsjobb-sjalvtest.arbetsformedlingen.se, lookup nystartsjobb-sjalvtest.arbetsformedlingen.se on 10.142.6.10:53: read udp 10.126.2.106:39767->10.142.6.10:53: i/o timeout",
      "error_code": 200,
      "ping": 21133,
      "reason": "lookup",
      "created_at": "2023-03-27T21:32:36.909895169Z"
    },
    {
      "id": 35187,
      "issue": "Could not get IP address for domain https://nystartsjobb-sjalvtest.arbetsformedlingen.se, lookup nystartsjobb-sjalvtest.arbetsformedlingen.se on 10.142.6.10:53: read udp 10.126.2.106:39602->10.142.6.10:53: i/o timeout",
      "error_code": 200,
      "ping": 21133,
      "reason": "lookup",
      "created_at": "2023-03-27T21:30:56.423716048Z"
    },
    {
      "id": 35184,
      "issue": "Could not get IP address for domain https://nystartsjobb-sjalvtest.arbetsformedlingen.se, lookup nystartsjobb-sjalvtest.arbetsformedlingen.se on 10.142.6.10:53: read udp 10.126.2.106:50303->10.142.6.10:53: i/o timeout",
      "error_code": 200,
      "ping": 21133,
      "reason": "lookup",
      "created_at": "2023-03-27T21:29:16.065798863Z"
    },
    {
      "id": 35181,
      "issue": "Could not get IP address for domain https://nystartsjobb-sjalvtest.arbetsformedlingen.se, lookup nystartsjobb-sjalvtest.arbetsformedlingen.se on 10.142.6.10:53: read udp 10.126.2.106:32768->10.142.6.10:53: i/o timeout",
      "error_code": 200,
      "ping": 21133,
      "reason": "lookup",
      "created_at": "2023-03-27T21:27:35.680465887Z"
    },
    {
      "id": 35178,
      "issue": "Could not get IP address for domain https://nystartsjobb-sjalvtest.arbetsformedlingen.se, lookup nystartsjobb-sjalvtest.arbetsformedlingen.se on 10.142.6.10:53: read udp 10.126.2.106:52353->10.142.6.10:53: i/o timeout",
      "error_code": 200,
      "ping": 21133,
      "reason": "lookup",
      "created_at": "2023-03-27T21:25:55.272598212Z"
    },
    {
      "id": 35175,
      "issue": "Could not get IP address for domain https://nystartsjobb-sjalvtest.arbetsformedlingen.se, lookup nystartsjobb-sjalvtest.arbetsformedlingen.se on 10.142.6.10:53: read udp 10.126.2.106:46786->10.142.6.10:53: i/o timeout",
      "error_code": 200,
      "ping": 21133,
      "reason": "lookup",
      "created_at": "2023-03-27T21:24:14.959899878Z"
    },
    {
      "id": 35172,
      "issue": "Could not get IP address for domain https://nystartsjobb-sjalvtest.arbetsformedlingen.se, lookup nystartsjobb-sjalvtest.arbetsformedlingen.se on 10.142.6.10:53: read udp 10.126.2.106:52474->10.142.6.10:53: i/o timeout",
      "error_code": 200,
      "ping": 21133,
      "reason": "lookup",
      "created_at": "2023-03-27T21:22:34.596823722Z"
    },
    {
      "id": 35169,
      "issue": "Could not get IP address for domain https://nystartsjobb-sjalvtest.arbetsformedlingen.se, lookup nystartsjobb-sjalvtest.arbetsformedlingen.se on 10.142.6.10:53: read udp 10.126.2.106:55769->10.142.6.10:53: i/o timeout",
      "error_code": 200,
      "ping": 21133,
      "reason": "lookup",
      "created_at": "2023-03-27T21:20:54.301903492Z"
    },
    {
      "id": 35166,
      "issue": "Could not get IP address for domain https://nystartsjobb-sjalvtest.arbetsformedlingen.se, lookup nystartsjobb-sjalvtest.arbetsformedlingen.se on 10.142.6.10:53: read udp 10.126.2.106:55768->10.142.6.10:53: i/o timeout",
      "error_code": 200,
      "ping": 21133,
      "reason": "lookup",
      "created_at": "2023-03-27T21:19:14.021825639Z"
    },
    {
      "id": 35163,
      "issue": "Could not get IP address for domain https://nystartsjobb-sjalvtest.arbetsformedlingen.se, lookup nystartsjobb-sjalvtest.arbetsformedlingen.se on 10.142.6.10:53: read udp 10.126.2.106:46516->10.142.6.10:53: i/o timeout",
      "error_code": 200,
      "ping": 21133,
      "reason": "lookup",
      "created_at": "2023-03-27T21:17:33.651782031Z"
    },
    {
      "id": 35160,
      "issue": "Could not get IP address for domain https://nystartsjobb-sjalvtest.arbetsformedlingen.se, lookup nystartsjobb-sjalvtest.arbetsformedlingen.se on 10.142.6.10:53: read udp 10.126.2.106:34365->10.142.6.10:53: i/o timeout",
      "error_code": 200,
      "ping": 21133,
      "reason": "lookup",
      "created_at": "2023-03-27T21:15:53.111970591Z"
    },
    {
      "id": 35157,
      "issue": "Could not get IP address for domain https://nystartsjobb-sjalvtest.arbetsformedlingen.se, lookup nystartsjobb-sjalvtest.arbetsformedlingen.se on 10.142.6.10:53: read udp 10.126.2.106:53063->10.142.6.10:53: i/o timeout",
      "error_code": 200,
      "ping": 21133,
      "reason": "lookup",
      "created_at": "2023-03-27T21:14:12.686920018Z"
    }
  ],
  "failures_24_hours": 0,
  "group_id": 9,
  "grpc_health_check": false,
  "headers": "",
  "id": 19,
  "incidents": [],
  "last_error": "2023-03-27T21:54:11.687870856Z",
  "last_success": "2023-04-06T04:59:24.769973974Z",
  "latency": 56106,
  "messages": [],
  "method": "GET",
  "name": "nystartsjobb",
  "notify_after": 2,
  "notify_all_changes": true,
  "online": true,
  "online_24_hours": 100,
  "online_7_days": 100,
  "order_id": 0,
  "permalink": "nystartsjobb",
  "ping_time": 11126,
  "port": 80,
  "post_data": "",
  "public": true,
  "redirect": true,
  "stats": {
    "failures": 489,
    "hits": 129112,
    "first_hit": "2023-01-06T04:55:53.998637068Z"
  },
  "status_code": 200,
  "timeout": 15,
  "tls_cert": "",
  "tls_cert_key": "",
  "tls_cert_root": "",
  "type": "http",
  "updated_at": "2022-05-18T07:09:04.401639735Z",
  "verify_ssl": false
}
