{
  "avg_response": 37392,
  "check_interval": 60,
  "created_at": "2022-04-21T11:09:11.05084Z",
  "failures_24_hours": 0,
  "group_id": 4,
  "id": 12,
  "incidents": [],
  "last_error": "2024-02-16T13:21:03.792411549Z",
  "last_success": "2024-04-01T04:59:48.841954355Z",
  "latency": 42272,
  "messages": [],
  "name": "nystartsjobb",
  "online": true,
  "online_24_hours": 100,
  "online_7_days": 100,
  "order_id": 0,
  "permalink": "nystartsjobb",
  "ping_time": 7042,
  "public": true,
  "stats": {
    "failures": 2,
    "hits": 105226,
    "first_hit": "2024-01-02T04:10:33.92098Z"
  },
  "status_code": 200,
  "updated_at": "2023-04-16T08:38:44.269558Z"
}
