{
  "allow_notifications": true,
  "avg_response": 86867,
  "check_interval": 60,
  "checkins": [],
  "created_at": "2022-04-21T11:09:11.050840466Z",
  "domain": "https://nystartsjobb-sjalvtest.arbetsformedlingen.se",
  "expected": "",
  "expected_status": 200,
  "failures": [
    {
      "id": 34281,
      "issue": "HTTP Error Get \"https://nystartsjobb-sjalvtest.arbetsformedlingen.se\": context deadline exceeded (Client.Timeout exceeded while awaiting headers)",
      "error_code": 200,
      "ping": 5012687,
      "reason": "request",
      "created_at": "2023-01-29T08:16:13.932176908Z"
    },
    {
      "id": 34275,
      "issue": "HTTP Error Get \"https://nystartsjobb-sjalvtest.arbetsformedlingen.se\": context deadline exceeded (Client.Timeout exceeded while awaiting headers)",
      "error_code": 200,
      "ping": 2192,
      "reason": "request",
      "created_at": "2023-01-29T03:42:08.921624923Z"
    },
    {
      "id": 34271,
      "issue": "HTTP Error context deadline exceeded (Client.Timeout or context cancellation while reading body)",
      "error_code": 200,
      "ping": 11233,
      "reason": "request",
      "created_at": "2023-01-29T03:09:08.93021538Z"
    },
    {
      "id": 34269,
      "issue": "HTTP Error context deadline exceeded (Client.Timeout or context cancellation while reading body)",
      "error_code": 200,
      "ping": 12440,
      "reason": "request",
      "created_at": "2023-01-29T02:56:24.208447037Z"
    },
    {
      "id": 34268,
      "issue": "HTTP Error context deadline exceeded (Client.Timeout or context cancellation while reading body)",
      "error_code": 200,
      "ping": 2720,
      "reason": "request",
      "created_at": "2023-01-29T02:55:08.926572063Z"
    },
    {
      "id": 34267,
      "issue": "HTTP Error Get \"https://nystartsjobb-sjalvtest.arbetsformedlingen.se\": read tcp 10.126.2.106:51864->192.168.96.13:443: read: connection reset by peer",
      "error_code": 200,
      "ping": 3336,
      "reason": "request",
      "created_at": "2023-01-29T02:53:03.960520159Z"
    },
    {
      "id": 34255,
      "issue": "HTTP Error Get \"https://nystartsjobb-sjalvtest.arbetsformedlingen.se\": context deadline exceeded (Client.Timeout exceeded while awaiting headers)",
      "error_code": 200,
      "ping": 11493,
      "reason": "request",
      "created_at": "2023-01-29T00:41:08.934430341Z"
    },
    {
      "id": 34254,
      "issue": "HTTP Error context deadline exceeded (Client.Timeout or context cancellation while reading body)",
      "error_code": 200,
      "ping": 11295,
      "reason": "request",
      "created_at": "2023-01-29T00:28:08.92915617Z"
    },
    {
      "id": 34170,
      "issue": "HTTP Error Get \"https://nystartsjobb-sjalvtest.arbetsformedlingen.se\": context deadline exceeded (Client.Timeout exceeded while awaiting headers)",
      "error_code": 200,
      "ping": 1784,
      "reason": "request",
      "created_at": "2023-01-21T14:51:08.923184436Z"
    },
    {
      "id": 34165,
      "issue": "Could not get IP address for domain https://nystartsjobb-sjalvtest.arbetsformedlingen.se, lookup nystartsjobb-sjalvtest.arbetsformedlingen.se on 10.142.6.10:53: read udp 10.126.2.106:39012->10.142.6.10:53: i/o timeout",
      "error_code": 200,
      "ping": 5004695,
      "reason": "lookup",
      "created_at": "2023-01-18T12:11:55.128385145Z"
    },
    {
      "id": 34162,
      "issue": "Could not get IP address for domain https://nystartsjobb-sjalvtest.arbetsformedlingen.se, lookup nystartsjobb-sjalvtest.arbetsformedlingen.se on 10.142.6.10:53: read udp 10.126.2.106:55951->10.142.6.10:53: i/o timeout",
      "error_code": 200,
      "ping": 5004695,
      "reason": "lookup",
      "created_at": "2023-01-18T12:10:14.662446105Z"
    },
    {
      "id": 34159,
      "issue": "Could not get IP address for domain https://nystartsjobb-sjalvtest.arbetsformedlingen.se, lookup nystartsjobb-sjalvtest.arbetsformedlingen.se on 10.142.6.10:53: read udp 10.126.2.106:55293->10.142.6.10:53: i/o timeout",
      "error_code": 200,
      "ping": 5004695,
      "reason": "lookup",
      "created_at": "2023-01-18T12:08:33.941242424Z"
    },
    {
      "id": 34124,
      "issue": "HTTP Error Get \"https://nystartsjobb-sjalvtest.arbetsformedlingen.se\": read tcp 10.126.2.106:58456->192.168.96.13:443: read: connection reset by peer",
      "error_code": 200,
      "ping": 5661,
      "reason": "request",
      "created_at": "2023-01-17T11:57:35.608333931Z"
    },
    {
      "id": 34123,
      "issue": "HTTP Error Get \"https://nystartsjobb-sjalvtest.arbetsformedlingen.se\": read tcp 10.126.2.106:56444->192.168.96.13:443: read: connection reset by peer",
      "error_code": 200,
      "ping": 14917,
      "reason": "request",
      "created_at": "2023-01-17T11:56:35.335074202Z"
    },
    {
      "id": 34122,
      "issue": "HTTP Error Get \"https://nystartsjobb-sjalvtest.arbetsformedlingen.se\": read tcp 10.126.2.106:50714->192.168.96.13:443: read: connection reset by peer",
      "error_code": 200,
      "ping": 5084,
      "reason": "request",
      "created_at": "2023-01-17T11:55:35.051304095Z"
    },
    {
      "id": 34121,
      "issue": "HTTP Error Get \"https://nystartsjobb-sjalvtest.arbetsformedlingen.se\": read tcp 10.126.2.106:46154->192.168.96.13:443: read: connection reset by peer",
      "error_code": 200,
      "ping": 4006,
      "reason": "request",
      "created_at": "2023-01-17T11:54:34.780863552Z"
    },
    {
      "id": 34120,
      "issue": "HTTP Error Get \"https://nystartsjobb-sjalvtest.arbetsformedlingen.se\": read tcp 10.126.2.106:55046->192.168.96.13:443: read: connection reset by peer",
      "error_code": 200,
      "ping": 3575,
      "reason": "request",
      "created_at": "2023-01-17T11:53:34.514115384Z"
    },
    {
      "id": 34119,
      "issue": "HTTP Error Get \"https://nystartsjobb-sjalvtest.arbetsformedlingen.se\": read tcp 10.126.2.106:36568->192.168.96.13:443: read: connection reset by peer",
      "error_code": 200,
      "ping": 3487,
      "reason": "request",
      "created_at": "2023-01-17T11:52:34.233562969Z"
    },
    {
      "id": 34118,
      "issue": "HTTP Error Get \"https://nystartsjobb-sjalvtest.arbetsformedlingen.se\": read tcp 10.126.2.106:38918->192.168.96.13:443: read: connection reset by peer",
      "error_code": 200,
      "ping": 2589,
      "reason": "request",
      "created_at": "2023-01-17T11:51:33.968726051Z"
    },
    {
      "id": 34117,
      "issue": "HTTP Error Get \"https://nystartsjobb-sjalvtest.arbetsformedlingen.se\": read tcp 10.126.2.106:59094->192.168.96.13:443: read: connection reset by peer",
      "error_code": 200,
      "ping": 3093,
      "reason": "request",
      "created_at": "2023-01-17T11:50:33.692312643Z"
    },
    {
      "id": 34116,
      "issue": "HTTP Error Get \"https://nystartsjobb-sjalvtest.arbetsformedlingen.se\": read tcp 10.126.2.106:56128->192.168.96.13:443: read: connection reset by peer",
      "error_code": 200,
      "ping": 2843,
      "reason": "request",
      "created_at": "2023-01-17T11:49:33.418883167Z"
    },
    {
      "id": 34115,
      "issue": "HTTP Error Get \"https://nystartsjobb-sjalvtest.arbetsformedlingen.se\": read tcp 10.126.2.106:56060->192.168.96.13:443: read: connection reset by peer",
      "error_code": 200,
      "ping": 2837,
      "reason": "request",
      "created_at": "2023-01-17T11:48:33.147084441Z"
    },
    {
      "id": 34114,
      "issue": "HTTP Error Get \"https://nystartsjobb-sjalvtest.arbetsformedlingen.se\": read tcp 10.126.2.106:55636->192.168.96.13:443: read: connection reset by peer",
      "error_code": 200,
      "ping": 5391,
      "reason": "request",
      "created_at": "2023-01-17T11:47:32.872849827Z"
    },
    {
      "id": 34113,
      "issue": "HTTP Error Get \"https://nystartsjobb-sjalvtest.arbetsformedlingen.se\": read tcp 10.126.2.106:35788->192.168.96.13:443: read: connection reset by peer",
      "error_code": 200,
      "ping": 4847,
      "reason": "request",
      "created_at": "2023-01-17T11:46:32.61460036Z"
    },
    {
      "id": 34112,
      "issue": "HTTP Error Get \"https://nystartsjobb-sjalvtest.arbetsformedlingen.se\": read tcp 10.126.2.106:51260->192.168.96.13:443: read: connection reset by peer",
      "error_code": 200,
      "ping": 2947,
      "reason": "request",
      "created_at": "2023-01-17T11:45:32.309087925Z"
    }
  ],
  "failures_24_hours": 0,
  "group_id": 9,
  "grpc_health_check": false,
  "headers": "",
  "id": 19,
  "incidents": [],
  "last_error": "2023-01-29T08:16:13.932176908Z",
  "last_success": "2023-03-09T05:59:06.673314632Z",
  "latency": 67125,
  "messages": [],
  "method": "GET",
  "name": "nystartsjobb",
  "notify_after": 2,
  "notify_all_changes": true,
  "online": true,
  "online_24_hours": 100,
  "online_7_days": 100,
  "order_id": 0,
  "permalink": "nystartsjobb",
  "ping_time": 11288,
  "port": 80,
  "post_data": "",
  "public": true,
  "redirect": true,
  "stats": {
    "failures": 189,
    "hits": 129435,
    "first_hit": "2022-12-09T05:33:53.997707396Z"
  },
  "status_code": 200,
  "timeout": 15,
  "tls_cert": "",
  "tls_cert_key": "",
  "tls_cert_root": "",
  "type": "http",
  "updated_at": "2022-05-18T07:09:04.401639735Z",
  "verify_ssl": false
}
