{
  "allow_notifications": true,
  "avg_response": 66480,
  "check_interval": 60,
  "checkins": [],
  "created_at": "2022-04-21T11:09:11.050840466Z",
  "domain": "https://nystartsjobb-sjalvtest.arbetsformedlingen.se",
  "expected": "",
  "expected_status": 200,
  "failures": [
    {
      "id": 34170,
      "issue": "HTTP Error Get \"https://nystartsjobb-sjalvtest.arbetsformedlingen.se\": context deadline exceeded (Client.Timeout exceeded while awaiting headers)",
      "error_code": 200,
      "ping": 1784,
      "reason": "request",
      "created_at": "2023-01-21T14:51:08.923184436Z"
    },
    {
      "id": 34165,
      "issue": "Could not get IP address for domain https://nystartsjobb-sjalvtest.arbetsformedlingen.se, lookup nystartsjobb-sjalvtest.arbetsformedlingen.se on 10.142.6.10:53: read udp 10.126.2.106:39012->10.142.6.10:53: i/o timeout",
      "error_code": 200,
      "ping": 5004695,
      "reason": "lookup",
      "created_at": "2023-01-18T12:11:55.128385145Z"
    },
    {
      "id": 34162,
      "issue": "Could not get IP address for domain https://nystartsjobb-sjalvtest.arbetsformedlingen.se, lookup nystartsjobb-sjalvtest.arbetsformedlingen.se on 10.142.6.10:53: read udp 10.126.2.106:55951->10.142.6.10:53: i/o timeout",
      "error_code": 200,
      "ping": 5004695,
      "reason": "lookup",
      "created_at": "2023-01-18T12:10:14.662446105Z"
    },
    {
      "id": 34159,
      "issue": "Could not get IP address for domain https://nystartsjobb-sjalvtest.arbetsformedlingen.se, lookup nystartsjobb-sjalvtest.arbetsformedlingen.se on 10.142.6.10:53: read udp 10.126.2.106:55293->10.142.6.10:53: i/o timeout",
      "error_code": 200,
      "ping": 5004695,
      "reason": "lookup",
      "created_at": "2023-01-18T12:08:33.941242424Z"
    },
    {
      "id": 34124,
      "issue": "HTTP Error Get \"https://nystartsjobb-sjalvtest.arbetsformedlingen.se\": read tcp 10.126.2.106:58456->192.168.96.13:443: read: connection reset by peer",
      "error_code": 200,
      "ping": 5661,
      "reason": "request",
      "created_at": "2023-01-17T11:57:35.608333931Z"
    },
    {
      "id": 34123,
      "issue": "HTTP Error Get \"https://nystartsjobb-sjalvtest.arbetsformedlingen.se\": read tcp 10.126.2.106:56444->192.168.96.13:443: read: connection reset by peer",
      "error_code": 200,
      "ping": 14917,
      "reason": "request",
      "created_at": "2023-01-17T11:56:35.335074202Z"
    },
    {
      "id": 34122,
      "issue": "HTTP Error Get \"https://nystartsjobb-sjalvtest.arbetsformedlingen.se\": read tcp 10.126.2.106:50714->192.168.96.13:443: read: connection reset by peer",
      "error_code": 200,
      "ping": 5084,
      "reason": "request",
      "created_at": "2023-01-17T11:55:35.051304095Z"
    },
    {
      "id": 34121,
      "issue": "HTTP Error Get \"https://nystartsjobb-sjalvtest.arbetsformedlingen.se\": read tcp 10.126.2.106:46154->192.168.96.13:443: read: connection reset by peer",
      "error_code": 200,
      "ping": 4006,
      "reason": "request",
      "created_at": "2023-01-17T11:54:34.780863552Z"
    },
    {
      "id": 34120,
      "issue": "HTTP Error Get \"https://nystartsjobb-sjalvtest.arbetsformedlingen.se\": read tcp 10.126.2.106:55046->192.168.96.13:443: read: connection reset by peer",
      "error_code": 200,
      "ping": 3575,
      "reason": "request",
      "created_at": "2023-01-17T11:53:34.514115384Z"
    },
    {
      "id": 34119,
      "issue": "HTTP Error Get \"https://nystartsjobb-sjalvtest.arbetsformedlingen.se\": read tcp 10.126.2.106:36568->192.168.96.13:443: read: connection reset by peer",
      "error_code": 200,
      "ping": 3487,
      "reason": "request",
      "created_at": "2023-01-17T11:52:34.233562969Z"
    },
    {
      "id": 34118,
      "issue": "HTTP Error Get \"https://nystartsjobb-sjalvtest.arbetsformedlingen.se\": read tcp 10.126.2.106:38918->192.168.96.13:443: read: connection reset by peer",
      "error_code": 200,
      "ping": 2589,
      "reason": "request",
      "created_at": "2023-01-17T11:51:33.968726051Z"
    },
    {
      "id": 34117,
      "issue": "HTTP Error Get \"https://nystartsjobb-sjalvtest.arbetsformedlingen.se\": read tcp 10.126.2.106:59094->192.168.96.13:443: read: connection reset by peer",
      "error_code": 200,
      "ping": 3093,
      "reason": "request",
      "created_at": "2023-01-17T11:50:33.692312643Z"
    },
    {
      "id": 34116,
      "issue": "HTTP Error Get \"https://nystartsjobb-sjalvtest.arbetsformedlingen.se\": read tcp 10.126.2.106:56128->192.168.96.13:443: read: connection reset by peer",
      "error_code": 200,
      "ping": 2843,
      "reason": "request",
      "created_at": "2023-01-17T11:49:33.418883167Z"
    },
    {
      "id": 34115,
      "issue": "HTTP Error Get \"https://nystartsjobb-sjalvtest.arbetsformedlingen.se\": read tcp 10.126.2.106:56060->192.168.96.13:443: read: connection reset by peer",
      "error_code": 200,
      "ping": 2837,
      "reason": "request",
      "created_at": "2023-01-17T11:48:33.147084441Z"
    },
    {
      "id": 34114,
      "issue": "HTTP Error Get \"https://nystartsjobb-sjalvtest.arbetsformedlingen.se\": read tcp 10.126.2.106:55636->192.168.96.13:443: read: connection reset by peer",
      "error_code": 200,
      "ping": 5391,
      "reason": "request",
      "created_at": "2023-01-17T11:47:32.872849827Z"
    },
    {
      "id": 34113,
      "issue": "HTTP Error Get \"https://nystartsjobb-sjalvtest.arbetsformedlingen.se\": read tcp 10.126.2.106:35788->192.168.96.13:443: read: connection reset by peer",
      "error_code": 200,
      "ping": 4847,
      "reason": "request",
      "created_at": "2023-01-17T11:46:32.61460036Z"
    },
    {
      "id": 34112,
      "issue": "HTTP Error Get \"https://nystartsjobb-sjalvtest.arbetsformedlingen.se\": read tcp 10.126.2.106:51260->192.168.96.13:443: read: connection reset by peer",
      "error_code": 200,
      "ping": 2947,
      "reason": "request",
      "created_at": "2023-01-17T11:45:32.309087925Z"
    },
    {
      "id": 34111,
      "issue": "HTTP Error Get \"https://nystartsjobb-sjalvtest.arbetsformedlingen.se\": read tcp 10.126.2.106:58240->192.168.96.13:443: read: connection reset by peer",
      "error_code": 200,
      "ping": 2650,
      "reason": "request",
      "created_at": "2023-01-17T11:44:32.050335917Z"
    },
    {
      "id": 34110,
      "issue": "HTTP Error Get \"https://nystartsjobb-sjalvtest.arbetsformedlingen.se\": read tcp 10.126.2.106:36572->192.168.96.13:443: read: connection reset by peer",
      "error_code": 200,
      "ping": 2717,
      "reason": "request",
      "created_at": "2023-01-17T11:43:31.760386408Z"
    },
    {
      "id": 34109,
      "issue": "HTTP Error Get \"https://nystartsjobb-sjalvtest.arbetsformedlingen.se\": read tcp 10.126.2.106:51172->192.168.96.13:443: read: connection reset by peer",
      "error_code": 200,
      "ping": 2919,
      "reason": "request",
      "created_at": "2023-01-17T11:42:31.470512031Z"
    },
    {
      "id": 34108,
      "issue": "HTTP Error Get \"https://nystartsjobb-sjalvtest.arbetsformedlingen.se\": read tcp 10.126.2.106:39436->192.168.96.13:443: read: connection reset by peer",
      "error_code": 200,
      "ping": 2937,
      "reason": "request",
      "created_at": "2023-01-17T11:41:31.184476687Z"
    },
    {
      "id": 34107,
      "issue": "HTTP Error Get \"https://nystartsjobb-sjalvtest.arbetsformedlingen.se\": read tcp 10.126.2.106:43170->192.168.96.13:443: read: connection reset by peer",
      "error_code": 200,
      "ping": 2795,
      "reason": "request",
      "created_at": "2023-01-17T11:40:30.918877274Z"
    },
    {
      "id": 34106,
      "issue": "HTTP Error Get \"https://nystartsjobb-sjalvtest.arbetsformedlingen.se\": read tcp 10.126.2.106:34808->192.168.96.13:443: read: connection reset by peer",
      "error_code": 200,
      "ping": 3175,
      "reason": "request",
      "created_at": "2023-01-17T11:39:30.665259242Z"
    },
    {
      "id": 34105,
      "issue": "HTTP Error Get \"https://nystartsjobb-sjalvtest.arbetsformedlingen.se\": read tcp 10.126.2.106:38020->192.168.96.13:443: read: connection reset by peer",
      "error_code": 200,
      "ping": 3178,
      "reason": "request",
      "created_at": "2023-01-17T11:38:30.390465903Z"
    },
    {
      "id": 34104,
      "issue": "HTTP Error Get \"https://nystartsjobb-sjalvtest.arbetsformedlingen.se\": read tcp 10.126.2.106:37856->192.168.96.13:443: read: connection reset by peer",
      "error_code": 200,
      "ping": 5658,
      "reason": "request",
      "created_at": "2023-01-17T11:37:30.100655496Z"
    },
    {
      "id": 34103,
      "issue": "HTTP Error Get \"https://nystartsjobb-sjalvtest.arbetsformedlingen.se\": read tcp 10.126.2.106:50418->192.168.96.13:443: read: connection reset by peer",
      "error_code": 200,
      "ping": 5387,
      "reason": "request",
      "created_at": "2023-01-17T11:36:29.783444588Z"
    },
    {
      "id": 34102,
      "issue": "HTTP Error Get \"https://nystartsjobb-sjalvtest.arbetsformedlingen.se\": read tcp 10.126.2.106:45922->192.168.96.13:443: read: connection reset by peer",
      "error_code": 200,
      "ping": 4135,
      "reason": "request",
      "created_at": "2023-01-17T11:35:29.516726641Z"
    },
    {
      "id": 34101,
      "issue": "HTTP Error Get \"https://nystartsjobb-sjalvtest.arbetsformedlingen.se\": read tcp 10.126.2.106:39668->192.168.96.13:443: read: connection reset by peer",
      "error_code": 200,
      "ping": 4719,
      "reason": "request",
      "created_at": "2023-01-17T11:34:29.243129097Z"
    },
    {
      "id": 34100,
      "issue": "HTTP Error Get \"https://nystartsjobb-sjalvtest.arbetsformedlingen.se\": read tcp 10.126.2.106:59618->192.168.96.13:443: read: connection reset by peer",
      "error_code": 200,
      "ping": 3261,
      "reason": "request",
      "created_at": "2023-01-17T11:33:28.951163231Z"
    },
    {
      "id": 34099,
      "issue": "HTTP Error Get \"https://nystartsjobb-sjalvtest.arbetsformedlingen.se\": read tcp 10.126.2.106:45512->192.168.96.13:443: read: connection reset by peer",
      "error_code": 200,
      "ping": 2754,
      "reason": "request",
      "created_at": "2023-01-17T11:32:28.666440716Z"
    },
    {
      "id": 34098,
      "issue": "HTTP Error Get \"https://nystartsjobb-sjalvtest.arbetsformedlingen.se\": read tcp 10.126.2.106:52704->192.168.96.13:443: read: connection reset by peer",
      "error_code": 200,
      "ping": 11559,
      "reason": "request",
      "created_at": "2023-01-17T11:31:28.071422702Z"
    },
    {
      "id": 34097,
      "issue": "HTTP Error Get \"https://nystartsjobb-sjalvtest.arbetsformedlingen.se\": read tcp 10.126.2.106:48248->192.168.96.13:443: read: connection reset by peer",
      "error_code": 200,
      "ping": 3090,
      "reason": "request",
      "created_at": "2023-01-17T11:30:27.726415248Z"
    }
  ],
  "failures_24_hours": 0,
  "group_id": 9,
  "grpc_health_check": false,
  "headers": "",
  "id": 19,
  "incidents": [],
  "last_error": "2023-01-21T14:51:08.923184055Z",
  "last_success": "2023-01-25T05:59:54.007617537Z",
  "latency": 88450,
  "messages": [],
  "method": "GET",
  "name": "nystartsjobb",
  "notify_after": 2,
  "notify_all_changes": true,
  "online": true,
  "online_24_hours": 100,
  "online_7_days": 99.96,
  "order_id": 0,
  "permalink": "nystartsjobb",
  "ping_time": 2317,
  "port": 80,
  "post_data": "",
  "public": true,
  "redirect": true,
  "stats": {
    "failures": 181,
    "hits": 129427,
    "first_hit": "2022-10-27T05:52:27.816525815Z"
  },
  "status_code": 200,
  "timeout": 15,
  "tls_cert": "",
  "tls_cert_key": "",
  "tls_cert_root": "",
  "type": "http",
  "updated_at": "2022-05-18T07:09:04.401639735Z",
  "verify_ssl": false
}
