{
  "allow_notifications": true,
  "avg_response": 49240,
  "check_interval": 60,
  "checkins": [],
  "created_at": "2022-04-21T11:09:11.050840466Z",
  "domain": "https://nystartsjobb-sjalvtest.arbetsformedlingen.se",
  "expected": "",
  "expected_status": 200,
  "failures": [
    {
      "id": 33318,
      "issue": "HTTP Status Code 503 did not match 200",
      "error_code": 503,
      "ping": 1919,
      "reason": "status_code",
      "created_at": "2022-10-19T14:24:30.229733819Z"
    },
    {
      "id": 33317,
      "issue": "HTTP Status Code 503 did not match 200",
      "error_code": 503,
      "ping": 2617,
      "reason": "status_code",
      "created_at": "2022-10-19T14:23:30.062681667Z"
    },
    {
      "id": 33316,
      "issue": "HTTP Status Code 503 did not match 200",
      "error_code": 503,
      "ping": 4262,
      "reason": "status_code",
      "created_at": "2022-10-19T14:22:29.898209915Z"
    },
    {
      "id": 33315,
      "issue": "HTTP Status Code 503 did not match 200",
      "error_code": 503,
      "ping": 3814,
      "reason": "status_code",
      "created_at": "2022-10-19T14:21:29.733079326Z"
    },
    {
      "id": 33314,
      "issue": "HTTP Status Code 503 did not match 200",
      "error_code": 503,
      "ping": 2223,
      "reason": "status_code",
      "created_at": "2022-10-19T14:20:29.569514828Z"
    },
    {
      "id": 33313,
      "issue": "HTTP Status Code 503 did not match 200",
      "error_code": 503,
      "ping": 1841,
      "reason": "status_code",
      "created_at": "2022-10-19T14:19:29.405289987Z"
    },
    {
      "id": 33312,
      "issue": "HTTP Status Code 503 did not match 200",
      "error_code": 503,
      "ping": 2893,
      "reason": "status_code",
      "created_at": "2022-10-19T14:18:29.238291531Z"
    },
    {
      "id": 33311,
      "issue": "HTTP Status Code 503 did not match 200",
      "error_code": 503,
      "ping": 2772,
      "reason": "status_code",
      "created_at": "2022-10-19T14:17:29.053406092Z"
    },
    {
      "id": 33310,
      "issue": "HTTP Status Code 503 did not match 200",
      "error_code": 503,
      "ping": 2190,
      "reason": "status_code",
      "created_at": "2022-10-19T14:16:28.886368153Z"
    },
    {
      "id": 33309,
      "issue": "HTTP Status Code 503 did not match 200",
      "error_code": 503,
      "ping": 2763,
      "reason": "status_code",
      "created_at": "2022-10-19T14:15:28.718675884Z"
    },
    {
      "id": 33308,
      "issue": "HTTP Status Code 503 did not match 200",
      "error_code": 503,
      "ping": 1848,
      "reason": "status_code",
      "created_at": "2022-10-19T14:14:28.556568612Z"
    },
    {
      "id": 33307,
      "issue": "HTTP Status Code 503 did not match 200",
      "error_code": 503,
      "ping": 2070,
      "reason": "status_code",
      "created_at": "2022-10-19T14:13:28.397074376Z"
    },
    {
      "id": 33306,
      "issue": "HTTP Status Code 503 did not match 200",
      "error_code": 503,
      "ping": 11056,
      "reason": "status_code",
      "created_at": "2022-10-19T14:12:28.189629567Z"
    },
    {
      "id": 33305,
      "issue": "HTTP Status Code 503 did not match 200",
      "error_code": 503,
      "ping": 4472,
      "reason": "status_code",
      "created_at": "2022-10-19T14:11:27.818022458Z"
    },
    {
      "id": 33276,
      "issue": "HTTP Error context deadline exceeded (Client.Timeout or context cancellation while reading body)",
      "error_code": 200,
      "ping": 11182,
      "reason": "request",
      "created_at": "2022-09-29T23:03:42.807724673Z"
    },
    {
      "id": 33260,
      "issue": "HTTP Error context deadline exceeded (Client.Timeout or context cancellation while reading body)",
      "error_code": 200,
      "ping": 5003524,
      "reason": "request",
      "created_at": "2022-09-25T22:28:15.160258391Z"
    },
    {
      "id": 33259,
      "issue": "HTTP Error context deadline exceeded (Client.Timeout or context cancellation while reading body)",
      "error_code": 200,
      "ping": 11397,
      "reason": "request",
      "created_at": "2022-09-25T22:21:10.167993049Z"
    },
    {
      "id": 33256,
      "issue": "HTTP Error Get \"https://nystartsjobb-sjalvtest.arbetsformedlingen.se\": context deadline exceeded (Client.Timeout exceeded while awaiting headers)",
      "error_code": 200,
      "ping": 5006449,
      "reason": "request",
      "created_at": "2022-09-25T04:01:15.16330493Z"
    },
    {
      "id": 33255,
      "issue": "HTTP Error Get \"https://nystartsjobb-sjalvtest.arbetsformedlingen.se\": read tcp 10.126.2.106:48336->192.168.96.13:443: read: connection reset by peer",
      "error_code": 200,
      "ping": 3676,
      "reason": "request",
      "created_at": "2022-09-25T02:22:08.207568006Z"
    },
    {
      "id": 33254,
      "issue": "HTTP Error read tcp 10.126.2.106:48304->192.168.96.13:443: read: connection reset by peer",
      "error_code": 200,
      "ping": 13281,
      "reason": "request",
      "created_at": "2022-09-25T02:17:56.289907251Z"
    },
    {
      "id": 33252,
      "issue": "HTTP Error Get \"https://nystartsjobb-sjalvtest.arbetsformedlingen.se\": context deadline exceeded (Client.Timeout exceeded while awaiting headers)",
      "error_code": 200,
      "ping": 11196,
      "reason": "request",
      "created_at": "2022-09-25T00:02:10.167858194Z"
    },
    {
      "id": 33246,
      "issue": "HTTP Error Get \"https://nystartsjobb-sjalvtest.arbetsformedlingen.se\": context deadline exceeded (Client.Timeout exceeded while awaiting headers)",
      "error_code": 200,
      "ping": 12468,
      "reason": "request",
      "created_at": "2022-09-24T22:04:10.168964642Z"
    },
    {
      "id": 33240,
      "issue": "HTTP Error read tcp 10.126.2.106:52362->192.168.96.13:443: read: connection reset by peer",
      "error_code": 200,
      "ping": 8610,
      "reason": "request",
      "created_at": "2022-09-23T09:04:56.248180772Z"
    },
    {
      "id": 33235,
      "issue": "HTTP Error Get \"https://nystartsjobb-sjalvtest.arbetsformedlingen.se\": read tcp 10.126.2.106:56380->192.168.96.13:443: read: connection reset by peer",
      "error_code": 200,
      "ping": 9185,
      "reason": "request",
      "created_at": "2022-09-18T00:00:56.262177961Z"
    },
    {
      "id": 33234,
      "issue": "HTTP Error Get \"https://nystartsjobb-sjalvtest.arbetsformedlingen.se\": context deadline exceeded (Client.Timeout exceeded while awaiting headers)",
      "error_code": 200,
      "ping": 17123,
      "reason": "request",
      "created_at": "2022-09-17T22:24:10.173947554Z"
    }
  ],
  "failures_24_hours": 0,
  "group_id": 9,
  "grpc_health_check": false,
  "headers": "",
  "id": 19,
  "incidents": [],
  "last_error": "2022-10-19T14:24:30.229733819Z",
  "last_success": "2022-11-12T05:59:53.994300521Z",
  "latency": 66230,
  "messages": [],
  "method": "GET",
  "name": "nystartsjobb",
  "notify_after": 2,
  "notify_all_changes": true,
  "online": true,
  "online_24_hours": 100,
  "online_7_days": 100,
  "order_id": 0,
  "permalink": "nystartsjobb",
  "ping_time": 10614,
  "port": 80,
  "post_data": "",
  "public": true,
  "redirect": true,
  "stats": {
    "failures": 28,
    "hits": 129565,
    "first_hit": "2022-08-14T05:52:42.159504497Z"
  },
  "status_code": 200,
  "timeout": 15,
  "tls_cert": "",
  "tls_cert_key": "",
  "tls_cert_root": "",
  "type": "http",
  "updated_at": "2022-05-18T07:09:04.401639735Z",
  "verify_ssl": false
}
