{
  "avg_response": 22950,
  "check_interval": 60,
  "created_at": "2022-04-21T11:09:11.05084Z",
  "failures_24_hours": 0,
  "group_id": 4,
  "id": 12,
  "incidents": [],
  "last_error": "2024-09-11T06:33:02.556295453Z",
  "last_success": "2024-09-14T05:00:02.558402533Z",
  "latency": 14415,
  "messages": [],
  "name": "nystartsjobb",
  "online": true,
  "online_24_hours": 100,
  "online_7_days": 99.99,
  "order_id": 0,
  "permalink": "nystartsjobb",
  "ping_time": 1049,
  "public": true,
  "stats": {
    "failures": 3,
    "hits": 129611,
    "first_hit": "2024-06-16T04:07:36.539039Z"
  },
  "status_code": 200,
  "updated_at": "2023-04-16T08:38:44.269558Z"
}
