{
  "avg_response": 67324,
  "check_interval": 60,
  "created_at": "2022-04-21T11:09:11.05084Z",
  "failures_24_hours": 34,
  "group_id": 4,
  "id": 12,
  "incidents": [],
  "last_error": "2024-11-20T05:26:42.391523297Z",
  "last_success": "2024-11-20T05:59:42.147580534Z",
  "latency": 62008,
  "messages": [],
  "name": "nystartsjobb",
  "online": true,
  "online_24_hours": 96.52,
  "online_7_days": 99.3,
  "order_id": 0,
  "permalink": "nystartsjobb",
  "ping_time": 2948,
  "public": true,
  "stats": {
    "failures": 140,
    "hits": 129039,
    "first_hit": "2024-08-22T05:54:55.52209Z"
  },
  "status_code": 200,
  "updated_at": "2024-09-19T07:35:04.128782Z"
}
