{
  "avg_response": 37574,
  "check_interval": 60,
  "created_at": "2022-04-21T11:09:11.05084Z",
  "failures_24_hours": 0,
  "group_id": 4,
  "id": 12,
  "incidents": [],
  "last_error": "2024-06-14T22:23:48.812730976Z",
  "last_success": "2024-07-03T04:59:36.5308913Z",
  "latency": 27423,
  "messages": [],
  "name": "nystartsjobb",
  "online": true,
  "online_24_hours": 100,
  "online_7_days": 100,
  "order_id": 0,
  "permalink": "nystartsjobb",
  "ping_time": 615,
  "public": true,
  "stats": {
    "failures": 7,
    "hits": 129599,
    "first_hit": "2024-04-04T04:54:48.825776Z"
  },
  "status_code": 200,
  "updated_at": "2023-04-16T08:38:44.269558Z"
}
