{
  "avg_response": 40517,
  "check_interval": 60,
  "created_at": "2022-04-21T11:09:11.05084Z",
  "failures_24_hours": 0,
  "group_id": 4,
  "id": 12,
  "incidents": [],
  "last_error": "2024-05-03T15:03:23.049613783Z",
  "last_success": "2024-05-06T04:59:08.108391516Z",
  "latency": 50111,
  "messages": [],
  "name": "nystartsjobb",
  "online": true,
  "online_24_hours": 100,
  "online_7_days": 99.99,
  "order_id": 0,
  "permalink": "nystartsjobb",
  "ping_time": 7032,
  "public": true,
  "stats": {
    "failures": 3,
    "hits": 116447,
    "first_hit": "2024-02-15T08:09:50.021344Z"
  },
  "status_code": 200,
  "updated_at": "2023-04-16T08:38:44.269558Z"
}
