{
  "avg_response": 23723,
  "check_interval": 60,
  "created_at": "2022-04-21T11:09:11.05084Z",
  "failures_24_hours": 0,
  "group_id": 4,
  "id": 12,
  "incidents": [],
  "last_error": "2024-09-20T15:50:04.370342189Z",
  "last_success": "2024-09-22T05:00:04.221490751Z",
  "latency": 86187,
  "messages": [],
  "name": "nystartsjobb",
  "online": true,
  "online_24_hours": 100,
  "online_7_days": 99.98,
  "order_id": 0,
  "permalink": "nystartsjobb",
  "ping_time": 3959,
  "public": true,
  "stats": {
    "failures": 5,
    "hits": 129612,
    "first_hit": "2024-06-24T04:07:36.554248Z"
  },
  "status_code": 200,
  "updated_at": "2024-09-19T07:35:04.128782Z"
}
