{
  "avg_response": 61417,
  "check_interval": 60,
  "created_at": "2022-04-21T11:09:11.05084Z",
  "failures_24_hours": 0,
  "group_id": 4,
  "id": 12,
  "incidents": [],
  "last_error": "2024-11-08T09:03:14.191645838Z",
  "last_success": "2024-11-12T05:59:04.240560586Z",
  "latency": 99132,
  "messages": [],
  "name": "nystartsjobb",
  "online": true,
  "online_24_hours": 100,
  "online_7_days": 99.99,
  "order_id": 0,
  "permalink": "nystartsjobb",
  "ping_time": 6391,
  "public": true,
  "stats": {
    "failures": 70,
    "hits": 129585,
    "first_hit": "2024-08-14T05:08:21.784032Z"
  },
  "status_code": 200,
  "updated_at": "2024-09-19T07:35:04.128782Z"
}
