{
  "avg_response": 41304,
  "check_interval": 60,
  "created_at": "2022-04-21T11:09:11.05084Z",
  "failures_24_hours": 0,
  "group_id": 4,
  "id": 12,
  "incidents": [],
  "last_error": "2024-10-16T11:51:04.205555291Z",
  "last_success": "2024-10-19T05:00:04.312481718Z",
  "latency": 174264,
  "messages": [],
  "name": "nystartsjobb",
  "online": true,
  "online_24_hours": 100,
  "online_7_days": 99.98,
  "order_id": 0,
  "permalink": "nystartsjobb",
  "ping_time": 6985,
  "public": true,
  "stats": {
    "failures": 9,
    "hits": 129648,
    "first_hit": "2024-07-21T04:07:26.327113Z"
  },
  "status_code": 200,
  "updated_at": "2024-09-19T07:35:04.128782Z"
}
