{
  "avg_response": 29804,
  "check_interval": 60,
  "created_at": "2022-04-21T11:09:11.05084Z",
  "failures_24_hours": 0,
  "group_id": 4,
  "id": 12,
  "incidents": [],
  "last_error": "2024-08-06T07:47:21.784030907Z",
  "last_success": "2024-08-09T04:59:21.783086731Z",
  "latency": 15583,
  "messages": [],
  "name": "nystartsjobb",
  "online": true,
  "online_24_hours": 100,
  "online_7_days": 99.99,
  "order_id": 0,
  "permalink": "nystartsjobb",
  "ping_time": 1571,
  "public": true,
  "stats": {
    "failures": 7,
    "hits": 129562,
    "first_hit": "2024-05-11T04:51:36.517662Z"
  },
  "status_code": 200,
  "updated_at": "2023-04-16T08:38:44.269558Z"
}
