{
  "avg_response": 24373,
  "check_interval": 60,
  "created_at": "2022-04-21T11:09:11.05084Z",
  "failures_24_hours": 0,
  "group_id": 4,
  "id": 12,
  "incidents": [],
  "last_error": "2024-08-06T07:47:21.784031Z",
  "last_success": "2024-09-07T05:00:02.562622994Z",
  "latency": 18348,
  "messages": [],
  "name": "nystartsjobb",
  "online": true,
  "online_24_hours": 100,
  "online_7_days": 100,
  "order_id": 0,
  "permalink": "nystartsjobb",
  "ping_time": 1323,
  "public": true,
  "stats": {
    "failures": 3,
    "hits": 129611,
    "first_hit": "2024-06-09T04:07:36.547678Z"
  },
  "status_code": 200,
  "updated_at": "2023-04-16T08:38:44.269558Z"
}
