{
  "avg_response": 26535,
  "check_interval": 60,
  "created_at": "2022-04-21T11:09:11.05084Z",
  "failures_24_hours": 0,
  "group_id": 4,
  "id": 12,
  "incidents": [],
  "last_error": "2024-09-20T15:50:04.370342189Z",
  "last_success": "2024-09-27T04:59:04.201520144Z",
  "latency": 67055,
  "messages": [],
  "name": "nystartsjobb",
  "online": true,
  "online_24_hours": 100,
  "online_7_days": 99.98,
  "order_id": 0,
  "permalink": "nystartsjobb",
  "ping_time": 6480,
  "public": true,
  "stats": {
    "failures": 5,
    "hits": 129611,
    "first_hit": "2024-06-29T04:07:36.540689Z"
  },
  "status_code": 200,
  "updated_at": "2024-09-19T07:35:04.128782Z"
}
