{
  "avg_response": 40574,
  "check_interval": 60,
  "created_at": "2022-04-21T11:09:11.05084Z",
  "failures_24_hours": 0,
  "group_id": 4,
  "id": 12,
  "incidents": [],
  "last_error": "2024-02-16T13:21:03.792411549Z",
  "last_success": "2024-04-12T04:59:48.824793424Z",
  "latency": 30174,
  "messages": [],
  "name": "nystartsjobb",
  "online": true,
  "online_24_hours": 100,
  "online_7_days": 100,
  "order_id": 0,
  "permalink": "nystartsjobb",
  "ping_time": 7014,
  "public": true,
  "stats": {
    "failures": 1,
    "hits": 105227,
    "first_hit": "2024-01-13T04:10:33.919629Z"
  },
  "status_code": 200,
  "updated_at": "2023-04-16T08:38:44.269558Z"
}
