{
  "avg_response": 40968,
  "check_interval": 60,
  "created_at": "2022-04-21T11:09:11.05084Z",
  "failures_24_hours": 0,
  "group_id": 4,
  "id": 12,
  "incidents": [],
  "last_error": "2024-02-16T13:21:03.792416Z",
  "last_success": "2024-04-15T04:59:08.091548343Z",
  "latency": 35329,
  "messages": [],
  "name": "nystartsjobb",
  "online": true,
  "online_24_hours": 100,
  "online_7_days": 100,
  "order_id": 0,
  "permalink": "nystartsjobb",
  "ping_time": 7031,
  "public": true,
  "stats": {
    "failures": 1,
    "hits": 105232,
    "first_hit": "2024-01-16T04:04:14.995324Z"
  },
  "status_code": 200,
  "updated_at": "2023-04-16T08:38:44.269558Z"
}
