{
  "avg_response": 30603,
  "check_interval": 60,
  "created_at": "2022-04-21T11:09:11.05084Z",
  "failures_24_hours": 0,
  "group_id": 4,
  "id": 12,
  "incidents": [],
  "last_error": "2024-07-10T07:03:13.514921Z",
  "last_success": "2024-08-06T04:59:21.786229717Z",
  "latency": 14535,
  "messages": [],
  "name": "nystartsjobb",
  "online": true,
  "online_24_hours": 100,
  "online_7_days": 100,
  "order_id": 0,
  "permalink": "nystartsjobb",
  "ping_time": 5754,
  "public": true,
  "stats": {
    "failures": 6,
    "hits": 129563,
    "first_hit": "2024-05-08T04:51:29.396072Z"
  },
  "status_code": 200,
  "updated_at": "2023-04-16T08:38:44.269558Z"
}
