{
  "avg_response": 38868,
  "check_interval": 60,
  "created_at": "2022-04-21T11:09:11.05084Z",
  "failures_24_hours": 0,
  "group_id": 4,
  "id": 12,
  "incidents": [],
  "last_error": "2024-06-04T16:03:51.514927119Z",
  "last_success": "2024-06-08T04:59:36.554692686Z",
  "latency": 42089,
  "messages": [],
  "name": "nystartsjobb",
  "online": true,
  "online_24_hours": 100,
  "online_7_days": 99.99,
  "order_id": 0,
  "permalink": "nystartsjobb",
  "ping_time": 7064,
  "public": true,
  "stats": {
    "failures": 6,
    "hits": 129600,
    "first_hit": "2024-03-10T04:54:48.829807Z"
  },
  "status_code": 200,
  "updated_at": "2023-04-16T08:38:44.269558Z"
}
