{
  "avg_response": 66744,
  "check_interval": 60,
  "created_at": "2022-04-21T11:09:11.05084Z",
  "failures_24_hours": 25,
  "group_id": 4,
  "id": 12,
  "incidents": [],
  "last_error": "2024-11-19T05:58:44.001899322Z",
  "last_success": "2024-11-19T05:59:44.547570449Z",
  "latency": 63107,
  "messages": [],
  "name": "nystartsjobb",
  "online": true,
  "online_24_hours": 98.23,
  "online_7_days": 99.64,
  "order_id": 0,
  "permalink": "nystartsjobb",
  "ping_time": 727,
  "public": true,
  "stats": {
    "failures": 106,
    "hits": 129548,
    "first_hit": "2024-08-21T05:09:21.782636Z"
  },
  "status_code": 200,
  "updated_at": "2024-09-19T07:35:04.128782Z"
}
