{
  "avg_response": 38573,
  "check_interval": 60,
  "created_at": "2022-04-21T11:09:11.05084Z",
  "failures_24_hours": 0,
  "group_id": 4,
  "id": 12,
  "incidents": [],
  "last_error": "2024-06-04T16:03:51.514927119Z",
  "last_success": "2024-06-13T04:59:36.541858173Z",
  "latency": 31258,
  "messages": [],
  "name": "nystartsjobb",
  "online": true,
  "online_24_hours": 100,
  "online_7_days": 100,
  "order_id": 0,
  "permalink": "nystartsjobb",
  "ping_time": 6993,
  "public": true,
  "stats": {
    "failures": 6,
    "hits": 129600,
    "first_hit": "2024-03-15T04:54:48.8309Z"
  },
  "status_code": 200,
  "updated_at": "2023-04-16T08:38:44.269558Z"
}
