{
  "avg_response": 31062,
  "check_interval": 60,
  "created_at": "2022-04-21T11:09:11.05084Z",
  "failures_24_hours": 0,
  "group_id": 4,
  "id": 12,
  "incidents": [],
  "last_error": "2024-09-30T13:56:08.143831766Z",
  "last_success": "2024-10-06T05:00:04.231040772Z",
  "latency": 93745,
  "messages": [],
  "name": "nystartsjobb",
  "online": true,
  "online_24_hours": 100,
  "online_7_days": 99.99,
  "order_id": 0,
  "permalink": "nystartsjobb",
  "ping_time": 2056,
  "public": true,
  "stats": {
    "failures": 6,
    "hits": 129610,
    "first_hit": "2024-07-08T04:07:36.537836Z"
  },
  "status_code": 200,
  "updated_at": "2024-09-19T07:35:04.128782Z"
}
