{
  "avg_response": 27521,
  "check_interval": 60,
  "created_at": "2022-04-21T11:09:11.05084Z",
  "failures_24_hours": 0,
  "group_id": 4,
  "id": 12,
  "incidents": [],
  "last_error": "2024-08-06T07:47:21.784030907Z",
  "last_success": "2024-08-18T04:59:21.783200116Z",
  "latency": 15091,
  "messages": [],
  "name": "nystartsjobb",
  "online": true,
  "online_24_hours": 100,
  "online_7_days": 100,
  "order_id": 0,
  "permalink": "nystartsjobb",
  "ping_time": 1938,
  "public": true,
  "stats": {
    "failures": 4,
    "hits": 129565,
    "first_hit": "2024-05-20T04:51:36.544114Z"
  },
  "status_code": 200,
  "updated_at": "2023-04-16T08:38:44.269558Z"
}
