{
  "avg_response": 53302,
  "check_interval": 60,
  "created_at": "2022-04-21T11:09:11.05084Z",
  "failures_24_hours": 1,
  "group_id": 4,
  "id": 12,
  "incidents": [],
  "last_error": "2024-11-02T05:09:04.197418346Z",
  "last_success": "2024-11-02T06:00:04.329269403Z",
  "latency": 192737,
  "messages": [],
  "name": "nystartsjobb",
  "online": true,
  "online_24_hours": 99.93,
  "online_7_days": 99.97,
  "order_id": 0,
  "permalink": "nystartsjobb",
  "ping_time": 5259,
  "public": true,
  "stats": {
    "failures": 70,
    "hits": 129587,
    "first_hit": "2024-08-04T05:07:26.32777Z"
  },
  "status_code": 200,
  "updated_at": "2024-09-19T07:35:04.128782Z"
}
