{
  "avg_response": 40082,
  "check_interval": 60,
  "created_at": "2022-04-21T11:09:11.05084Z",
  "failures_24_hours": 0,
  "group_id": 4,
  "id": 12,
  "incidents": [],
  "last_error": "2024-05-17T07:10:06.648229461Z",
  "last_success": "2024-05-22T04:59:36.554674833Z",
  "latency": 44124,
  "messages": [],
  "name": "nystartsjobb",
  "online": true,
  "online_24_hours": 100,
  "online_7_days": 99.97,
  "order_id": 0,
  "permalink": "nystartsjobb",
  "ping_time": 7042,
  "public": true,
  "stats": {
    "failures": 5,
    "hits": 129601,
    "first_hit": "2024-02-22T04:54:48.840991Z"
  },
  "status_code": 200,
  "updated_at": "2023-04-16T08:38:44.269558Z"
}
