{
  "avg_response": 41007,
  "check_interval": 60,
  "created_at": "2022-04-21T11:09:11.05084Z",
  "failures_24_hours": 0,
  "group_id": 4,
  "id": 12,
  "incidents": [],
  "last_error": "2024-04-21T18:31:23.061480378Z",
  "last_success": "2024-04-25T04:59:08.093464391Z",
  "latency": 35223,
  "messages": [],
  "name": "nystartsjobb",
  "online": true,
  "online_24_hours": 100,
  "online_7_days": 99.99,
  "order_id": 0,
  "permalink": "nystartsjobb",
  "ping_time": 7001,
  "public": true,
  "stats": {
    "failures": 2,
    "hits": 105232,
    "first_hit": "2024-01-26T04:04:10.358009Z"
  },
  "status_code": 200,
  "updated_at": "2023-04-16T08:38:44.269558Z"
}
