{
  "avg_response": 36616,
  "check_interval": 60,
  "created_at": "2022-04-21T11:09:11.05084Z",
  "failures_24_hours": 0,
  "group_id": 4,
  "id": 12,
  "incidents": [],
  "last_error": "2024-07-10T07:03:13.514920639Z",
  "last_success": "2024-07-15T04:59:10.460050455Z",
  "latency": 34205,
  "messages": [],
  "name": "nystartsjobb",
  "online": true,
  "online_24_hours": 100,
  "online_7_days": 99.99,
  "order_id": 0,
  "permalink": "nystartsjobb",
  "ping_time": 5093,
  "public": true,
  "stats": {
    "failures": 8,
    "hits": 129626,
    "first_hit": "2024-04-16T04:26:08.101611Z"
  },
  "status_code": 200,
  "updated_at": "2023-04-16T08:38:44.269558Z"
}
