{
  "avg_response": 51035,
  "check_interval": 60,
  "created_at": "2022-04-21T11:09:11.05084Z",
  "failures_24_hours": 1,
  "group_id": 4,
  "id": 12,
  "incidents": [],
  "last_error": "2024-10-30T01:47:04.154448266Z",
  "last_success": "2024-10-30T06:00:04.293294701Z",
  "latency": 154936,
  "messages": [],
  "name": "nystartsjobb",
  "online": true,
  "online_24_hours": 99.93,
  "online_7_days": 99.97,
  "order_id": 0,
  "permalink": "nystartsjobb",
  "ping_time": 7106,
  "public": true,
  "stats": {
    "failures": 69,
    "hits": 129588,
    "first_hit": "2024-08-01T05:07:26.330042Z"
  },
  "status_code": 200,
  "updated_at": "2024-09-19T07:35:04.128782Z"
}
