{
  "avg_response": 48693,
  "check_interval": 60,
  "created_at": "2022-04-21T11:09:11.05084Z",
  "failures_24_hours": 1,
  "group_id": 4,
  "id": 12,
  "incidents": [],
  "last_error": "2024-10-27T01:46:04.175287523Z",
  "last_success": "2024-10-27T06:00:04.212620477Z",
  "latency": 74268,
  "messages": [],
  "name": "nystartsjobb",
  "online": true,
  "online_24_hours": 99.93,
  "online_7_days": 99.41,
  "order_id": 0,
  "permalink": "nystartsjobb",
  "ping_time": 7005,
  "public": true,
  "stats": {
    "failures": 68,
    "hits": 129589,
    "first_hit": "2024-07-29T05:07:26.327306Z"
  },
  "status_code": 200,
  "updated_at": "2024-09-19T07:35:04.128782Z"
}
