1697520642,1
1698211845,1
1698474646,2
1698561046,1
1698647445,1
1698733843,1
1698993045,2
1699079441,1
1699165843,1
1699252253,6
1699338639,1
1699425038,1
1699597838,2
1699684239,1
1699770639,1
1699943446,1
