1663050638,4
1663080057,4
1663137169,6
1663166448,6
1663223564,5
1663252844,5
1663309969,3
1663339237,3
1663396358,3
1663425653,3
1663482759,3
1663512042,3
1663741840,2
1663771124,2
1663828239,1
1663857524,1
