1680586299,270
1680672702,7
1680759104,316
1681191117,1348
1681277516,2348
1681363906,5028
1681450306,2204
1681536706,49
1681623105,11
1681709528,1479
1681795909,433
1681882326,690
1681968706,596
1682055103,305
1682314324,1454
1682400707,889
1682487105,874
1682573524,1051
1682659898,1317
1682746309,1
1682832700,1
1682919107,1
1683005499,1769
1683091901,1262
1683178309,2118
1683264713,1633
1683351101,1
1683437506,1
1683523904,1525
1683610328,439
1683696716,460
1683783116,2583
1683869508,3547
1683955918,501
1684042308,802
1685544777,1059
1685597496,231
1685683902,558
1685770303,1
1685856701,1
1685943100,114
1686029502,165
1686115904,624
1686202306,867
1686288711,371
1686375108,210
1686461512,1
1686547909,1145
1686634309,1294
1686720704,593
1686807105,164
1686893562,628
1686979954,1
1687066360,1
1687152774,673
1687239150,825
1687411953,317
1687498393,1
1687584774,1
1687671173,1
1687757568,606
1687843969,480
1687930377,331
1688016807,681
1688103218,1
1688189597,1
1688275996,1
1688362412,219
1688535215,289
1688621614,604
1688708029,188
1688794420,123
1688880821,15
1688967219,896
1689053626,310
1689140028,175
1689226424,172
1689312837,21
1689399195,1
1689485597,125
1689572000,95
1689658397,5
1689744807,123
1689831241,1
1689917640,1
1690004042,1
1690090404,1
1690176817,1
1690263240,1
1690349617,1
1690522443,1
1690608808,1
1690695212,1
1690781617,2689
1690868047,749
1690954421,648
1691040818,1191
1691127250,422
1691213630,1
1691300015,95
1691386395,1
1691559206,95
1691645653,6
1691732035,1
1691818443,1
1691904834,1
1691991184,2763
1692077570,1479
1692163972,1559
1692250382,135
1692336773,170
1692423180,1
1692509573,1
1692595944,191
1692682368,3483
1692768764,4382
1692855167,2498
1692941568,686
1693027980,1
1693114356,1
1693200777,3522
1693287141,2210
1693373568,405
1693459952,948
1693546364,1714
1693632754,1
1693719144,468
1693805540,1595
1693891949,1833
1693978362,1426
1694064749,495
1694151151,602
1694237547,41
1694323959,1
1694410362,1166
1694496769,575
1694583178,742
1694669562,1751
1694755972,964
1694842363,120
1694928766,3
1695015165,1664
1695187975,3178
1695274380,217
1695360784,164
1695447164,47
1695533586,35
1695619990,1452
1695706406,232
1695792808,384
1695879218,845
1695965624,1564
1696052011,249
1696138408,173
1696224807,643
1696311219,176
1696397621,440
1696484041,876
1696570435,205
1696656841,1
1696743237,1
1696829644,1705
1696916048,840
1697002439,440
1697088838,183
1697175238,597
1697348050,2
1697434425,582
1697520844,88
1697607247,554
1697693651,547
1697780021,1269
1697866447,1
1697952848,1
1698039229,1123
1698125641,97
1698212053,694
1698298423,1900
1698384826,435
1698474862,85
1698561261,129
1698647660,439
1698734051,413
1698820440,381
1698906836,1005
1698993260,673
1699079643,1
1699166057,1
1699252467,1010
1699338847,757
1699425254,1821
1699511642,1323
1699598052,391
1699684453,57
1699770845,136
1699857241,594
1699943653,762
1700030030,47
1700116443,511
1700202865,759
1700289223,1
1700375637,1
1700462021,894
1700548451,276
1700634836,975
1700721246,875
1700807657,719
1700894058,1
1700980458,1
