1690263240,1
1690349617,20
1690436012,2
1690522443,20
1690608808,8
1690695212,13
1690781617,21
1690868047,23
1690954421,17
1691040818,27
1691127250,31
1691213630,28
1691300015,31
1691386395,30
1691472821,2
