1676356254,70
1676442661,167
1676529061,283
1676615450,168
1676701857,136
1676788249,244
1676874662,138
1676961061,129
1677047454,296
1677133857,124
1677220262,153
1677306660,200
1677393061,161
1677479458,264
1677565859,584
1677652257,1128
