1655274636,6
1655361158,15
1655447555,5
1655533836,7
1655620256,10
1655706645,8
1655793158,11
1655879557,8
1655965955,13
1656052365,9
1656138754,9
1656225155,7
1656311556,9
1656397956,9
1656484356,6
1656570758,9
1656743558,7
1656829841,8
1656916357,12
1657002637,14
1657089163,6
1657175559,23
1657261838,12
1657348240,12
1657434758,9
1657521164,17
1657607566,22
1657693957,9
1657780357,11
1657803090,11
1657804447,11
1657809517,11
1657866760,15
1657896040,15
