1673516775,8
1674367285,432
1674455475,432
1674541884,433
1674628285,1289
1674714694,1532
1674801082,1552
1674887480,1558
1674973872,1542
1675060281,1005
1675146682,698
1675233071,430
1675319481,669
1675405883,429
1675492281,432
1675578681,432
1675665075,433
1675751474,434
1675837863,229
1676356254,186
1676442661,433
1676529061,426
1676615450,496
1676701857,432
1676788249,432
1676874662,427
1676961061,430
1677047454,417
1677133857,423
1677220262,430
1677306660,432
1677393061,432
1677479458,432
1677565859,433
1677652257,633
1677738657,432
1677825057,432
1677911460,438
1677997847,1366
1678084257,781
1678170666,433
1678257055,434
1678343445,442
1679569142,432
1679584407,432
1679589867,432
1679596494,432
1679602915,432
1679607956,432
1679639532,468
1679722309,432
1679808717,432
1679895117,313
1679981518,406
1680067912,432
1680154308,443
1680240714,432
1680327097,432
1680413504,504
1680499902,576
1680586299,576
1680672702,576
1680759104,568
1680845523,570
1680931899,574
1681018301,576
1681104713,574
1681191117,964
1681277516,929
1681363906,929
1681450306,924
1681536706,929
1681623105,927
1681709528,694
1681795909,504
1681882326,503
1681968706,568
1682055103,504
1682141505,504
1682227910,504
1682314324,501
1682400707,503
1682487105,503
1682573524,504
1682659898,552
1682746309,576
1682832700,576
1682919107,576
1683005499,576
1683091901,661
1683178309,576
1683264713,576
1683351101,574
1683437506,576
1683523904,594
1683610328,576
1683696716,701
1683783116,650
1683869508,576
1683955918,576
1684042308,576
1685544777,504
1685597496,504
1685683902,503
1685770303,502
1685856701,504
1685943100,503
1686029502,502
1686115904,545
1686202306,503
1686288711,504
1686375108,498
1686461512,502
1686547909,500
1686634309,501
1686720704,471
1686807105,503
1686893562,504
1686979954,504
1687066360,503
1687152774,504
1687239150,501
1687411953,515
1687498393,570
1687584774,534
1687671173,518
1687757568,576
1687843969,576
1687930377,576
1688016807,575
1688103218,576
1688189597,576
1688275996,538
1688362412,576
1688535215,576
1688621614,572
1688708029,576
1688794420,576
1688880821,576
1688967219,576
1689053626,420
1689140028,576
1689226424,576
1689312837,576
1689399195,576
1689485597,576
1689572000,576
1689658397,576
1689744807,576
1689831241,574
1689917640,576
1690004042,576
1690090404,576
1690176817,576
1690263240,576
1690349617,576
1690436012,576
1690522443,576
1690608808,576
1690695212,576
1690781617,576
1690868047,541
1690954421,202
1695879218,1
