1655793158,7
1655879557,31
1655965955,28
1656052365,34
1656138754,22
1656225155,26
1656311556,30
1656397956,33
1656484356,35
1656570758,44
1656743558,22
1656829841,29
1656916357,29
1657002637,38
1657089163,16
