1697088838,5
1697175238,20
1697261644,25
1697348050,20
1697434425,31
1697520844,37
1697607247,16
1697693651,13
1697780021,15
1697866447,33
1697952848,49
1698039229,46
1698125641,27
1698212053,12
1698298423,30
1698384826,17
1698474862,16
1698561261,20
1698647660,19
1698734051,11
1698820440,20
1698906836,15
1698993260,20
1699079643,15
1699166057,15
1699252467,16
1699338847,20
1699425254,17
1699511642,12
1699598052,16
1699684453,22
1699770845,19
1699857241,12
1699943653,32
1700030030,7
1700116443,10
1700202865,16
1700289223,33
1700375637,24
1700462021,39
1700548451,74
1700634836,22
1700721246,20
1700807657,14
1700894058,16
1700980458,22
