1692163972,1
1692250382,20
1692336773,10
1692423180,10
1692509573,7
1692595944,5
1692682368,6
1692768764,6
1692855167,25
1692941568,10
1693027980,20
1693114356,11
1693200777,7
1693287141,9
1693373568,9
