1662359420,6
1662388701,6
1662445820,7
1662475100,7
1662532221,4
1662561500,4
1662618621,5
1662647901,5
1662705021,6
1662734301,6
1662791421,3
1662820700,3
1662877820,5
1662907100,5
1662964220,6
1662993501,6
1663050620,5
1663079900,5
1663137032,5
1663166301,6
1663223426,5
1663252701,5
1663309821,5
1663339101,5
1663396221,7
1663425502,7
1663482622,5
1663511901,5
1663569021,6
1663598303,6
1663655421,6
1663684703,6
1663741822,6
1663771101,6
1663828220,9
1663857500,9
1663914621,8
1663943902,8
1664001021,8
1664030301,8
1664087421,6
1664116701,6
1664173822,6
1664203101,6
1664260231,7
1664289502,7
1664346622,6
1664375912,6
1664433023,6
1664462299,6
1664519418,1
1664548696,3
1664635096,1
1668081505,1
1668350508,1
1668355650,1
1668356487,1
1668360366,1
1679584314,12
1679589759,12
1679596397,12
1679602819,12
1679607852,12
1679639432,18
1679722230,10
1679808631,13
1679981431,10
1680067829,15
1680154230,9
1680240629,2
1680327029,7
1680413427,8
1680499830,5
1680586231,4
1680672631,5
1680759032,5
1680845434,3
1680931831,3
1681018231,3
1681104631,4
1681191033,4
1681277433,5
1681363834,2
1681450235,4
1681536635,4
1681623032,6
1681709434,4
1681795835,3
1681882234,5
1681968635,4
1682055034,4
1682141433,3
1682227834,4
1682314235,5
1682400635,3
1682487032,5
1682573432,4
1682659832,3
1682746233,4
1682832633,4
1682919034,4
1683005434,3
1683091833,2
1683264631,4
1683351031,4
1683437432,4
1683523832,4
1683610233,4
1683696632,2
1683783032,2
1683869438,2
1683955833,2
1684042234,4
1685544705,2
1685597429,3
1685683833,3
1685770233,3
1685856632,1
1685943031,2
1686029431,2
1686115831,5
1686202233,3
1686288634,2
1686375033,3
1686461431,4
1686547832,3
1686634231,3
1686720636,1
1686807032,2
1686893441,3
1686979840,1
1687066239,3
1687152641,5
1687239039,3
1687411840,2
1687498241,1
1687584640,4
1687671039,3
1687757437,3
1687843838,5
1687930240,4
1688016640,3
1688103041,6
1688189452,5
1688275841,4
1688362240,8
1688535044,9
1688621445,4
1688707844,3
1688794245,6
1688880644,2
1688967042,6
1689053441,5
1689139840,1
1689226241,6
1689312653,218
1689399039,4
1689485439,4
1689571840,3
1689658239,2
1689744640,2
1689831044,5
1689917446,3
1690003846,2
1690090245,4
1690176650,4
1690263047,2
1690349447,3
1690435846,2
1690522245,3
1690608645,2
1690695045,2
1690781448,4
1690867847,2
1690954248,3
1691040648,4
1691127048,3
1691213447,1
1691299847,4
1691472645,4
1691559043,3
1691645448,3
1691731846,2
1691818247,2
1691904646,1
1691991040,2
1692077440,2
1692163831,1
1692250233,2
1692336633,2
1692423035,2
1692509432,1
1692682233,5
1692768633,2
1692855035,2
1692941433,2
1693027839,2
1693114233,1
1693200633,1
1693373437,3
1693459835,4
1693546239,1
1693632645,2
1693719037,4
1693805431,2
1693891835,3
1693978232,1
1694064634,2
1694151031,1
1694237434,2
1694323834,1
1694410234,2
1694496634,2
1694583036,1
1694669436,2
1694842234,1
1694928634,1
1695015035,2
1695187834,1
1695274234,2
1695360634,1
1695447034,1
1695533434,2
1695706241,1
1695792643,2
1695879053,11
1695965441,1
1696051841,6
1696138241,9
1696224642,9
1696397445,7
1696483842,1
1696570241,6
1696656645,2
1696743043,3
1696829444,2
1696915841,1
1697002242,1
1697088641,2
1697175042,2
1697347842,2
1697434244,1
1697520642,1
1697607044,1
1697693444,1
1697779843,2
1697866244,2
1697952644,2
1698039045,1
1698125444,2
1698211845,1
1698298245,2
1698384642,2
1698474646,1
1698561046,1
1698647445,1
1698733843,1
1698820251,2
1698906644,1
1698993045,2
1699079441,3
1699165843,1
1699252253,1
1699338639,3
1699425038,4
1699511438,7
1699597838,2
1699684239,2
1699770639,4
1699857040,7
1699943446,4
1700029845,5
1700116239,2
1700202637,2
1700289040,8
1700375440,5
1700461838,1
1700548240,3
1700634640,3
1700721041,2
1700807441,4
1700893840,3
1700980240,6
