1679584314,3
1679589759,3
1679596397,3
1679602819,3
1679607852,3
1679639432,3
1679981431,2
1680240629,3
1680845434,3
1681623032,1
1682573432,1
1686288634,1
1686807032,1
1686893441,2
1687498241,2
1688016640,3
1688103041,3
1688275841,1
1688362240,3
1688535044,2
1688621445,2
1688707844,2
1688794245,2
1688880644,2
1688967042,2
1689053441,2
1689139840,2
1689226241,2
1689312653,2
1689744640,2
1689831044,2
1689917446,2
1690003846,2
1690263047,2
1690522245,2
1690867847,2
1691127048,2
1691645448,1
1691818247,1
1691904646,1
1691991040,1
1692077440,1
1692163831,1
1692250233,1
1692336633,1
1692423035,1
1692509432,1
1692682233,1
1692768633,1
1692855035,1
1692941433,1
1693027839,1
1693200633,1
1693978232,2
1694323834,1
1694496634,1
1694583036,1
1694669436,1
1694755834,1
1694842234,6
1694928634,6
1695187834,5
1695274234,5
1695360634,5
1695533434,5
1695619839,7
1695965441,5
1696483842,5
1696570241,4
1696656645,5
1696743043,3
1696829444,5
1696915841,5
1697002242,5
1697088641,5
1697175042,5
1697261447,6
1697347842,6
1697520642,5
1697607044,5
1697693444,5
1697866244,5
1697952644,5
1698211845,5
1698474646,6
1698561046,5
1698647445,5
1698733843,5
1698906644,1
1698993045,6
1699079441,4
1699165843,4
1699252253,24
1699338639,4
1699425038,4
1699597838,6
1699684239,4
1699770639,4
1699943446,3
1700116239,3
1700202637,8
1700548240,4
1700721041,4
1700807441,6
1700893840,3
1700980240,3
