1660545162,5
1660574449,5
1660631564,9
1660660730,9
1660717841,5
1660747248,5
1660804362,7
1660833647,7
1660890760,4
1660920046,4
1660977162,9
1661006455,9
1661063442,3
1661092854,3
1661149842,5
1661179125,5
1661236366,6
1661265647,6
1661322641,14
1661352051,14
1661409162,12
1661438449,12
1661495561,19
1661524735,19
1661581964,24
1661611239,24
1661668363,8
1661697647,8
1661700049,8
1661754784,12
1661784048,12
