1691645653,6
1691732035,330
1691818443,136
1691904834,248
1691991184,135
1692077570,690
1692163972,145
1692250382,250
1692336773,132
1692423180,127
1692509573,563
1692595944,112
1692682368,92
1692768764,163
1692855167,1879
1692941568,97
1693027980,245
1693114356,19
