1660545162,66
1660574449,66
1660631564,141
1660660730,141
1660717841,233
1660747248,233
1660804362,103
1660833647,103
1660890760,225
1660920046,225
1660977162,190
1661006455,190
1661063442,171
1661092854,171
1661149842,144
1661179125,144
1661236366,143
1661265647,143
1661322641,150
1661352051,150
1661409162,419
1661438449,419
1661495561,368
1661524735,368
1661581964,133
1661611239,133
1661668363,108
1661697647,108
1661700049,108
1661754784,143
1661784048,143
1661870448,70
