1679584314,3
1679589759,3
1679596397,3
1679602819,3
1679607852,3
1679639432,3
1679981431,2
1680240629,1
1680845434,3
1683437432,1
1683610233,1
1687498241,1
1688016640,2
1688103041,2
1688275841,2
1688362240,2
1688535044,2
1688621445,2
1688707844,2
1688794245,2
1688880644,2
1688967042,2
1689053441,2
1689139840,2
1689226241,2
1689312653,2
1689744640,2
1689831044,2
1689917446,2
1690003846,2
1690263047,2
1690522245,2
1690867847,3
1691127048,3
1691645448,4
1691818247,4
1691904646,1
1691991040,4
1692077440,3
1692163831,3
1692250233,3
1692336633,3
1692423035,3
1692509432,3
1692682233,2
1692768633,2
1692855035,2
1692941433,2
1693027839,2
1693200633,2
1693978232,3
1694323834,2
1694410234,1
1694496634,1
1694583036,3
1694755834,3
1694842234,3
1694928634,3
1695187834,1
1695274234,2
1695360634,2
1695533434,2
1695619839,2
1695965441,2
1696051841,2
1696483842,2
1696570241,2
1696656645,2
1696743043,2
1696829444,2
1696915841,2
1697002242,3
1697088641,3
1697175042,3
1697261447,3
1697347842,3
1697520642,3
1697607044,3
1697693444,3
1697866244,3
1697952644,3
1698039045,1
1698211845,2
1698474646,3
1698561046,2
1698647445,2
1698733843,2
1698993045,3
1699079441,2
1699165843,2
1699252253,9
1699338639,1
1699425038,2
1699597838,4
1699684239,2
1699770639,2
1699943446,2
1700116239,3
1700202637,6
1700548240,3
1700721041,3
1700807441,6
1700893840,3
1700980240,3
