1674541884,6
1674973872,9
1675060281,16
1676529061,13
1676788249,3
1680067912,3
1681450306,5
1683523904,6
1691300015,2
1691472821,3
1691559206,2
1691645653,2
1691818443,2
1692250382,3
1694151151,12
1700462021,8
1700548451,7
1700634836,12
1700721246,7
1700807657,6
