1636085413,4253
1636171758,0
1636258047,0
1636344387,0
1636365235,0
1636368220,0
1636369366,314
1636370515,603
1636372407,973
1636372512,994
1636372599,1012
1636372811,1053
1636372887,1073
1636430897,4418
1636517208,8507
1636603604,8544
1636690021,8423
1636776504,8170
1636862976,3447
1636949220,3537
1636981993,6645
1637156725,6540
1637157217,6579
1637159211,8630
1637208427,8477
1637294844,8784
1637381205,8110
1637467626,3353
1637554019,3408
1637640485,9011
1637676246,9011
1637726862,8899
1637813312,8705
1637899767,8649
1637986036,7933
1638072403,3413
1638158916,3531
1638245284,8869
1638331633,8961
1638418036,8780
1638504519,11
1638590928,11
1638677261,11
1638763649,11
1638850132,11
1638936466,11
1639022797,11
1639109519,11
1639148228,11
1639149681,11
1639195619,11
1639236023,11
1639282279,11
1639322481,11
1639368511,11
1639408882,11
1639454864,11
1639495281,11
1639541282,11
1639581682,11
1639627747,11
1639665077,11
1639667482,11
1639714074,11
1639800485,11
1639990948,3293
1639994349,3293
1640067322,8225
1640069633,8225
1640072394,8225
1640145624,8205
1640166712,8205
1640232084,7293
1640318482,5512
1640404823,2911
1640491222,2851
1640577683,2996
1640664084,5754
1640750423,5950
1640836883,5836
1640923283,5330
1641009622,2855
1641096025,2811
1641182483,3251
1641268883,7196
1641355222,7290
1641441623,6997
1641528083,3387
1641614483,5871
1641700823,12
1641787283,3471
1641873623,8755
1641960084,9027
1642046482,12
1642090496,12
1642133094,12
1642146532,12
1642219285,12
1642232781,12
1642305624,12
1642319181,12
1642392026,3459
1642405139,12
1642405521,3459
1642407159,12
1642409028,12
1642478487,203
1642495342,203
1642564884,12
1642651284,12
1642737626,12
1642762914,12
1642855902,12
1642858004,12
1642891536,12
1642892251,12
1642910426,12
1642941525,12
1642996890,12
1643011055,12
1643020965,12
1643024264,12
1643083292,12
1643169692,12
1643256028,12
1643342490,12
1643428887,12
1643515227,12
1643601688,12
1643688033,12
1643708606,12
1643774428,12
1643795007,12
1643860889,12
1643947289,12
1644033688,12
1644120029,12
1644206488,12
1644292893,12
1644379231,12
1644407430,12
1644474689,12
1644493890,12
1644561092,12
1644580288,12
1644647430,12
1644733891,12
1644820234,12
1644856908,12
1644906692,12
1644993089,12
1645079490,12
1645165899,12
1645252229,12
1645338690,12
1645425029,12
1645511429,12
1645553513,27
1645557226,13752
1645597891,13777
1645684290,13536
1645770630,12713
1645857028,11490
1645943550,5770
1646029952,6188
1646116291,13781
1646202635,13406
1646289158,14248
1646375432,14095
1646461949,12672
1646548350,6259
1646634628,6864
1646721149,13711
1646807560,13441
1646893830,14073
1646980350,13700
1647066628,12232
1647153150,6156
1647239549,6711
1647325948,15696
1647412351,15453
1647498751,14976
1647585151,14884
1647671550,12979
1647844353,6711
1647930754,15274
1648017150,14203
1648103548,14490
1648189949,13292
1648276230,12284
1648362628,6217
1648449151,6684
1648535432,14399
1648621839,14378
1648708351,13307
1648794630,13838
1648881149,12533
1648967548,6139
1649053960,6594
1649140231,13271
1649226749,13119
1649313150,13228
1649399428,12479
1649485948,12054
1649572348,6183
1649658753,6385
1649745149,12475
1649831548,12227
1649917963,12083
1650004349,11108
1650090627,6190
1650177027,5644
1650263549,5934
1650349948,6796
1650436229,12766
1650522628,12284
1650609149,12819
1650695561,11425
1650781948,6391
1650868352,6504
1650954748,12132
1651041029,12098
1651127428,12080
1651213951,12147
1651300350,11549
1651386751,6403
1651473155,7314
1651559433,13307
1651645962,12982
1651732248,11752
1651818761,12049
1651905152,11878
1651991553,6323
1652077957,6484
1652164353,11970
1652250758,11982
1652337162,11928
1652423431,12409
1652509952,11958
1652596231,6337
1652682631,6151
1652769157,12531
1652855559,14057
1652941958,13861
1653028358,15844
1653114752,13923
1653201153,6704
1653287558,7036
1653373956,14825
1653460353,13745
1653546633,12687
1653633154,6928
1653719553,10997
1653805952,6484
1653892356,6900
1653978635,14517
1654065154,14408
1654151432,13123
1654237952,14081
1654324230,12625
1654410751,7062
1654497030,6808
1654583552,7574
1654669953,12969
1654756236,12883
1654842755,12602
1654929155,12255
1655015555,6334
1655101836,7578
1655188236,12888
1655274756,12275
1655361035,11937
1655447557,11121
1655533954,11613
1655620235,7480
1655706655,6659
1655793044,12268
1655879557,10955
1655965956,12283
1656052354,11331
1656138764,6093
1656225154,6077
1656311555,6856
1656397955,11537
1656484355,11060
1656570755,10681
1656657157,11657
1656829957,6325
1656916240,6027
1657002756,10473
1657089036,10204
1657175562,11183
1657261958,10054
1657348237,10404
1657434639,6693
1657521157,6454
1657607563,9549
1657693965,9782
1657780356,9798
1657866756,10050
1657889489,10050
1657890847,10050
1657895917,10050
1657953159,10525
1657982440,10525
1658039557,6884
1658068724,6884
1658125837,6643
1658155125,6643
1658212242,9500
1658241646,9500
1658298761,9633
1658328061,9633
1658385157,8788
1658414451,8788
1658471440,8957
1658500847,8957
1658557959,9110
1658587246,9110
1658644362,6085
1658673646,6085
1658730759,7092
1658760045,7092
1658817161,10170
1658846445,10170
1658903559,8648
1658932853,8648
1658989838,9505
1659019248,9505
1659076239,8907
1659105645,8907
1659162764,8337
1659192045,8337
1659249170,6153
1659278444,6153
1659335558,6287
1659364870,6287
1659421964,10047
1659451247,10047
1659508362,10236
1659537528,10236
1659594767,9882
1659623919,9882
1659681166,9401
1659710449,9401
1659767558,8910
1659796844,8910
1659853960,6667
1659883245,6667
1659940239,7398
1659969530,7398
1660026768,11187
1660056038,11187
1660113046,11341
1660142449,11341
1660199562,10992
1660228839,10992
1660285840,11471
1660315249,11471
1660372369,10588
1660401650,10588
1660458649,7105
1660487920,7105
1660545160,7660
1660574448,7660
1660631561,14030
1660660849,14030
1660717962,13519
1660747130,13519
1660804239,13395
1660833647,13395
1660890761,12819
1660920047,12819
1660977159,13591
1661006445,13591
1661063561,8145
1661092855,8145
1661149841,8891
1661179253,8891
1661236240,15265
1661265524,15265
1661322765,14933
1661352047,14933
1661409040,16209
1661438450,16209
1661495560,15417
1661524848,15417
1661581959,14396
1661611135,14396
1661668363,7875
1661697638,7875
1661754762,8303
1661784046,8303
1661786448,8303
1661841183,13920
1661870447,13920
1661956847,13413
1662013959,14854
1662043124,14854
1662100358,14635
1662129646,14635
1662186758,12836
1662216037,12836
1662273159,7818
1662302445,7818
1662359438,8740
1662388847,8740
1662445958,13684
1662475127,13684
1662532357,13607
1662561524,13607
1662618757,14801
1662648043,14801
1662705157,14308
1662734324,14308
1662791563,13614
1662820836,13614
1662877957,8599
1662907123,8599
1662964246,7930
1662993637,7930
1663050756,15522
1663080044,15522
1663137037,14817
1663166446,14817
1663223568,15839
1663252848,15839
1663309963,14477
1663339243,14477
1663396358,14655
1663425636,14655
1663482757,9547
1663512053,9547
1663569158,9362
1663598442,9362
1663655557,15709
1663684847,15709
1663741959,15238
1663771125,15238
1663828239,16506
1663857524,16506
1663914637,15499
1663943923,15499
1664001039,14773
1664030333,14773
1664087438,9576
1664116718,9576
1664173838,19125
1664203122,19125
1664260240,17539
1664289527,17539
1664346649,15635
1664375936,15635
1664433039,14996
1664462351,14996
1664519440,16361
1664548720,16361
1664605953,14087
1664635111,14087
1664692232,9137
1664721511,9137
1668167943,14384
1668436932,8827
1668442372,8827
1668443157,8827
1668447210,8827
1668560583,14857
1668646976,14620
1668733378,13846
1671715511,13780
1671717054,13780
1671718850,13780
1671720401,13780
1673603173,12557
1674453673,8693
1674541873,12266
1674628273,11381
1674714674,11818
1674801082,13159
1674887471,10587
1674973869,8439
1675060271,9801
1675146669,12898
1675233070,13088
1675319469,12115
1675405869,11974
1675492271,11800
1675578670,7523
1675665070,9627
1675751462,12121
1675837862,12363
1675924262,6438
1676010657,0
1676442652,9958
1676529048,12936
1676615449,12166
1676701848,11019
1676788246,8254
1676874648,8394
1676961050,11505
1677047449,10927
1677133847,12325
1677220250,11749
1677306650,9681
1677393048,8689
1677479450,7996
1677565845,11836
1677652246,11573
1677738645,11684
1677825045,11391
1677911445,10821
1677997848,8582
1678084246,8784
1678170644,11989
1678257054,12369
1678343443,11303
1678429843,10697
1678465545,10697
1678516354,11119
1678602644,7508
1678689045,8749
1678775448,12947
1678805313,12947
1678806266,12947
1678808400,12947
1678809887,12947
1678811804,12947
1678861848,11772
1678948262,11565
1679000848,11565
1679034754,12029
1679121045,9970
1679293847,8340
1679380243,11262
1679466646,11323
1679553045,12951
1679584893,12951
1679639446,11789
1679649268,11789
1679654398,11789
1679655542,11789
1679670807,11789
1679676255,11789
1679682894,11789
1679689305,11789
1679694345,11789
1679725920,10156
1679808698,7202
1679895105,7982
1679981506,7027
1680067916,11221
1680154299,10628
1680240696,10938
1680327102,10701
1680413496,8769
1680499892,8068
1680586295,11633
1680672697,13074
1680759100,12124
1680845502,10351
1680931922,7849
1681018297,7073
1681104699,7822
1681191101,8522
1681277505,12240
1681363905,12337
1681450305,13307
1681536705,10718
1681623105,7317
1681709505,7938
1681795917,11831
1681882307,10815
1681968715,10837
1682055105,10423
1682141502,9905
1682227904,7112
1682314309,7977
1682400708,11641
1682487106,11017
1682573504,11051
1682659913,10665
1682746297,9548
1682832699,7111
1682919099,6506
1683005506,8531
1683091898,11789
1683178300,11233
1683264708,11146
1683351102,10309
1683437500,7483
1683523906,8433
1683610303,11300
1683696716,11409
1683783104,10566
1683869504,11252
1683955907,10489
1684042307,7192
1684128707,7363
1685631175,12209
1685683895,12271
1685770301,10931
1685856702,8717
1685943100,8560
1686029499,11401
1686115901,9376
1686202302,11713
1686288705,10978
1686375110,9884
1686461507,7941
1686547911,7891
1686634307,12192
1686720707,11316
1686807103,11588
1686893504,14840
1686979961,11407
1687066348,8409
1687152759,8640
1687239172,11124
1687325548,11164
1687498352,9917
1687584792,7126
1687671173,7124
1687757572,8075
1687843965,11742
1687930367,11297
1688016775,11877
1688103205,10634
1688189616,10141
1688275996,8214
1688362394,8753
1688448810,10537
1688621612,10240
1688708012,10016
1688794417,9577
1688880818,7751
1688967219,6865
1689053617,9601
1689140025,9262
1689226426,10478
1689312822,10260
1689399235,9040
1689485593,8583
1689571995,8178
1689658398,10463
1689744795,9407
1689831205,9742
1689917639,9569
1690004038,7743
1690090440,7704
1690176802,6913
1690263215,10626
1690349638,9514
1690436015,9555
1690522410,8989
1690608841,8874
1690695206,7543
1690781610,8517
1690868015,10665
1690954445,10951
1691040819,9969
1691127216,9949
1691213648,9359
1691300029,8285
1691386413,8522
1691472793,12032
1691559219,11460
1691645604,11677
1691732050,10880
1691818433,9285
1691904841,7695
1691991232,9482
1692077582,12027
1692163968,12052
1692250370,12952
1692336781,12682
1692423172,10747
1692509578,7443
1692595971,8347
1692682344,2412
1692768767,11500
1692855162,12616
1692941565,12010
1693027967,10343
1693114379,7572
1693200755,9014
1693287175,13762
1693373540,9495
1693459966,12862
1693546350,13110
1693632762,12829
1693719153,8652
1693805543,9107
1693891937,14639
1693978347,13476
1694064760,14984
1694151147,13386
1694237549,13771
1694323946,9740
1694410357,9859
1694496760,13935
1694583167,17162
1694669576,15536
1694755960,16341
1694842370,13778
1694928762,8287
1695015165,9722
1695101563,14720
1695274372,17860
1695360777,14697
1695447181,12567
1695533563,9278
1695619984,8808
1695706387,13836
1695792803,14327
1695879206,14539
1695965615,13927
1696052022,14044
1696138409,11695
1696224807,13113
1696311204,17329
1696397616,14910
1696484018,15339
1696570438,15156
1696656833,14388
1696743239,10748
1696829636,11694
1696916042,15913
1697002436,15586
1697088836,16670
1697175236,17670
1697261636,13412
1697348042,10162
1697434439,12072
1697520822,15261
1697607242,15207
1697693645,14923
1697780047,13951
1697866419,11473
1697952845,8776
1698039246,9778
1698125626,14945
1698212037,14805
1698298450,13241
1698384820,12768
1698471223,11389
1698561260,9349
1698647658,10056
1698734057,14567
1698820447,13436
1698906836,15670
1698993232,15378
1699079657,12378
1699166040,8956
1699252455,10200
1699338863,15500
1699425243,16649
1699511651,15011
1699598034,15770
1699684449,16088
1699770851,12302
1699857242,11896
1699943637,17205
1700030050,16937
1700116427,16659
1700202841,15870
1700289263,13874
1700375622,9699
1700462036,11428
1700548419,16223
1700634849,14704
1700721234,15648
1700807643,15168
1700894055,13205
1700980456,10184
1701066856,11349
