1697693651,4
1697780021,3
1697866447,3
1697952848,1
1698039229,3
1698125641,28
1698212053,2
1698298423,4
1698384826,3
1698474862,17
1698561261,46
1698647660,16
1698734051,12
1698820440,7
1698906836,21
1698993260,3
1699079643,4
1699166057,6
1699252467,5
1699338847,2
1699425254,2
