1679639432,3
1679722230,4
1679808631,4
1679981431,2
1680067829,4
1680154230,4
1680240629,2
1680327029,5
1680413427,5
1680499830,4
1680586231,4
1680672631,4
1680759032,4
1680845434,4
1680931831,3
1681018231,3
1681104631,3
1681191033,5
1681277433,4
1681363834,2
1681450235,4
1681536635,4
1681623032,4
1681709434,5
1681795835,3
1681882234,5
1681968635,3
1682055034,4
1682141433,3
1682227834,4
1682314235,4
1682400635,3
1682487032,4
1682573432,2
1682659832,3
1682746233,4
1682832633,4
1682919034,4
1683005434,3
1683091833,4
1683264631,4
1683351031,4
1683437432,4
1683523832,3
1683610233,5
1683696632,3
1683783032,3
1683869438,2
1683955833,2
1684042234,3
1685544705,4
1685597429,4
1685683833,3
1685770233,3
1685856632,1
1685943031,2
1686029431,2
1686115831,2
1686202233,3
1686288634,2
1686375033,3
1686461431,3
1686547832,1
1686634231,3
1686720636,1
1686807032,3
1686893441,3
1686979840,3
1687066239,2
1687152641,3
1687239039,3
1687411840,2
1687498241,2
1687584640,2
1687671039,1
1687757437,2
1687843838,4
1687930240,2
1688016640,2
1688189452,1
1688275841,3
1688362240,1
1688535044,2
1688621445,3
1688707844,1
1688794245,2
1688880644,1
1688967042,1
1689053441,2
1689139840,1
1689226241,1
1689312653,2
1689399039,2
1689485439,2
1689571840,2
1689658239,2
1689744640,1
1689831044,1
1689917446,2
1690003846,2
1690090245,3
1690176650,2
1690263047,2
1690349447,1
1690435846,2
1690522245,1
1690608645,2
1690695045,1
1690781448,2
1690867847,1
1690954248,3
1691040648,3
1691127048,2
1691299847,4
1691472645,4
1691559043,2
1691645448,2
1691731846,2
1691818247,1
1691904646,2
1691991040,1
1692077440,2
1692163831,1
1692250233,3
1692336633,2
1692423035,1
1692509432,1
1692682233,2
1692768633,1
1692855035,2
1692941433,2
1693027839,1
1693114233,2
1693200633,1
1693373437,2
1693459835,4
1693546239,1
1693632645,2
1693719037,4
1693805431,2
1693891835,2
1693978232,1
1694064634,2
1694151031,1
1694237434,2
1694323834,1
1694410234,2
1694496634,1
1694583036,3
1694669436,2
1694842234,1
1694928634,1
1695015035,1
1695187834,1
1695274234,2
1695360634,1
1695447034,1
1695533434,1
1695706241,2
1695792643,1
1695879053,2
1695965441,1
1696051841,2
1696138241,1
1696224642,1
1696397445,4
1696483842,1
1696570241,4
1696656645,1
1696743043,3
1696829444,2
1697002242,2
1697088641,2
1697175042,1
1697261447,1
1697347842,2
1697434244,2
1697520642,1
1697607044,1
1697693444,1
1697779843,1
1697866244,2
1697952644,1
1698039045,2
1698125444,2
1698211845,3
1698298245,1
1698384642,2
1698474646,1
1698561046,1
1698647445,1
1698733843,1
1698820251,1
1698906644,1
1698993045,2
1699079441,2
1699165843,1
1699252253,1
1699338639,2
1699425038,1
1699511438,3
1699597838,2
1699684239,1
1699770639,1
1699857040,2
1699943446,2
1700029845,2
1700116239,2
1700202637,1
1700289040,3
1700375440,2
1700461838,1
1700548240,2
1700634640,1
1700721041,1
1700807441,1
1700893840,1
1700980240,3
