1663137169,162
1663166448,162
1663223564,83
1663252844,83
1663309969,205
1663339237,205
1663396358,219
1663425653,219
1663482759,104
1663512042,104
1663569159,106
1663598447,106
1663655565,106
1663684725,106
1663741840,233
1663771124,233
1663828239,109
1663857524,109
1663914640,321
1663943934,321
1664001039,163
1664030318,163
1664087438,103
1664116722,103
1664173842,101
1664203127,101
1664260251,130
1664289537,130
1664346641,363
1664375951,363
1664433041,68
1664462320,68
1664519554,370
1664548711,370
1664605833,340
1664635111,340
