1652682759,75
1652769160,125
1652855561,140
1652941964,132
1653028353,266
1653114753,206
1653201159,201
1653287558,128
1653373954,105
1653460234,176
1653546755,120
1653633154,414
1653719553,361
1653805957,224
1653892236,214
1653978755,63
