1649313029,5
1649399549,5
1649485949,1
1649572354,4
1649658750,7
1649745150,4
1649831565,4
1649917950,5
1650004228,5
1650090628,7
1650177150,2
1650263549,6
1650349831,6
1650436229,11
1650522756,8
1650609163,3
