1636895594,2
1636898490,2
1636900709,2
1637294806,2
1637467621,2
1637554087,4
1637589848,4
1637813369,2
1638158887,2
1638245235,2
1638331638,2
1639904549,2
1639907950,2
1639980923,10
1639983233,10
1639985995,10
1640577691,2
1640750484,2
1640836884,10
1640923223,2
1641009626,4
1641096084,2
1641268824,4
1641355224,2
1641441684,6
1641528084,2
1641700884,2
1642305627,2
1642319122,2
