1636895594,8
1636898490,9
1636900709,9
1637070326,7
1637070818,7
1637072812,17
1637122028,17
1637208446,13
1637294806,16
1637381227,17
1637467621,15
1637554087,11
1637589848,11
1637640464,23
1637726914,13
1637813369,17
1637899638,15
1637986004,21
1638072517,15
1638158887,11
1638245235,13
1638331638,5
1639904549,5
1639907950,5
1639980923,3
1639983233,3
1639985995,3
1640059226,3
1640080313,3
1640145685,2
1640232083,8
1640318424,7
1640404823,4
1640491284,1
1640577691,8
1640664024,3
1640750484,3
1640836884,3
1640923223,2
