1653114753,142
1653201159,146
1653287558,169
1653373954,127
1653460234,73
1653546755,196
1653633154,80
1653719553,315
1653805957,54
1653892236,198
1653978755,283
1654065033,46
1654151553,287
1654237831,324
1654324351,276
1654410631,14
