1690263240,17
1690349617,545
1690436012,24
1690522443,164
1690608808,56
1690695212,251
1690781617,884
1690868047,289
1690954421,604
1691040818,750
1691127250,264
1691213630,198
1691300015,184
1691386395,510
1691472821,10
