1636286412,48
1636286488,50
1636895594,434
1636898490,489
1636900709,537
1637070326,404
1637070818,417
1637072812,638
1637122028,768
1637208446,608
1637294806,597
1637381227,499
1637467621,580
1637554087,689
1637589848,689
1637726914,584
1637813369,680
1638072517,391
1638158887,733
1638245235,663
1638331638,827
1639904549,616
1639907950,616
1639980923,896
1639983233,896
1639985995,896
1640059226,811
1640080313,811
1640145685,674
1640232083,512
1640318424,550
1640404823,514
1640491284,575
1640577691,641
1640664024,639
1640750484,619
1640836884,594
1640923223,526
1641009626,574
1641096084,548
1641182484,732
1641268824,749
1641355224,652
1641441684,539
1641528084,721
1641700884,620
1641787224,800
1641873686,772
1642392088,383
1642408942,383
1642478484,437
1642564885,495
1642651226,628
1642676514,628
1642805851,609
1642824026,458
1642855125,458
1642910490,362
1642924655,362
1642934565,362
1642937864,362
1642996892,498
1643083292,467
1643169628,441
1643256090,448
1643342487,448
1643428827,411
1643515288,499
1643601634,518
1643622207,518
1643688028,469
1643708607,469
1643774489,459
1643860889,489
1643947288,524
1644033629,509
1644120088,476
1644206493,522
1644292831,558
1644321030,558
1644388289,542
1644407490,542
1644474692,563
1644493888,563
1644561030,509
1644647492,435
1644733834,489
1644770508,489
1644820292,557
1644906689,545
1644993090,507
1645079499,570
1645165829,575
1645252290,374
1645338629,413
1645425030,413
1645467113,413
1645470826,413
1645511492,491
1645597892,559
1645684232,526
1645770629,460
1645857150,377
1645943553,475
1646029893,479
1646116237,470
1646202760,547
1646289033,512
1646375551,550
1646461951,490
1646548229,441
1646634751,525
1646721161,520
1646807431,589
1646893952,513
1646980230,444
1647066751,343
1647153150,308
1647239550,482
1647325952,559
1647412352,508
1647498752,513
1647585151,436
1647757954,436
1647844355,428
1647930752,490
1648017150,582
1648103550,596
1648189831,485
1648276229,436
1648362752,424
1648449033,494
1648535442,512
1648621952,409
1648708231,482
1648794750,559
1648881149,613
1648967561,622
1649053832,542
1649140351,482
1649226751,535
1649313029,482
1649399549,590
1649485949,493
1649572354,460
1649658750,528
1649745150,652
1649831565,495
1649917950,577
1650004228,450
1650090628,441
1650177150,527
1650263549,477
1650349831,497
1650436229,458
1650522756,623
1650609163,615
1650695550,516
1650781953,496
1650868349,753
1650954630,645
1651041030,710
1651127552,544
1651213951,587
1651300352,528
1651386755,543
1651473034,874
1651559564,467
1651645850,514
1651732362,568
1651818753,655
1651905153,513
1651991564,610
1652077954,680
1652164360,652
1652250764,673
1652337032,535
1652423553,703
1652509832,501
1652596232,528
1652682759,731
1652769160,512
1652855561,575
1652941964,655
1653028353,684
1653114753,596
1653201159,609
1653287558,907
1653373954,665
1653460234,730
1653546755,576
1653633154,468
1653719553,499
1653805957,462
1653892236,654
1653978755,583
1654065033,606
1654151553,599
1654237831,639
1654324351,538
1654410631,537
1654497153,630
1654583555,689
1654669837,707
1654756356,732
1654842756,655
1654929156,568
1655015436,778
1655101838,789
1655188357,727
1655274636,652
1655361158,532
1655447555,543
1655533836,557
1655620256,437
1655706645,411
1655793158,443
1655879557,530
1655965955,427
1656052365,416
1656138754,367
1656225155,450
1656311556,602
1656397956,648
1656484356,520
1656570758,436
1656743558,406
1656829841,368
1656916357,415
1657002637,567
1657089163,940
1657175559,628
1657261838,343
1657348240,375
1657434758,555
1657521164,488
1657607566,458
1657693957,499
1657780357,633
1657803090,633
1657804447,633
1657809517,633
1657866760,664
1657896040,664
1657953158,438
1657982325,438
1658039438,467
1658068726,467
1658125843,412
1658155247,412
1658212362,392
1658241661,392
1658298758,610
1658328052,610
1658385041,406
1658414447,406
1658471560,465
1658500847,465
1658557962,431
1658587247,431
1658644360,363
1658673645,363
1658730762,494
1658760045,494
1658817160,480
1658846453,480
1658903439,408
1658932848,408
1658989840,463
1659019246,463
1659076365,599
1659105646,599
1659162770,454
1659192044,454
1659249159,570
1659278470,570
1659335565,462
1659364847,462
1659421963,497
1659451128,497
1659508368,488
1659537519,488
1659594767,431
1659624049,431
1659681160,471
1659710444,471
1659767561,350
1659796845,350
1659853840,496
1659883130,496
1659940369,420
1659969638,420
1660026647,448
1660056049,448
1660113163,511
1660142439,511
1660199441,400
1660228849,400
1660285970,470
1660315250,470
1660372250,456
1660401521,456
1660458761,588
1660488049,588
1660545162,568
1660574449,568
1660631564,583
1660660730,583
1660717841,458
1660747248,458
1660804362,452
1660833647,452
1660890760,405
1660920046,405
1660977162,386
1661006455,386
1661063442,459
1661092854,459
1661149842,462
1661179125,462
1661236366,431
1661265647,431
1661322641,481
1661352051,481
1661409162,568
1661438449,568
1661495561,571
1661524735,571
1661581964,499
1661611239,499
1661668363,484
1661697647,484
1661700049,484
1661754784,653
1661784048,653
1661870448,632
1661927560,492
1661956724,492
1662013964,496
1662043246,496
1662100359,450
1662129642,450
1662186760,427
1662216045,427
1662273039,547
1662302447,547
1662359559,538
1662388727,538
1662445958,504
1662475124,504
1662532358,549
1662561643,549
1662618758,474
1662647931,474
1662705164,554
1662734437,554
1662791558,488
1662820724,488
1662877847,638
1662907237,638
1662964357,465
1662993645,465
1663050638,531
1663080057,531
1663137169,525
1663166448,525
1663223564,462
1663252844,462
1663309969,496
1663339237,496
1663396358,452
1663425653,452
1663482759,652
1663512042,652
1663569159,534
1663598447,534
1663655565,535
1663684725,535
1663741840,661
1663771124,661
1663828239,634
1663857524,634
1663914640,542
1663943934,542
1664001039,499
1664030318,499
1664087438,541
1664116722,541
1664173842,617
1664203127,617
1664260251,572
1664289537,572
1664346641,528
1664375951,528
1664433041,562
1664462320,562
1664519554,513
1664548711,513
1664605833,544
1664635111,544
1668081545,208
1668350533,145
1668355972,145
1668356757,145
1668360810,145
1668474184,230
1668560577,217
1668646979,216
1671629111,196
1671630664,196
1671632450,196
1671634011,196
1673516775,259
1674367285,152
1674455475,223
1674541884,250
1674628285,244
1674714694,223
1674801082,194
1674887480,195
1674973872,191
1675060281,201
1675146682,205
1675233071,210
1675319481,201
1675405883,647
1675492281,135
1675578681,160
1675665075,223
1675751474,294
1675837863,119
1676356254,296
1676442661,211
1676529061,230
1676615450,225
1676701857,157
1676788249,181
1676874662,218
1676961061,231
1677047454,222
1677133857,206
1677220262,198
1677306660,148
1677393061,135
1677479458,229
1677565859,324
1677652257,343
1677738657,208
1677825057,188
1677911460,172
1677997847,156
1678084257,222
1678170666,215
1678257055,266
1678343445,224
1679569142,208
1679584407,208
1679589867,208
1679596494,208
1679602915,208
1679607956,208
1679639532,292
1679722309,177
1679808717,173
1679895117,153
1679981518,264
1680067912,194
1680154308,217
1680240714,244
1680327097,184
1680413504,195
1680499902,237
1680586299,212
1680672702,932
1680759104,206
1680845523,161
1680931899,188
1681018301,187
1681104713,167
1681191117,217
1681277516,289
1681363906,214
1681450306,212
1681536706,146
1681623105,192
1681709528,226
1681795909,255
1681882326,181
1681968706,161
1682055103,279
1682141505,177
1682227910,164
1682314324,214
1682400707,193
1682487105,200
1682573524,265
1682659898,254
1682746309,169
1682832700,237
1682919107,238
1683005499,265
1683091901,273
1683178309,276
1683264713,261
1683351101,162
1683437506,238
1683523904,242
1683610328,263
1683696716,230
1683783116,274
1683869508,239
1683955918,258
1684042308,274
1685544777,353
1685597496,334
1685683902,317
1685770303,262
1685856701,238
1685943100,359
1686029502,236
1686115904,311
1686202306,300
1686288711,249
1686375108,211
1686461512,295
1686547909,365
1686634309,389
1686720704,327
1686807105,402
1686893562,268
1686979954,315
1687066360,288
1687152774,325
1687239150,332
1687411953,286
1687498393,288
1687584774,265
1687671173,231
1687757568,331
1687843969,271
1687930377,245
1688016807,383
1688103218,286
1688189597,227
1688275996,266
1688362412,323
1688535215,246
1688621614,285
1688708029,276
1688794420,247
1688880821,240
1688967219,291
1689053626,267
1689140028,300
1689226424,303
1689312837,362
1689399195,279
1689485597,338
1689572000,341
1689658397,327
1689744807,309
1689831241,292
1689917640,249
1690004042,210
1690090404,280
1690176817,322
1690263240,223
1690349617,303
1690436012,367
1690522443,278
1690608808,297
1690695212,266
1690781617,259
1690868047,257
1690954421,297
1691040818,335
1691127250,263
1691213630,229
1691300015,253
1691386395,296
1691472821,356
1691559206,298
1691645653,446
1691732035,276
1691818443,246
1691904834,202
1691991184,257
1692077570,272
1692163972,268
1692250382,312
1692336773,219
1692423180,250
1692509573,242
1692595944,56
1692682368,305
1692768764,361
1692855167,326
1692941568,396
1693027980,319
1693114356,249
1693200777,313
1693287141,270
1693373568,332
1693459952,314
1693546364,294
1693632754,258
1693719144,279
1693805540,256
1693891949,290
1693978362,341
1694064749,294
1694151151,313
1694237547,214
1694323959,229
1694410362,233
1694496769,276
1694583178,288
1694669562,294
1694755972,279
1694842363,250
1694928766,243
1695015165,294
1695187975,272
1695274380,295
1695360784,282
1695447164,270
1695533586,199
1695619990,284
1695706406,345
1695792808,388
1695879218,342
1695965624,345
1696052011,226
1696138408,255
1696224807,314
1696311219,323
1696397621,333
1696484041,388
1696570435,279
1696656841,330
1696743237,381
1696829644,490
1696916048,378
1697002439,341
1697088838,333
1697175238,237
1697261644,233
1697348050,198
1697434425,324
1697520844,268
1697607247,190
1697693651,207
1697780021,214
1697866447,138
1697952848,108
1698039229,200
1698125641,217
1698212053,184
1698298423,212
1698384826,239
1698474862,159
1698561261,284
1698647660,452
1698734051,295
1698820440,271
1698906836,278
1698993260,244
1699079643,167
1699166057,182
1699252467,263
1699338847,302
1699425254,224
1699511642,292
1699598052,263
1699684453,170
1699770845,239
1699857241,250
1699943653,288
1700030030,279
1700116443,238
1700202865,242
1700289223,188
1700375637,201
1700462021,246
1700548451,276
1700634836,255
1700721246,231
1700807657,222
1700894058,162
1700980458,185
