1690263240,4
1690349617,4
1691040818,14
1691127250,18
1691213630,48
1691300015,36
1691386395,18
1691472821,10
1691559206,16
1691645653,8
1692163972,2
1692250382,22
1692509573,8
1693027980,22
1693114356,4
1693200777,4
1693287141,12
1693891949,14
1694669562,26
1695015165,8
1695274380,22
1695792808,4
1695879218,2
1696138408,10
1696570435,8
1696829644,6
1696916048,8
1697088838,14
1697175238,4
1697348050,9
1697520844,8
1698039229,2
1698298423,4
1698561261,2
1699511642,4
1699943653,20
1700634836,4
