1655793158,2
1655879557,7
1655965955,12
1656052365,10
1656138754,8
1656225155,13
1656311556,13
1656397956,7
1656484356,12
1656570758,13
1656743558,13
1656829841,10
1656916357,8
1657002637,11
1657089163,10
