1652596232,5
1652682759,8
1652769160,22
1652855561,27
1652941964,24
1653028353,24
1653114753,18
1653201159,20
1653287558,30
1653373954,25
1653460234,25
1653546755,26
1653633154,18
1653719553,24
1653805957,21
