1649313029,196
1649399549,277
1649485949,123
1649572354,149
1649658750,167
1649745150,353
1649831565,384
1649917950,143
1650004228,438
1650090628,443
1650177150,264
1650263549,169
1650349831,163
1650436229,165
1650522756,146
1650609163,26
