1640145685,1
1640232083,17
1640404823,4
1640750484,22
1640836884,10
1641182484,1
1641441684,10
1641528084,197
1641700884,1
1641873686,107
1642651226,17
1642676514,17
1642805851,3
1642824026,2
1642855125,2
1643256090,129
1643342487,1
1643515288,1
1643601634,7
1643622207,7
1643688028,6
1643708607,6
1643860889,25
1644388289,72
1644407490,72
1644474692,11
1644493888,11
1644647492,8
1644906689,104
1645079499,10
1645165829,1
1645425030,2
1645467113,2
1645470826,2
