1695533586,28
1695619990,349
1695706406,307
1695792808,826
1695879218,461
1695965624,261
1696052011,105
1696138408,290
1696224807,292
1696311219,992
1696397621,422
1696484041,777
1696570435,279
1696656841,271
1696743237,1264
1696829644,109
1696916048,467
1697002439,238
1697088838,321
1697175238,402
1697261644,180
1697348050,109
1697434425,302
1697520844,1196
1697607247,460
