1657866760,1
1657896040,1
1657953158,38
1657982325,38
1658039438,30
1658068726,30
1658125843,32
1658155247,32
1658212362,44
1658241661,44
1658298758,49
1658328052,49
1658385041,53
1658414447,53
1658471560,38
1658500847,38
1658557962,42
1658587247,42
1658644360,23
1658673645,23
1658730762,31
1658760045,31
1658817160,33
1658846453,33
1658903439,29
1658932848,29
1658989840,33
1659019246,33
1659076365,34
1659105646,34
1659162770,36
1659192044,36
