1691732035,5
1691818443,2
1691904834,15
1691991184,4
1692077570,2
1692163972,5
1692250382,5
1692336773,2
1692423180,7
1692509573,4
1692595944,1
1692682368,2
1692768764,3
1692855167,18
1692941568,4
1693027980,4
1693114356,1
