1659335565,8
1659364847,8
1659421963,23
1659451128,23
1659508368,21
1659537519,21
1659594767,15
1659624049,15
1659681160,15
1659710444,15
1659767561,7
1659796845,7
1659853840,5
1659883130,5
1659940369,19
1659969638,19
1660026647,17
1660056049,17
