1636286412,1
1636286488,1
1636895594,18
1636898490,18
1636900709,19
1637070326,20
1637070818,20
1637072812,25
1637122028,27
1637208446,36
1637294806,29
1637381227,33
1637467621,27
1637554087,27
1637589848,27
1637640464,28
1637726914,20
1637813369,26
1637899638,22
1637986004,33
1638072517,20
1638158887,13
1638245235,26
1638331638,22
1639904549,16
1639907950,16
1639980923,31
1639983233,31
1639985995,31
1640059226,10
1640080313,10
1640145685,22
1640232083,18
1640318424,18
1640404823,23
1640491284,22
1640577691,20
1640664024,17
1640750484,12
1640836884,14
1640923223,9
