1662013964,1
1662043246,1
1662100359,5
1662129642,5
1662186760,8
1662216045,8
1662273039,11
1662302447,11
1662359559,13
1662388727,13
1662445958,10
1662475124,10
1662532358,4
1662561643,4
1662618758,5
1662647931,5
1662705164,7
1662734437,7
1662791558,5
1662820724,5
1662877847,4
1662907237,4
1662964357,4
1662993645,4
1663050638,2
1663080057,2
1663137169,5
1663166448,5
1663223564,4
1663252844,4
1663309969,8
1663339237,8
