1639980923,1
1639983233,1
1639985995,1
1640059226,6
1640080313,6
1640145685,6
1640232083,2
1640318424,2
1640404823,2
1640491284,2
1640577691,2
1640664024,2
1640750484,2
1640836884,2
1640923223,2
1641009626,2
1641096084,2
1641182484,2
1641268824,2
1641355224,2
1641441684,2
1641528084,2
1641700884,2
1641787224,2
1641873686,2
1642392088,8
1642408942,8
1642478484,4
1642564885,2
1642651226,2
1642676514,2
1642805851,4
1642824026,6
1642855125,6
1642910490,8
1642924655,8
1642934565,8
1642937864,8
1642996892,16
1643083292,2
1643169628,2
1643256090,2
1643342487,2
1643428827,2
1643515288,2
1643601634,2
1643622207,2
1643688028,4
1643708607,4
1643774489,4
1643860889,4
1643947288,2
1644033629,2
1644120088,2
1644206493,2
1644292831,2
1644321030,2
1644388289,4
1644407490,4
1644474692,4
1644493888,4
1644561030,4
1644647492,2
1644733834,2
1644770508,2
1644820292,14
1644906689,2
1644993090,2
1645079499,2
1645165829,2
1645252290,2
1645338629,2
1645425030,2
1645467113,2
1645470826,2
1645511492,6
1645597892,2
1645684232,2
1645770629,2
1645857150,2
1645943553,2
1646029893,2
1646116237,2
1646202760,2
1646289033,2
1646375551,2
1646461951,2
1646548229,2
1646634751,2
1646721161,2
1646807431,2
1646893952,2
1646980230,2
1647066751,2
1647153150,2
1647239550,2
1647325952,2
1647412352,2
1647498752,2
1647585151,2
1647757954,2
1647844355,2
1647930752,2
1648017150,2
1648103550,2
1648189831,2
1648276229,2
1648362752,2
1648449033,2
1648535442,2
1648621952,2
1648708231,2
1648794750,2
1648881149,2
1648967561,2
1649053832,2
1649140351,2
1649226751,2
1649313029,2
1649399549,2
1649485949,2
1649572354,2
1649658750,2
1649745150,2
1649831565,2
1649917950,2
1650004228,2
1650090628,2
1650177150,2
1650263549,2
1650349831,2
1650436229,2
1650522756,2
1650609163,2
1650695550,2
1650781953,2
1650868349,2
1650954630,2
1651041030,2
1651127552,2
1651213951,2
1651300352,2
1651386755,2
1651473034,2
1651559564,2
1651645850,2
1651732362,2
1651818753,2
1651905153,2
1651991564,2
1652077954,2
1652164360,2
1652250764,2
1652337032,2
1652423553,2
1652509832,2
1652596232,2
1652682759,2
1652769160,2
1652855561,2
1652941964,2
1653028353,2
1653114753,2
1653201159,2
1653287558,2
1653373954,2
1653460234,2
1653546755,2
1653633154,2
1653719553,2
1653805957,2
1653892236,2
1653978755,2
1654065033,2
1654151553,2
1654237831,2
1654324351,2
1654410631,3
1654497153,2
1654583555,2
1654669837,2
1654756356,2
1654842756,3
1654929156,2
1655015436,2
1655101838,2
1655188357,2
1655274636,2
1655361158,2
1655447555,2
1655533836,2
1655620256,2
1655706645,2
1655793158,2
1655879557,2
1655965955,2
1656052365,2
1656138754,2
1656225155,2
1656311556,2
1656397956,2
1656484356,2
1656570758,2
1656829841,2
1656916357,2
1657002637,2
1657089163,2
1657175559,2
1657261838,2
1657348240,2
1657434758,2
1657521164,2
1657607566,2
1657693957,2
1657780357,2
1657803090,2
1657804447,2
1657809517,2
1657866760,10
1657896040,10
1657953158,4
1657982325,4
1658039438,4
1658068726,4
1658125843,4
1658155247,4
1658212362,4
1658241661,4
1658298758,4
1658328052,4
1658385041,4
1658414447,4
1658471560,4
1658500847,4
1658557962,4
1658587247,4
1658644360,4
1658673645,4
1658730762,4
1658760045,4
1658817160,4
1658846453,4
1658903439,4
1658932848,4
1658989840,4
1659019246,4
1659076365,4
1659105646,4
1659162770,4
1659192044,4
1659249159,4
1659278470,4
1659335565,4
1659364847,4
1659421963,4
1659451128,4
1659508368,4
1659537519,4
1659594767,4
1659624049,4
1659681160,4
1659710444,4
1659767561,4
1659796845,4
1659853840,4
1659883130,4
1659940369,4
1659969638,4
1660026647,4
1660056049,4
1660113163,4
1660142439,4
1660199441,4
1660228849,4
1660285970,4
1660315250,4
1660372250,4
1660401521,4
1660458761,4
1660488049,4
1660545162,4
1660574449,4
1660631564,4
1660660730,4
1660717841,4
1660747248,4
1660804362,4
1660833647,4
1660890760,4
1660920046,4
1660977162,4
1661006455,4
1661063442,4
1661092854,4
1661149842,4
1661179125,4
1661236366,4
1661265647,4
1661322641,4
1661352051,4
1661409162,4
1661438449,4
1661495561,4
1661524735,4
1661581964,4
1661611239,4
1661668363,4
1661697647,4
1661700049,4
1661754784,6
1661784048,6
1661870448,4
1661927560,4
1661956724,4
1662013964,4
1662043246,4
1662100359,4
1662129642,4
1662186760,4
1662216045,4
1662273039,4
1662302447,4
1662359559,4
1662388727,4
1662445958,4
1662475124,4
1662532358,4
1662561643,4
1662618758,4
1662647931,4
1662705164,4
1662734437,4
1662791558,4
1662820724,4
1662877847,4
1662907237,4
1662964357,4
1662993645,4
1663050638,4
1663080057,4
1663137169,4
1663166448,4
1663223564,4
1663252844,4
1663309969,4
1663339237,4
1663396358,4
1663425653,4
1663482759,4
1663512042,4
1663569159,4
1663598447,4
1663655565,4
1663684725,4
1663741840,4
1663771124,4
1663828239,4
1663857524,4
1663914640,4
1663943934,4
1664001039,4
1664030318,4
1664087438,4
1664116722,4
1664173842,4
1664203127,4
1664260251,4
1664289537,4
1664346641,4
1664375951,4
1664433041,4
1664462320,4
1664519554,4
1664548711,4
1664605833,4
1664635111,4
1668560577,2
1668646979,2
1676529061,3
