1681795909,6
1681882326,2
1681968706,5
1682141505,4
1682314324,7
1682400707,9
1682487105,18
1682573524,3
1682659898,4
1682746309,2
1682832700,9
1682919107,14
1683091901,7
1683178309,3
1683264713,3
1683351101,3
