1658039438,2
1658068726,2
1658125843,11
1658155247,11
1658212362,10
1658241661,10
1658298758,12
1658328052,12
1658385041,5
1658414447,5
1658471560,12
1658500847,12
1658557962,7
1658587247,7
1658644360,10
1658673645,10
1658730762,15
1658760045,15
1658817160,11
1658846453,11
1658903439,5
1658932848,5
1658989840,13
1659019246,13
1659076365,8
1659105646,8
1659162770,6
1659192044,6
1659249159,13
1659278470,13
1659335565,14
1659364847,14
1659421963,7
1659451128,7
1659508368,7
1659537519,7
1659594767,17
1659624049,17
1659681160,5
1659710444,5
1659767561,12
1659796845,12
1659853840,6
1659883130,6
1659940369,12
1659969638,12
1660026647,7
1660056049,7
1660113163,12
1660142439,12
1660199441,12
1660228849,12
1660285970,6
1660315250,6
1660372250,11
1660401521,11
1660458761,11
1660488049,11
1660545162,9
1660574449,9
1660631564,5
1660660730,5
1660717841,5
1660747248,5
1660804362,4
1660833647,4
1660890760,2
1660920046,2
1660977162,4
1661006455,4
1661063442,5
1661092854,5
1661149842,7
1661179125,7
1661236366,9
1661265647,9
1661322641,8
1661352051,8
1661409162,16
1661438449,16
1661495561,10
1661524735,10
1661581964,1
1661611239,1
