1644561017,6
1644733822,1
1644770413,1
1644993017,1
1645252217,1
1645338616,1
1645467072,1
1645470791,1
1645511417,1
1645597817,2
1645857016,1
1646029817,1
1646461818,1
1647844218,4
1648189818,6
1648362619,1
1648794617,1
1649313017,1
1649917817,1
1650349817,1
1650436217,1
1650522617,1
1650609029,1
1650695416,9
1650781820,1
1650868217,1
1650954617,2
1651041017,1
1651127418,2
1651213817,7
1651300219,1
1651386622,1
1651473017,1
1651559421,2
1651645827,1
1651818617,2
1651905018,1
1652077818,1
1652164218,1
1652250621,1
1652423417,1
1652509817,1
1652596217,1
1652769018,1
1652855418,1
1652941818,2
1653028217,1
1653201018,2
1653546617,2
1653633018,2
1653719418,2
1653805821,1
1653892219,1
1653978618,1
1654065018,1
1654151419,2
1654237818,1
1654324218,2
1654410618,1
1654497019,1
1654669819,1
1654756220,1
1654842619,1
1654929020,1
1655015420,1
1655101820,2
1655188220,1
1655361020,1
1655533820,1
1655620219,2
1655706620,1
1655879419,1
1656829825,1
1657089026,2
1658385022,1
1658414301,1
1661236224,1
1661265501,1
1661870301,1
1662273020,1
1662302302,1
1662359420,1
1662388701,1
1663166301,1
1663914621,1
1663943902,1
1664605817,1
1664635096,1
1680154230,1
1680759032,1
1680931831,1
1681018231,1
1681450235,1
1682400635,1
1686202233,2
1686720636,1
1688707844,1
1689831044,1
1692250233,1
1699425038,1
