1640923223,3
1641009626,24
1641096084,16
1641182484,29
1641268824,34
1641355224,36
1641441684,37
1641528084,24
1641700884,31
1641787224,31
1641873686,20
1642305627,44
1642319122,44
1642392088,31
1642408942,31
1642478484,29
