1693978362,7
1694064749,18
1694151151,5
1694237547,19
1694323959,7
1694410362,4
1694496769,3
1694583178,2
1694669562,10
1694755972,8
1694842363,3
1694928766,9
1695015165,2
1695187975,4
1695274380,3
1695360784,19
1695447164,10
1695533586,1
1695619990,3
1695706406,3
1695792808,21
1695879218,5
1695965624,6
1696052011,2
1696138408,3
1696224807,16
1696311219,10
1696397621,5
1696484041,16
1696570435,23
1696656841,48
1696743237,32
1696829644,23
1696916048,2
1697002439,8
1697088838,6
1697175238,3
1697261644,3
1697348050,3
1697434425,10
1697520844,18
1697607247,4
1697693651,5
1697780021,1
1697866447,7
1697952848,5
1698039229,10
1698125641,5
1698212053,4
1698298423,6
