1652769160,1
1652855561,18
1652941964,19
1653028353,21
1653114753,18
1653201159,11
1653287558,19
1653373954,19
1653460234,18
1653546755,20
1653633154,18
1653719553,16
1653805957,17
1653892236,20
1653978755,20
1654065033,16
