1663914640,6
1663943934,6
1664001039,14
1664030318,14
1664087438,14
1664116722,14
1664173842,8
1664203127,8
1664260251,6
1664289537,6
1664346641,5
1664375951,5
1664433041,9
1664462320,9
1664519554,14
1664548711,14
1664605833,2
1664635111,2
