1692855035,1
1692941433,2
1693027839,2
1693200633,2
1693978232,1
1694151031,2
1694323834,2
1694583036,1
1694669436,1
1694755834,1
1694842234,1
1694928634,1
1695879053,1
1697866244,1
1697952644,1
1698211845,2
1698474646,1
1698561046,1
1698647445,1
1698733843,1
1698993045,3
1699079441,1
1699165843,1
1699252253,6
