1656829841,1
1656916357,16
1657002637,11
1657089163,16
1657175559,12
1657261838,13
1657348240,9
1657434758,13
1657521164,17
1657607566,8
1657693957,11
1657780357,18
1657803090,18
1657804447,18
1657809517,18
1657866760,10
1657896040,10
1657953158,11
1657982325,11
1658039438,9
1658068726,9
1658125843,6
1658155247,6
