1691127048,1
1691645448,1
1691818247,1
1691904646,1
1692077440,1
1692163831,1
1692250233,1
1692336633,1
1692423035,1
1692509432,1
1692682233,1
1692768633,1
1692855035,1
1692941433,1
1693027839,2
1693200633,2
1693978232,2
1694151031,1
1694669436,1
1695187834,1
1695274234,1
1695360634,2
1695533434,2
1695619839,2
1695965441,2
1696483842,2
1696570241,2
1696656645,1
1696743043,2
1696829444,2
1696915841,1
1697002242,1
1697088641,1
1697175042,1
1697261447,1
1697347842,1
1697520642,1
1697607044,1
1697693444,1
1697866244,1
1697952644,1
1698211845,1
1698474646,1
1698561046,1
1698647445,1
1698733843,1
1698993045,3
1699079441,1
1699165843,1
1699252253,6
1699425038,1
1699597838,2
1699684239,1
1699770639,1
1699857040,1
