1641268824,1
1641355224,2
1641441684,5
1641528084,6
1641700884,4
1641787224,2
1641873686,4
1642392088,9
1642408942,9
1642478484,5
1642564885,3
1642651226,5
1642676514,5
1642805851,8
1642824026,6
1642855125,6
1642910490,9
1642924655,9
1642934565,9
1642937864,9
1642996892,18
1643083292,5
1643169628,3
1643256090,2
1643342487,2
1643428827,3
1643515288,5
1643601634,3
1643622207,3
1643688028,9
1643708607,9
1643774489,4
1643860889,4
1643947288,6
1644033629,3
1644120088,3
1644206493,4
1644292831,4
1644321030,4
1644388289,6
1644407490,6
1644474692,4
1644493888,4
1644561030,4
1644647492,2
1644733834,2
1644770508,2
1644820292,2
1645770629,1
1645857150,1
1646029893,1
1646116237,2
1646375551,2
1646461951,1
