1679584314,2
1679589759,2
1679596397,2
1679602819,2
1679607852,2
1679639432,3
1679981431,3
1680240629,3
1680845434,3
1683437432,3
1683610233,3
1688016640,2
1688103041,2
1688362240,2
1688535044,2
1688621445,2
1688707844,2
1688794245,2
1688880644,2
1688967042,2
1689053441,3
1689139840,2
1689226241,2
1689312653,2
1689744640,1
1689831044,2
1689917446,2
1690003846,2
1690263047,1
1690522245,1
1690867847,2
1691127048,2
1691645448,2
1691731846,2
1691818247,1
1691991040,2
1692077440,2
1692163831,2
1692250233,2
1692336633,2
1692423035,2
1692509432,2
1692682233,2
1692768633,2
1692855035,2
1692941433,2
1693027839,2
1693200633,2
1693978232,2
1694151031,2
1694496634,2
1694583036,2
1694669436,2
1694755834,2
1694842234,2
1694928634,2
1695187834,1
1695274234,1
1695360634,1
1695533434,1
1695619839,1
1695965441,1
1696138241,1
1696483842,1
1696570241,1
1696656645,1
1696743043,1
1696829444,1
1696915841,1
1697002242,1
1697088641,1
1697175042,1
1697261447,2
1697347842,1
1697520642,1
1697607044,1
1697693444,1
1697866244,1
1697952644,1
1698211845,1
1698474646,1
1698561046,1
1698647445,1
1698733843,1
1698993045,2
1699079441,1
1699165843,1
1699252253,5
