1641700884,14
1641787224,64
1641873686,160
1642305627,146
1642319122,146
1642392088,85
1642408942,85
1642478484,285
1642564885,46
1642651226,120
1642676514,120
1642769502,100
1642771604,100
1642805136,100
1642805851,100
1642824026,116
1642855125,116
1642910490,113
1642924655,113
1642934565,113
1642937864,113
1642996892,278
1643083292,249
1643169628,90
