1688016640,1
1688103041,1
1688362240,1
1688535044,1
1688621445,1
1688707844,1
1688794245,1
1688880644,1
1688967042,1
1689053441,1
1689139840,1
1689226241,1
1689312653,1
1689831044,1
1689917446,1
1690003846,1
1690263047,1
1690522245,1
1690867847,1
1691127048,1
1691645448,1
1691818247,1
1691991040,1
1692077440,1
1692163831,1
1692250233,1
1692336633,1
1692423035,1
1692509432,1
1692682233,1
1692768633,1
1692855035,1
1692941433,1
1693027839,1
1693200633,1
1693978232,1
1694323834,1
1694583036,1
1694669436,1
1694755834,1
1694842234,1
1694928634,1
1695274234,2
1695360634,2
1695533434,2
1695619839,4
1695879053,1
1695965441,2
1696483842,2
1696570241,1
1696656645,2
1696743043,2
1696829444,2
1696915841,2
1697002242,2
1697088641,2
1697175042,2
1697261447,2
1697347842,2
1697520642,2
1697607044,2
1697693444,2
1697866244,2
1697952644,2
1698211845,2
1698474646,2
1698561046,2
1698647445,2
1698733843,1
1698993045,2
1699079441,1
1699165843,1
1699252253,6
1699338639,1
1699425038,2
1699597838,4
1699684239,2
1699770639,2
1699943446,1
1700116239,1
1700202637,2
