1657780357,1
1657803090,1
1657804447,1
1657809517,1
1657866760,119
1657896040,119
1657953158,24
1657982325,24
1658039438,24
1658068726,24
1658125843,70
1658155247,70
1658212362,24
1658241661,24
1658298758,58
1658328052,58
1658385041,89
1658414447,89
1658471560,86
1658500847,86
1658557962,295
1658587247,295
1658730762,5
1658760045,5
1658817160,1
1658846453,1
1658903439,1
1658932848,1
1658989840,31
1659019246,31
1659076365,5
1659105646,5
1659162770,3
1659192044,3
1659249159,1
1659278470,1
1659421963,6
1659451128,6
1659508368,3
1659537519,3
1659594767,2
1659624049,2
1659681160,2
1659710444,2
1659853840,21
1659883130,21
1659940369,7
1659969638,7
1660026647,1
1660056049,1
1660113163,4
1660142439,4
1660199441,35
1660228849,35
1660285970,8
1660315250,8
1660372250,8
1660401521,8
1660458761,119
1660488049,119
