1679584314,1
1679589759,1
1679596397,1
1679602819,1
1679607852,1
1679639432,1
1679981431,1
1680240629,1
1680845434,1
1683437432,1
1683610233,1
1686288634,1
1687498241,1
1688016640,1
1688103041,1
1688362240,1
1688535044,1
1688621445,1
1688707844,1
1688794245,1
1688880644,1
1688967042,1
1689226241,1
1689312653,2
1689744640,1
1689831044,1
1689917446,1
1690003846,1
1690867847,1
1691127048,1
1691645448,1
1691818247,1
1691904646,1
1691991040,1
1692077440,1
1692163831,2
1692250233,2
1692336633,2
1692423035,2
1692509432,2
1692682233,2
1692768633,2
1692855035,2
1692941433,2
1693027839,2
1693200633,2
1693978232,2
1694151031,1
1694323834,1
1694496634,1
1694583036,2
1694669436,3
1694755834,2
1694842234,2
1694928634,2
1695187834,2
1695274234,2
1695360634,2
1695533434,2
1695619839,2
1695965441,2
1696483842,2
1696570241,2
1696656645,3
1696743043,2
1696829444,3
1696915841,3
1697002242,3
1697088641,3
1697175042,3
1697261447,3
1697347842,3
1697520642,3
1697607044,3
1697693444,3
1697866244,3
1697952644,3
1698211845,3
1698474646,4
1698561046,3
1698647445,3
1698733843,3
1698993045,6
1699079441,3
1699165843,3
1699252253,18
1699338639,2
1699425038,3
1699597838,6
1699684239,3
1699770639,3
1699857040,3
1699943446,1
1700116239,1
1700202637,2
1700548240,1
1700721041,1
1700807441,2
1700893840,1
1700980240,1
