1679584314,1
1679589759,1
1679596397,1
1679602819,1
1679607852,1
1679639432,1
1679981431,1
1680845434,1
1682573432,1
1687498241,1
1688016640,1
1692250233,1
1692336633,1
1692423035,1
1692509432,1
1692682233,1
1692768633,1
1692855035,1
1692941433,1
1693027839,1
1693114233,1
1693200633,1
1693978232,1
1694151031,1
1694323834,1
1694496634,1
1694583036,2
1694755834,1
1694842234,1
1694928634,1
1695187834,1
1695274234,1
1695360634,2
1695533434,1
1695619839,1
1695965441,1
1696483842,1
1696570241,1
1696743043,1
1696829444,1
1697520642,1
1697607044,1
1697693444,1
1697866244,1
1697952644,1
1698211845,1
1698474646,1
1698561046,1
1698647445,1
1698733843,1
1698993045,1
1699079441,1
1699165843,1
1699252253,6
1699338639,1
1699425038,1
1699597838,1
1699684239,1
1699770639,1
1699943446,1
1700116239,1
1700202637,2
1700548240,1
1700807441,2
1700893840,1
1700980240,1
