1648708231,6
1648794750,11
1648881149,7
1648967561,7
1649053832,6
1649140351,8
1649226751,5
1649313029,15
1649399549,6
1649485949,9
1649572354,14
1649658750,6
1649745150,9
1649831565,4
1649917950,10
1650004228,5
1650090628,11
1650177150,9
1650263549,9
1650349831,6
1650436229,6
1650522756,7
1650609163,6
1650695550,5
1650781953,17
1650868349,14
1650954630,14
1651041030,23
1651127552,20
1651213951,18
1651300352,27
1651386755,7
