1668474184,7
1668560577,1
1668646979,1
1674628285,9
1674714694,9
1675751474,8
1680672702,4
1680759104,6
1682573524,1
1682659898,1
1682746309,1
1682832700,1
1682919107,1
1683351101,1
1683437506,1
1683783116,1
1683869508,1
1683955918,1
1684042308,1
1685597496,1
1685683902,1
1685770303,1
1685856701,1
1685943100,1
1686288711,1
1686375108,1
1686807105,1
1687239150,1
1687411953,1
1687498393,1
1687584774,1
1687671173,1
1687757568,1
1687843969,1
1687930377,1
1688621614,1
1688708029,1
1688880821,1
1688967219,1
1689053626,1
1689312837,1
1689399195,1
1689485597,1
1689572000,1
1690004042,1
1690090404,1
1690176817,1
1690695212,1
1690954421,1
1691300015,1
1691732035,1
1691904834,1
1692077570,1
1692163972,1
1692250382,1
1692423180,1
1692509573,1
1692595944,1
1692682368,1
1692855167,1
1693027980,1
1693114356,1
1694842363,1
1694928766,1
1695187975,1
1695447164,1
1695792808,1
1695879218,1
1695965624,1
1696138408,1
1696224807,1
1696311219,1
1696656841,1
1696743237,1
1699079643,1
1699598052,2
1699684453,1
1699770845,1
1700116443,1
1700202865,1
1700289223,1
1700375637,1
1700548451,1
1700807657,1
1700894058,1
1700980458,1
