1651473034,2
1651559564,9
1651645850,20
1651732362,23
1651818753,13
1651905153,13
1651991564,7
1652077954,6
1652164360,11
1652250764,4
1652337032,7
1652423553,6
1652509832,13
1652596232,5
1652682759,14
1652769160,15
1685683902,1
