1651024800,3110
1651111200,3220
1651197600,3261
1651284000,3261
1651370400,3390
1651456800,3148
1651543200,2883
1651629600,2905
1651716000,2949
1651802400,2975
1651888800,3000
1651975200,3131
1652061600,3114
1652148000,2942
1652234400,2942
1652320800,3053
1652407200,3121
1652493600,3235
1652580000,3318
1652666400,3302
1652752800,3118
1652839200,3160
1652839200,3160
1652925600,3207
1653012000,3260
1653184800,2999
1653271200,2986
1653357600,3053
1653444000,3234
1653444000,3234
1653444000,3234
1653703200,3000
1653789600,2912
1653876000,2894
1653962400,2804
1654048800,3104
1654135200,2623
1654221600,2670
1654308000,2702
1654394400,2668
1654480800,2648
1654567200,2839
1654653600,2519
1654740000,2622
1654826400,2997
1654912800,2764
1654999200,2724
1655085600,2705
1655172000,2672
1655258400,2709
1655344800,2741
1655431200,2740
1655517600,2826
1655604000,2675
1655690400,2659
1655863200,2614
1655949600,2678
1656036000,2709
1656122400,3038
1656208800,2859
1656295200,2843
1656381600,2566
1656468000,2620
1656554400,2691
1656640800,2731
1656813600,2705
1656900000,2677
1656986400,2585
1657072800,2582
1657159200,2717
1657245600,2782
1657332000,2861
1657418400,2832
1657504800,2823
1657591200,2851
1657677600,2861
1657764000,2896
1657850400,2927
1657850400,2927
1657850400,2927
1657936800,3018
1657936800,3018
1658023200,2967
1658023200,2967
1658109600,2955
1658109600,2955
1658196000,3007
1658196000,3007
1658282400,3009
1658282400,3009
1658368800,2999
1658368800,2999
1658455200,2992
1658455200,2992
1658541600,3012
1658541600,3012
1658628000,2971
1658628000,2971
1658714400,2958
1658714400,2958
1658800800,3013
1658800800,3013
1658887200,3029
1658887200,3029
1658973600,3058
1658973600,3058
1659060000,3053
1659060000,3053
1659146400,3040
1659146400,3040
1659232800,2984
1659232800,2984
1659319200,2949
1659319200,2949
1659405600,2780
1659405600,2780
1659492000,2799
1659492000,2799
1659578400,2822
1659578400,2822
1659664800,2819
1659664800,2819
1659751200,2824
1659751200,2824
1659837600,2802
1659837600,2802
1659924000,2786
1659924000,2786
1660010400,2738
1660010400,2738
1660096800,2735
1660096800,2735
1660183200,2770
1660183200,2770
1660269600,2792
1660269600,2792
1660356000,2806
1660356000,2806
1660442400,2741
1660442400,2741
1660528800,2733
1660528800,2733
1660615200,2604
1660615200,2604
1660701600,2543
1660701600,2543
1660788000,2667
1660788000,2667
1660874400,2641
1660874400,2641
1660960800,2729
1660960800,2729
1661047200,2673
1661047200,2673
1661133600,2632
1661133600,2632
1661220000,2468
1661220000,2468
1661306400,2502
1661306400,2502
1661392800,2560
1661392800,2560
1661479200,2670
1661479200,2670
1661565600,2732
1661565600,2732
1661652000,2681
1661652000,2681
1661738400,2669
1661738400,2669
1661738400,2669
1661824800,2627
1661824800,2627
1661911200,2631
1661997600,2688
1661997600,2688
1662084000,2405
1662084000,2405
1662170400,2432
1662170400,2432
1662256800,2352
1662256800,2352
1662343200,2340
1662343200,2340
1662429600,2386
1662429600,2386
1662516000,2386
1662516000,2386
1662602400,2511
1662602400,2511
1662688800,2661
1662688800,2661
1662775200,2756
1662775200,2756
1662861600,2726
1662861600,2726
1662948000,2707
1662948000,2707
1663034400,2642
1663034400,2642
1663120800,2642
1663120800,2642
1663207200,2714
1663207200,2714
1663293600,2765
1663293600,2765
1663380000,2742
1663380000,2742
1663466400,2685
1663466400,2685
1663552800,2666
1663552800,2666
1663639200,2638
1663639200,2638
1663725600,2615
1663725600,2615
1663812000,2663
1663812000,2663
1663898400,2667
1663898400,2667
1663984800,2669
1663984800,2669
1664071200,2623
1664071200,2623
1664157600,2621
1664157600,2621
1664244000,2575
1664244000,2575
1664330400,2605
1664330400,2605
1664416800,2545
1664416800,2545
1664503200,2570
1664503200,2570
1664503200,2570
1664503200,2570
1664503200,2570
1664503200,2570
1668391200,2938
1668391200,2938
1668391200,2938
1668391200,2938
1668477600,2897
1668564000,2869
1668650400,2948
1671588000,3715
1671588000,3715
1671588000,3715
1671588000,3715
1671588000,3715
1671588000,3715
1671588000,3715
1671588000,3715
1671674400,3879
1671674400,3879
1671674400,3879
1671674400,3879
1671674400,3879
1671674400,3879
1673575200,4160
1674439200,3204
1674525600,2746
1674612000,2420
1674698400,2666
1674784800,2652
1674871200,2724
1674957600,2695
1675044000,2680
1675130400,2803
1675216800,2827
1675303200,2911
1675389600,2932
1675476000,3002
1675562400,2960
1675648800,2947
1675735200,0
1675821600,2912
1675908000,2904
1675994400,3081
1676080800,3117
1676167200,3136
1676253600,3124
1676340000,3093
1676426400,3113
1676512800,3088
1676599200,3108
1676685600,3196
1676772000,3255
1676858400,3245
1676944800,3078
1677031200,3025
1677117600,3064
1677204000,3002
1677204000,3002
1677376800,3043
1677463200,3022
1677549600,2753
1677636000,2767
1677722400,2744
1677808800,2885
1677895200,2732
1677981600,2671
1678068000,2657
1678154400,2848
1678240800,2587
1678327200,2748
1678413600,2745
1678413600,2745
1678500000,2764
1678586400,2735
1678672800,2705
1678759200,2746
1678759200,2746
1678759200,2746
1678845600,2720
1678932000,2681
1678932000,2681
1679018400,2907
1679104800,3099
1679277600,3045
1679364000,2928
1679450400,2908
1679536800,2915
1679536800,2915
1679623200,2975
1679623200,2975
1679623200,2975
1679623200,2975
1679623200,2975
1679623200,2975
1679623200,2975
1679623200,2975
1679623200,2975
1679709600,2903
1679796000,2896
1679882400,2879
1679968800,2761
1680055200,2764
1680141600,2793
1680228000,2774
1680314400,2798
1680400800,2726
1680487200,2703
1680573600,2882
1680660000,2839
1680746400,2784
1680832800,3021
1680919200,2983
1681005600,2884
1681092000,2773
1681178400,2702
1681264800,2516
1681351200,2480
1681437600,2937
1681524000,3154
1681610400,3166
1681696800,3138
1681783200,3012
1681869600,3007
1681956000,3070
1682042400,3125
1682128800,3184
1682215200,3184
1682301600,3184
1682388000,2841
1682474400,3056
1682560800,3189
1682647200,3268
1682733600,3228
1682820000,3325
1682906400,3313
1682992800,3156
1683079200,3113
1683165600,2998
1683252000,2990
1683338400,3067
1683424800,3073
1683511200,3060
1683597600,2996
1683684000,3103
1683770400,3194
1683856800,3356
1683943200,3483
1684029600,3428
1684116000,3417
1685584800,3023
1685671200,2984
1685757600,2843
1685844000,2853
1685930400,2832
1686016800,2738
1686103200,2738
1686189600,2677
1686276000,2753
1686362400,2845
1686448800,2845
1686535200,2988
1686621600,2684
1686708000,2687
1686708000,2687
1686880800,2418
1686967200,2464
1687053600,2472
1687140000,2463
1687226400,2568
1687312800,2300
1687485600,2389
1687572000,2622
1687658400,2553
1687744800,2525
1687831200,2205
1687917600,2204
1688004000,2195
1688090400,2220
1688176800,2311
1688263200,2300
1688349600,2231
1688436000,2180
1688608800,2398
1688695200,2365
1688781600,2365
1688868000,2768
1688954400,2737
1689040800,2797
1689127200,2882
1689213600,3018
1689300000,3041
1689386400,2933
1689472800,2903
1689559200,2883
1689645600,2975
1689732000,2742
1689818400,2742
1689904800,2726
1689991200,2850
1690077600,2796
1690164000,2779
1690250400,2792
1690336800,2831
1690423200,2806
1690509600,2871
1690596000,2868
1690682400,2864
1690768800,2859
1690855200,2717
1690941600,2475
1691028000,2481
1691114400,2887
1691200800,3108
1691287200,3071
1691373600,3069
1691460000,3086
1691546400,2904
1691632800,2999
1691719200,3041
1691805600,3073
1691892000,3062
1691978400,3052
1692064800,2548
1692151200,2611
1692237600,2543
1692324000,2529
1692410400,2570
1692496800,2561
1692583200,2550
1692669600,2340
1692756000,2320
1692842400,2642
1692928800,2718
1693015200,2718
1693101600,2430
1693188000,2413
1693274400,2424
1693360800,2381
1693447200,2363
1693533600,2350
1693620000,2603
1693706400,2615
1693792800,2609
1693879200,2613
1693965600,2608
1694052000,2649
1694138400,2561
1694224800,2533
1694311200,2575
1694397600,2561
1694484000,2506
1694570400,2430
1694656800,2455
1694743200,2475
1694829600,2492
1694916000,2462
1695002400,2456
1695088800,2334
1695261600,2378
1695348000,2391
1695434400,2428
1695520800,2441
1695607200,2439
1695693600,2378
1695780000,2398
1695866400,2438
1695952800,2457
1696039200,2450
1696125600,2493
1696212000,2421
1696298400,2311
1696384800,2278
1696471200,2278
1696557600,2363
1696644000,2384
1696730400,2396
1696816800,2388
1696903200,2335
1696989600,2302
1697076000,2296
1697162400,2311
1697248800,2350
1697335200,2353
1697421600,2344
1697508000,2255
1697594400,2267
1697680800,2304
1697767200,2359
1697853600,2378
1697940000,2380
1698026400,2374
1698026400,2374
1698199200,2228
1698285600,2226
1698372000,2221
1698458400,2263
1698544800,2289
1698631200,2269
1698717600,2254
1698804000,2283
1698890400,1999
1698976800,1946
1699063200,1963
1699149600,1939
1699236000,1901
1699322400,1901
1699408800,1756
1699495200,2840
1699581600,2969
1699668000,2946
1699754400,2995
1699840800,2989
1699927200,2702
1700013600,2665
1700100000,2727
1700186400,10
1700272800,307
1700359200,419
1700445600,419
1700532000,508
1700618400,649
1700704800,821
1700791200,909
1700877600,1197
1700964000,1285
1701050400,1285
