1654324351,5
1654410631,20
1654497153,14
1654583555,22
1654669837,16
1654756356,3
1654842756,13
1654929156,11
1655015436,2
1655101838,18
1655188357,9
1655274636,7
1655361158,24
1655447555,6
1655533836,4
1655620256,11
