1695187834,1
1695274234,1
1695360634,1
1695533434,1
1695619839,1
1698906644,1
1698993045,5
1699079441,3
1699165843,3
1699252253,15
1699338639,3
1699425038,3
1699597838,5
1699684239,3
1699770639,3
1699943446,3
1700116239,3
1700202637,6
1700548240,4
1700721041,4
1700807441,8
1700893840,4
1700980240,4
