1649917950,2
1650004228,5
1650090628,5
1650177150,4
1650263549,14
1650349831,6
1650436229,13
1650522756,10
1650609163,11
1650695550,7
1650781953,9
1650868349,15
1650954630,31
1651041030,19
1651127552,17
1651213951,13
