1660804362,4
1660833647,4
1660890760,4
1660920046,4
1660977162,5
1661006455,5
1661063442,9
1661092854,9
1661149842,11
1661179125,11
1661236366,10
1661265647,10
1661322641,14
1661352051,14
1661409162,13
1661438449,13
1661495561,9
1661524735,9
1661581964,28
1661611239,28
1661668363,4
1661697647,4
1661700049,4
1661754784,8
1661784048,8
1661870448,1
1661927560,7
1661956724,7
1662013964,10
1662043246,10
1662100359,2
1662129642,2
