1659249159,5
1659278470,5
1659335565,11
1659364847,11
1659421963,5
1659451128,5
1659508368,8
1659537519,8
1659594767,5
1659624049,5
1659681160,5
1659710444,5
1659767561,8
1659796845,8
1659853840,6
1659883130,6
1659940369,10
1659969638,10
1660026647,11
1660056049,11
1660113163,8
1660142439,8
1660199441,9
1660228849,9
1660285970,8
1660315250,8
1660372250,11
1660401521,11
1660458761,7
1660488049,7
1660545162,1
1660574449,1
