1675405883,35
1675665075,12
1675751474,121
1676356254,5
1676442661,28
1676529061,15
1676615450,29
1676874662,17
1676961061,6
1677047454,3
1677133857,12
1677479458,9
1677565859,9
1677652257,11
1677738657,3
1678084257,3
1678257055,21
1678343445,32
1679569142,159
1679584407,159
1679589867,159
1679596494,159
1679602915,159
1679607956,159
1679639532,69
1679722309,32
1679808717,36
1679895117,33
1679981518,107
1680067912,53
1680154308,44
1680240714,37
1680327097,15
1680413504,22
1680499902,68
1680586299,109
1680672702,51
1680759104,20
1680845523,18
1680931899,18
1681018301,32
1681104713,71
1681191117,66
1681277516,64
1681363906,88
1681450306,51
1681536706,44
1681623105,16
1681709528,89
1681795909,44
1681882326,91
1681968706,92
1682055103,37
1682141505,21
1682227910,42
1682314324,110
1682400707,44
1682487105,44
1682573524,85
1682659898,69
1682746309,17
1682832700,23
1682919107,30
1683005499,104
1683091901,319
1683178309,43
1683264713,46
1683351101,20
1683437506,18
1683523904,44
1683610328,174
1683696716,45
1683783116,72
1683869508,29
1683955918,25
1684042308,34
1685544777,33
1685597496,93
1685683902,48
1685770303,19
1685856701,19
1685943100,20
1686029502,10
1686115904,100
1686202306,54
1686288711,53
1686375108,34
1686461512,18
1686547909,52
1686634309,61
1686720704,55
1686807105,86
1686893562,59
1686979954,22
1687066360,14
1687152774,68
1687239150,33
1687411953,4
1687498393,19
1687584774,28
1687671173,5
1687757568,44
1687843969,30
1687930377,65
1688016807,346
1688103218,260
1688189597,29
1688275996,55
1688362412,71
1688535215,25
1688621614,26
1688708029,17
1688794420,21
1688880821,17
1688967219,26
1689053626,15
1689140028,31
1689226424,154
1689312837,67
1689399195,22
1689485597,22
1689572000,51
1689658397,28
1689744807,6
1689831241,30
1689917640,13
1690004042,19
1690090404,31
1690176817,32
1690263240,22
1690349617,18
1690436012,26
1690522443,50
1690608808,16
1690695212,14
1690781617,24
1690868047,17
1690954421,14
1691040818,20
1691127250,4
1691213630,13
1691300015,15
1691386395,78
1691472821,12
1691559206,74
1691645653,41
1691732035,41
1691818443,8
1691904834,19
1691991184,45
1692077570,22
1692163972,71
1692250382,14
1692336773,17
1692423180,41
1692509573,22
1692595944,2
1692682368,47
1692768764,16
1692855167,48
1692941568,29
1693027980,34
1693114356,19
1693200777,31
1693287141,34
1693373568,35
1693459952,40
1693546364,17
1693632754,34
1693719144,12
1693805540,124
1693891949,22
1693978362,19
1694064749,41
1694151151,40
1694237547,27
1694323959,15
1694410362,56
1694496769,38
1694583178,57
1694669562,268
1694755972,244
1694842363,51
1694928766,36
1695015165,197
1695187975,104
1695274380,104
1695360784,105
1695447164,32
1695533586,44
1695619990,89
1695706406,69
1695792808,120
1695879218,89
1695965624,39
1696052011,17
1696138408,25
1696224807,22
1696311219,47
1696397621,42
1696484041,34
1696570435,66
1696656841,31
1696743237,18
1696829644,26
1696916048,36
1697002439,34
1697088838,79
1697175238,44
1697261644,23
1697348050,23
1697434425,51
1697520844,37
1697607247,53
1697693651,16
1697780021,45
1697866447,37
1697952848,11
1698039229,68
1698125641,47
1698212053,29
1698298423,35
1698384826,75
1698474862,13
1698561261,45
1698647660,56
1698734051,71
1698820440,85
1698906836,50
1698993260,43
1699079643,33
1699166057,42
1699252467,50
1699338847,55
1699425254,36
1699511642,39
1699598052,55
1699684453,32
1699770845,14
1699857241,22
1699943653,34
1700030030,34
1700116443,42
1700202865,41
1700289223,44
1700375637,39
1700462021,69
1700548451,27
1700634836,48
1700721246,14
1700807657,45
1700894058,9
1700980458,8
