1650436229,1
1650522756,12
1650609163,9
1650695550,12
1650781953,9
1650868349,21
1650954630,15
1651041030,31
1651127552,22
1651213951,20
1651300352,30
1651386755,29
1651473034,30
1651559564,8
1651645850,23
1651732362,25
1651818753,29
1651905153,19
1651991564,14
1652077954,18
1652164360,16
1652250764,22
1652337032,13
1652423553,18
1652509832,9
1652596232,23
1652682759,17
1652769160,26
1652855561,34
1652941964,38
1653028353,28
1653114753,29
1653201159,26
1653287558,33
1653373954,35
1653460234,30
1653546755,37
1653633154,30
1653719553,29
1653805957,26
1653892236,27
1653978755,25
1654065033,35
1654151553,31
1654237831,29
1654324351,34
1654410631,38
1654497153,32
1654583555,22
