1663482759,10
1663512042,10
1663569159,6
1663598447,6
1663655565,91
1663684725,91
1663741840,4
1663771124,4
1663828239,4
1663857524,4
1664001039,2
1664030318,2
1664173842,99
1664203127,99
1664519554,4
1664548711,4
1664605833,4
1664635111,4
