1687066360,251
1687152774,491
1687239150,122
1687411953,81
1687498393,100
1687584774,95
1687671173,174
1687757568,85
1687843969,130
1687930377,444
1688016807,81
1688103218,83
1688189597,178
1688275996,98
