1679584314,2
1679589759,2
1679596397,2
1679602819,2
1679607852,2
1679639432,2
1679981431,2
1680240629,2
1680413427,1
1680845434,2
1683610233,3
1687498241,1
1688016640,5
1688103041,5
1688362240,5
1688535044,5
1688621445,5
1688707844,5
1688794245,5
1688880644,5
1688967042,5
1689053441,7
1689139840,5
1689226241,5
1689312653,5
1689744640,3
1689831044,5
1689917446,5
1690003846,5
1690522245,2
1690867847,4
1691127048,4
1691645448,3
1691731846,2
1691818247,2
1691904646,2
1691991040,3
1692077440,3
1692163831,3
1692250233,3
1692336633,3
1692423035,3
1692509432,3
1692682233,3
1692768633,3
1692855035,3
1692941433,3
1693027839,3
1693114233,1
1693200633,3
1693978232,4
1694323834,2
1694410234,1
1694496634,2
1694583036,4
1694669436,3
1694755834,4
1694842234,4
1694928634,4
1695187834,3
1695274234,4
1695360634,5
1695533434,4
1695619839,4
1695879053,1
1695965441,2
1696483842,2
1696656645,2
1696743043,2
1696829444,2
1696915841,2
1697002242,2
1697088641,2
1697175042,1
1697261447,2
1697347842,2
1697520642,2
1697607044,2
1697693444,2
1697866244,2
1697952644,2
1698211845,1
1698474646,1
1698561046,2
1698647445,1
1698733843,1
1698993045,4
1699079441,2
1699165843,2
1699252253,10
1699338639,2
1699425038,2
1699597838,3
1699684239,2
1699770639,2
1699943446,2
1700116239,2
1700202637,4
1700548240,2
1700721041,2
1700807441,4
1700893840,2
1700980240,4
