1674367285,3
1674455475,3
1674714694,11
1675751474,4
1676874662,3
1677738657,5
1679808717,3
1679981518,5
1680240714,4
1680327097,4
1680586299,3
1680931899,8
1681623105,5
1681795909,4
1681882326,3
1681968706,4
1682055103,11
1682141505,3
1682314324,3
1683178309,2
1683437506,3
1685597496,2
1685943100,1
1686547909,2
1687152774,1
1688362412,6
1688621614,3
1689572000,1
1689831241,2
1690608808,2
1690781617,1
1690868047,2
1691991184,1
1692163972,2
1693805540,3
1695619990,1
1696570435,2
1697520844,2
1698125641,2
1698384826,5
1698474862,3
1698561261,5
1698647660,5
1698734051,2
1698820440,7
1698906836,3
1698993260,10
1699079643,2
1699166057,9
1699252467,7
1699338847,7
1699425254,2
1699511642,7
1699598052,3
1699684453,5
1699770845,2
1699857241,8
1699943653,4
1700030030,3
1700116443,2
1700202865,7
1700289223,2
1700375637,5
1700462021,3
1700548451,8
1700634836,2
