1683783032,1
1684042234,1
1685544705,1
1685683833,1
1685770233,1
1685856632,1
1686029431,1
1686375033,1
1686720636,1
1686807032,1
1686893441,1
1686979840,1
1687239039,1
1687411840,1
1687498241,1
1687671039,1
1687843838,1
1688275841,1
1698561046,1
