1648017150,338
1648103550,147
1648189831,171
1648276229,136
1648362752,267
1648449033,163
1648535442,133
1648621952,149
1648708231,159
1648794750,273
1648881149,275
1648967561,95
1649053832,243
1649140351,28
1649226751,112
1649313029,150
1649399549,134
1649485949,123
