1662186760,8
1662216045,8
1662273039,7
1662302447,7
1662359559,5
1662388727,5
1662445958,4
1662475124,4
1662532358,6
1662561643,6
1662618758,4
1662647931,4
1662705164,1
1662734437,1
1662791558,8
1662820724,8
