1642564885,3
1642651226,1
1642676514,1
1642805851,1
1642910490,4
1642924655,4
1642934565,4
1642937864,4
1643169628,48
1643256090,1
1643428827,5
1643688028,6
1643708607,6
1643774489,4
1643860889,2
1644033629,14
1644388289,1
1644407490,1
1644474692,175
1644493888,175
1644561030,46
1644647492,7
1644820292,13
1644906689,9
1645079499,3
1645252290,2
