1698384826,5
1698474862,1
1698561261,11
1698647660,16
1698734051,10
1698820440,12
1698906836,4
1698993260,19
1699079643,3
1699166057,7
1699252467,5
1699338847,25
1699425254,4
1699511642,7
1699598052,9
1699684453,4
1699770845,5
1699857241,4
1699943653,2
1700030030,9
1700116443,4
1700202865,2
1700289223,3
1700375637,4
1700462021,3
1700548451,18
1700634836,4
1700721246,3
1700807657,11
1700894058,18
1700980458,29
