1692336633,1
1692423035,1
1692509432,1
1692682233,1
1692768633,1
1695965441,1
1696483842,1
1696656645,1
1696743043,1
1696829444,1
1696915841,1
1697002242,1
1697088641,1
1697175042,1
1697261447,1
1697347842,1
1697520642,1
1697607044,1
1697693444,1
1697866244,1
1697952644,1
1698211845,1
1698474646,1
1698561046,1
1698647445,1
1699338639,1
1699597838,1
1699684239,1
1699770639,1
1699857040,1
1700807441,2
1700893840,1
1700980240,1
