1693719144,3
1693805540,20
1693891949,3
1693978362,7
1694064749,17
1694151151,7
1694237547,10
1694323959,18
1694410362,7
1694496769,4
1694583178,7
1694669562,4
1694755972,9
1694842363,1
1694928766,2
1695015165,4
1695187975,10
1695274380,13
1695360784,1
