1641700884,2
1641787224,25
1641873686,13
1642305627,19
1642319122,19
1642392088,11
1642408942,11
1642478484,26
1642564885,3
1642651226,22
1642676514,22
1642769502,14
1642771604,14
1642805136,14
1642805851,14
1642824026,16
1642855125,16
1642910490,11
1642924655,11
1642934565,11
1642937864,11
1642996892,14
1643083292,17
1643169628,14
