1660545162,6
1660574449,6
1660631564,14
1660660730,14
1660717841,12
1660747248,12
1660804362,6
1660833647,6
1660890760,6
1660920046,6
1660977162,10
1661006455,10
1661063442,11
1661092854,11
1661149842,25
1661179125,25
1661236366,5
1661265647,5
1661322641,7
1661352051,7
1661495561,7
1661524735,7
1661581964,8
1661611239,8
1661668363,12
1661697647,12
1661700049,12
1661754784,13
1661784048,13
1661870448,4
1661927560,3
1661956724,3
