1660717841,2
1660747248,2
1660804362,5
1660833647,5
1660890760,4
1660920046,4
1660977162,9
1661006455,9
1661063442,3
1661092854,3
1661149842,10
1661179125,10
1661236366,10
1661265647,10
1661322641,8
1661352051,8
1661409162,11
1661438449,11
1661495561,12
1661524735,12
1661581964,14
1661611239,14
1661668363,3
1661697647,3
1661700049,3
1661754784,10
1661784048,10
1661870448,3
1661927560,8
1661956724,8
