1681536706,57
1681623105,149
1681709528,306
1681795909,287
1681882326,228
1681968706,374
1682055103,107
1682141505,124
1682227910,144
1682314324,103
1682400707,127
1682487105,152
1682573524,254
1682659898,257
1682746309,104
1682832700,86
