1687498241,1
1688016640,1
1688103041,1
1693978232,1
1694842234,1
1694928634,1
1695187834,1
1695274234,1
1695360634,1
1695533434,1
1695619839,1
1695965441,1
1696656645,1
1696743043,1
1696829444,2
1698211845,2
1698474646,3
1698561046,2
1698647445,2
1698733843,2
1698993045,1
1699079441,2
1699165843,2
1699252253,7
1700634640,1
