1636286412,1
1636286488,1
1636895594,18
1636898490,19
1636900709,19
1637070326,16
1637070818,16
1637072812,23
1637122028,21
1637208446,34
1637294806,26
1637381227,30
1637467621,30
1637554087,34
1637589848,34
1637640464,8314
1637726914,22
1637813369,25
1637899638,43
1637986004,32
1638072517,20
1638158887,12
1638245235,31
1638331638,24
