1646893952,36
1646980230,245
1647066751,103
1647153150,144
1647239550,245
1647325952,201
1647412352,167
1647498752,437
1647585151,376
1647757954,146
1647844355,167
1647930752,176
1648017150,406
1648103550,292
1648189831,145
1648276229,136
1648362752,281
1648449033,145
1648535442,146
1648621952,147
1648708231,154
