1645857150,38
1646116237,124
1646202760,46
1646289033,165
1646375551,44
1646548229,37
1646634751,13
1647066751,142
1647153150,7
1647239550,2
1647412352,25
1647498752,12
1647844355,3
1648017150,84
1648535442,11
1648621952,10
1648794750,3
1648881149,7
1649053832,10
1649226751,276
1649399549,11
1649572354,13
1649658750,2
1649831565,1
