1646116237,13
1646202760,126
1646289033,133
1646375551,251
1646461951,271
1646548229,100
1646634751,14
1646721161,168
1646807431,237
1646893952,246
1646980230,364
1647066751,364
1647153150,163
1647239550,267
1647325952,159
1647412352,193
1647498752,170
1647585151,249
1647757954,484
1647844355,138
1647930752,153
1648017150,303
1648103550,169
1648189831,131
1648276229,239
1648362752,150
1648449033,148
1648535442,153
1648621952,163
