1636286412,44
1636286488,44
1636895594,525
1636898490,569
1636900709,573
1637070326,748
1637070818,758
1637072812,727
1637122028,1329
1637208446,1082
1637294806,537
1637381227,2
1637467621,596
1637554087,435
1637589848,435
1637726914,16
1637813369,146
1638158887,146
1638245235,582
1638331638,54
1639904549,8
1639907950,8
1639980923,398
1639983233,398
1639985995,398
1640059226,104
1640080313,104
1640145685,32
1640232083,106
1640318424,2
1640404823,2
1640491284,2
1640577691,2
1640664024,5
1640750484,297
1640836884,106
1640923223,2
1641009626,2
1641096084,2
1641182484,349
1641268824,591
1641355224,267
1641441684,14
1641528084,887
1641700884,2
1641787224,860
1641873686,102
1642392088,210
1642408942,210
1642478484,103
1642564885,429
1642651226,406
1642676514,406
1642805851,320
1642824026,6
1642855125,6
1642910490,8
1642924655,8
1642934565,8
1642937864,8
1642996892,492
1643083292,337
1643169628,456
1643256090,13538
1643342487,18
1643428827,2
1643515288,2
1643601634,759
1643622207,759
1643688028,620
1643708607,620
1643774489,915
1643860889,523
1643947288,913
1644033629,2
1644120088,131
1644206493,1041
1644292831,1256
1644321030,1256
1644388289,1079
1644407490,1079
1644474692,597
1644493888,597
1644561030,615
1644647492,2
1644733834,2
1644770508,2
1644820292,588
1644906689,1046
1644993090,245
1645079499,963
1645165829,269
1645252290,2
1645338629,2
1645425030,2
1645467113,2
1645470826,2
1645511492,450
1645597892,1846
1645684232,694
1645770629,406
1645857150,2
1645943553,2
1646029893,735
1646116237,104
1646202760,27
1646289033,140
1646375551,109
1646461951,2
1646548229,2
1646634751,745
1646721161,367
1646807431,514
1646893952,327
1646980230,2
1647066751,2
1647153150,2
1647239550,335
1647325952,557
1647412352,367
1647498752,284
1647585151,373
1647757954,2
1647844355,581
1647930752,794
1648017150,877
1648103550,1888
1648189831,1006
1648276229,2
1648362752,2
1648449033,657
1648535442,1618
1648621952,9947
1648708231,9497
1648794750,1533
1648881149,2
1648967561,2
1649053832,2093
1649140351,3577
1649226751,3757
1649313029,3315
1649399549,1903
1649485949,1440
1649572354,1872
1649658750,3184
1649745150,1786
1649831565,1776
1649917950,2951
1650004228,407
1650090628,36
1650177150,15
1650263549,13
1650349831,2908
1650436229,4970
1650522756,2821
1650609163,1162
1650695550,19
1650781953,18
1650868349,1828
1650954630,1510
1651041030,2754
1651127552,3192
1651213951,2059
1651300352,133
1651386755,394
1651473034,1590
1651559564,686
1651645850,721
1651732362,2095
1651818753,1468
1651905153,948
1651991564,1206
1652077954,3751
1652164360,4299
1652250764,3664
1652337032,1107
1652423553,2367
1652509832,953
1652596232,1292
1652682759,2346
1652769160,1600
1652855561,2362
1652941964,1111
1653028353,1436
1653114753,7
1653201159,101
1653287558,713
1653373954,1146
1653460234,1140
1653546755,2
1653633154,801
1653719553,2
1653805957,2
1653892236,1529
1653978755,1259
1654065033,2294
1654151553,2765
1654237831,1862
1654324351,2
1654410631,2
1654497153,2
1654583555,1473
1654669837,2172
1654756356,1690
1654842756,1505
1654929156,2
1655015436,86
1655101838,658
1655188357,1332
1655274636,1460
1655361158,1317
1655447555,1680
1655533836,2
1655620256,88
1655706645,724
1655793158,1700
1655879557,1222
1655965955,1062
1656052365,2
1656138754,2
1656225155,2
1656311556,1026
1656397956,872
1656484356,521
1656570758,117
1656829841,2
1656916357,567
1657002637,832
1657089163,738
1657175559,872
1657261838,501
1657348240,2
1657434758,2
1657521164,1308
1657607566,1417
1657693957,700
1657780357,568
1657803090,568
1657804447,568
1657809517,568
1657866760,1232
1657896040,1232
1657953158,4
1657982325,4
1658039438,4
1658068726,4
1658125843,963
1658155247,963
1658212362,959
1658241661,959
1658298758,1693
1658328052,1693
1658385041,418
1658414447,418
1658471560,1004
1658500847,1004
1658557962,4
1658587247,4
1658644360,4
1658673645,4
1658730762,1698
1658760045,1698
1658817160,2018
1658846453,2018
1658903439,1776
1658932848,1776
1658989840,738
1659019246,738
1659076365,574
1659105646,574
1659162770,4
1659192044,4
1659249159,4
1659278470,4
1659335565,690
1659364847,690
1659421963,1490
1659451128,1490
1659508368,1154
1659537519,1154
1659594767,1607
1659624049,1607
1659681160,1313
1659710444,1313
1659767561,4
1659796845,4
1659853840,4
1659883130,4
1659940369,4
1659969638,4
1660026647,5
1660056049,5
1660113163,122
1660142439,122
1660199441,521
1660228849,521
1660285970,653
1660315250,653
1660372250,4
1660401521,4
1660458761,4
1660488049,4
1660545162,1373
1660574449,1373
1660631564,1048
1660660730,1048
1660717841,678
1660747248,678
1660804362,251
1660833647,251
1660890760,1409
1660920046,1409
1660977162,4
1661006455,4
1661063442,4
1661092854,4
1661149842,874
1661179125,874
1661236366,859
1661265647,859
1661322641,1411
1661352051,1411
1661409162,1468
1661438449,1468
1661495561,1194
1661524735,1194
1661581964,4
1661611239,4
1661668363,4
1661697647,4
1661700049,4
1661754784,1543
1661784048,1543
1661870448,869
1661927560,1016
1661956724,1016
1662013964,460
1662043246,460
1662100359,866
1662129642,866
1662186760,4
1662216045,4
1662273039,4
1662302447,4
1662359559,628
1662388727,628
1662445958,435
1662475124,435
1662532358,1005
1662561643,1005
1662618758,1090
1662647931,1090
1662705164,1219
1662734437,1219
1662791558,4
1662820724,4
1662877847,4
1662907237,4
1662964357,1339
1662993645,1339
1663050638,1201
1663080057,1201
1663137169,887
1663166448,887
1663223564,2518
1663252844,2518
1663309969,1256
1663339237,1256
1663396358,88
1663425653,88
1663482759,4
1663512042,4
1663569159,1872
1663598447,1872
1663655565,1125
1663684725,1125
1663741840,1605
1663771124,1605
1663828239,392
1663857524,392
1663914640,1149
1663943934,1149
1664001039,4
1664030318,4
1664087438,4
1664116722,4
1664173842,7
1664203127,7
1664260251,595
1664289537,595
1664346641,1181
1664375951,1181
1664433041,1078
1664462320,1078
1664519554,2022
1664548711,2022
1664605833,88
1664635111,88
1668081545,6115
1668474184,4772
1668560577,5246
1668646979,4655
1671629111,3070
1671630664,3070
1671632450,3070
1671634011,3070
1673516775,2517
1674367285,612
1674455475,9916
1674541884,5102
1674628285,7478
1674714694,1905
1674801082,14321
1674887480,10
1674973872,361
1675060281,6997
1675146682,4202
1675233071,4282
1675319481,4431
1675405883,3689
1675492281,39
1675578681,422
1675665075,9911
1675751474,15581
1675837863,3250
1676356254,5742
1676442661,3813
1676529061,3572
1676615450,3323
1676701857,56
1676788249,162
1676874662,1864
1676961061,3827
1677047454,4837
1677133857,6093
1677220262,2995
1677306660,368
1677393061,171
1677479458,7064
1677565859,7783
1677652257,7798
1677738657,4077
1677825057,2696
1677911460,1505
1677997847,1509
1678084257,4225
1678170666,609
1678257055,2801
1678343445,2732
1679569142,2155
1679584407,2155
1679589867,2155
1679596494,2155
1679602915,2155
1679607956,2155
1679639532,1334
1679895117,1945
1679981518,1175
1680067912,1846
1680154308,1481
1680240714,1700
1680327097,139
1680499902,2259
1680586299,452
1680672702,1063
1680759104,986
1680845523,989
1680931899,944
1681018301,911
1681104713,911
1681191117,1196
1681277516,938
1681363906,252
1681450306,5
1681536706,2
1681623105,2
1681709528,2
1681795909,2
1681882326,2
1681968706,2
1682055103,2
1682141505,2
1682227910,2
1682314324,5
1682400707,9
1682487105,2
1682573524,2
1682659898,2
1682746309,2
1682832700,2
1682919107,2
1683005499,2
1683091901,365
1683178309,301
1683264713,3
1683351101,2
1683437506,2
1683523904,323
1683610328,508
1683696716,508
1683783116,507
1683869508,168
1683955918,2
1684042308,2
1685597496,2
1685683902,2
1685770303,2
1685856701,2
1685943100,4
1686029502,2
1686115904,3
1686202306,2
1686288711,2
1686375108,2
1686461512,2
1686547909,2
1686634309,3
1686720704,4
1686807105,2
1686893562,2
1686979954,2
1687066360,2
1687152774,2
1687239150,2
1687411953,14
1687498393,2
1687584774,2
1687671173,2
1687757568,3
1687843969,2
1687930377,2
1688016807,2
1688103218,2
1688189597,2
1688275996,2
1688362412,2
1688535215,2
1688621614,5
1688708029,2
1688794420,2
1688880821,2
1688967219,2
1689053626,2
1689140028,2
1689226424,2
1689312837,2
1689399195,2
1689485597,2
1689572000,2
1689658397,2
1689744807,5
1689831241,2
1689917640,2
1690004042,2
1690090404,2
1690176817,2
1690263240,2
1690349617,3
1690436012,2
1690522443,2
1690608808,2
1690695212,2
1690781617,3
1690868047,2
1690954421,2
1691040818,4
1691127250,2
1691213630,2
1691300015,2
1691386395,2
1691472821,2
1691559206,2
1691645653,2
1691732035,2
1691818443,2
1691904834,2
1691991184,2
1692077570,3
1692163972,2
1692250382,2
1692336773,2
1692423180,2
1692509573,2
1692595944,2
1692682368,2
1692768764,2
1692855167,2
1692941568,2
1693027980,2
1693114356,2
1693200777,2
1693287141,2
1693373568,3
1693459952,2
1693546364,2
1693632754,2
1693719144,3
1693805540,2
1693891949,3
1693978362,2
1694064749,2
1694151151,117
1694237547,2
1694323959,2
1694410362,2
1694496769,2
1694583178,3
1694669562,11
1694755972,2
1694842363,2
1694928766,2
1695015165,2
1695187975,2
1695274380,2
1695360784,2
1695447164,2
1695533586,2
1695619990,2
1695706406,5
1695792808,2
1695879218,2
1695965624,2
1696052011,2
1696138408,2
1696224807,2
1696311219,2
1696397621,2
1696484041,2
1696570435,2
1696656841,2
1696743237,2
1696829644,2
1696916048,2
1697002439,2
1697088838,2
1697175238,2
1697261644,2
1697348050,2
1697434425,2
1697520844,2
1697607247,2
1697693651,2
1697780021,2
1697866447,2
1697952848,2
1698039229,2
1698125641,2
1698212053,2
1698298423,2
1698384826,2
1698474862,2
1698561261,2
1698647660,2
1698734051,2
1698820440,2
1698906836,2
1698993260,2
1699079643,2
1699166057,2
1699252467,2
1699338847,2
1699425254,2
1699511642,2
1699598052,7
1699684453,2
1699770845,2
1699857241,16
1699943653,2
1700030030,2
1700116443,2
1700202865,2
1700289223,2
1700375637,2
1700462021,2
1700548451,2
1700634836,2
1700721246,2
1700807657,2
1700894058,2
1700980458,2
