1679584314,4
1679589759,4
1679596397,4
1679602819,4
1679607852,4
1679639432,4
1679981431,4
1680240629,4
1680845434,4
1682227834,2
1682573432,2
1683437432,1
1683610233,4
1687498241,1
1688016640,1
1688103041,1
1688362240,1
1688535044,1
1688621445,2
1688707844,2
1688794245,2
1688880644,2
1688967042,2
1689053441,2
1689139840,2
1689226241,2
1689312653,2
1689744640,1
1689831044,2
1689917446,2
1690003846,2
1690263047,1
1690522245,1
1690781448,1
1690867847,2
1691127048,2
1691645448,1
1691904646,1
1691991040,1
1692077440,1
1692163831,1
1692250233,1
1692336633,1
1692423035,1
1692509432,1
1692682233,1
1692768633,1
1692855035,1
1692941433,1
1693027839,1
1693200633,1
1693978232,1
1694323834,2
1694496634,2
1694583036,2
1694669436,1
1694755834,2
1694842234,2
1694928634,2
1695187834,2
1695274234,2
1695360634,3
1695533434,3
1695619839,3
1695965441,2
1696483842,1
1696656645,1
1696743043,1
1696829444,1
1696915841,1
1697088641,1
1698474646,1
1698561046,1
1698647445,1
1698733843,1
1698993045,2
1699079441,1
1699165843,1
1699252253,4
1700721041,1
1700807441,2
1700893840,1
1700980240,1
