1649053832,106
1649140351,151
1649226751,257
1649313029,142
1649399549,263
1649485949,130
1649572354,120
1649658750,183
1649745150,335
1649831565,380
1649917950,141
1650004228,415
1650090628,447
1650177150,262
1650263549,138
1650349831,132
1650436229,147
1650522756,267
1650609163,197
1650695550,222
1650781953,116
1650868349,160
1650954630,128
1651041030,382
1651127552,197
1651213951,370
1651300352,136
1651386755,247
1651473034,483
1651559564,140
1651645850,101
1651732362,145
1651818753,251
1651905153,256
1651991564,121
1652077954,258
1652164360,122
1652250764,163
1652337032,142
1652423553,258
1652509832,166
1652596232,170
1652682759,119
1652769160,136
1652855561,119
1652941964,127
