1639904549,167
1639907950,167
1639980923,204
1639983233,204
1639985995,204
1640059226,140
1640080313,140
1640145685,102
1640232083,143
1640318424,216
1640404823,212
1640491284,96
1640577691,36
1640664024,80
1640750484,67
1640836884,165
1640923223,154
1641009626,80
