1676529061,11
1676615450,15
1676701857,15
1676788249,5
1676874662,6
1676961061,15
1677047454,13
1677133857,7
1677220262,5
1677306660,4
1677393061,14
1677479458,15
1677565859,5
1677652257,7
1677738657,11
