1648017150,1
1648103550,7
1648189831,4
1648276229,4
1648362752,4
1648449033,7
1648535442,5
1648621952,2
1648708231,4
1648794750,14
1648881149,6
1648967561,1
1649053832,3
1649226751,2
1649313029,7
1649399549,14
1649485949,4
