1659508368,2
1659537519,2
1659681160,2
1659710444,2
1659767561,3
1659796845,3
1659940369,1
1659969638,1
1660026647,3
1660056049,3
1660113163,3
1660142439,3
1660545162,1
1660574449,1
1660631564,1
1660660730,1
