1659681160,5
1659710444,5
1659767561,8
1659796845,8
1659853840,6
1659883130,6
1659940369,12
1659969638,12
1660026647,5
1660056049,5
1660199441,9
1660228849,9
1660372250,5
1660401521,5
1660631564,3
1660660730,3
1661063442,2
1661092854,2
1661236366,2
1661265647,2
1661581964,2
1661611239,2
1661668363,2
1661697647,2
1661700049,2
1662013964,2
1662043246,2
