1662013964,10
1662043246,10
1662100359,56
1662129642,56
1662186760,85
1662216045,85
1662273039,52
1662302447,52
1662359559,63
1662388727,63
1662445958,78
1662475124,78
1662532358,184
1662561643,184
1662618758,181
1662647931,181
1662705164,50
1662734437,50
1662791558,52
1662820724,52
1662877847,151
1662907237,151
1662964357,57
1662993645,57
1663050638,49
1663080057,49
1663137169,215
1663166448,215
1663223564,279
1663252844,279
1663309969,163
1663339237,163
