1655793158,27
1655879557,244
1655965955,264
1656052365,310
1656138754,283
1656225155,205
1656311556,178
1656397956,152
1656484356,138
1656570758,198
1656743558,387
1656829841,191
1656916357,137
1657002637,155
1657089163,100
