1644292820,1
1644321017,1
1645079416,20
1645338616,28
1645425017,21
1645467072,49
1645470791,50
1645511417,14
1645597817,16
1645857016,4
1646202626,1
1650090617,2
1650349817,1
1650522617,1
1652941818,1
1653201018,1
1653287417,1
1655361020,1
1655447420,1
1658212225,1
1658241501,1
1658298621,1
1658327901,1
1658385022,1
1658414301,1
1658471422,3
1658500701,3
1659594623,1
1659623905,1
1660026622,1
1660055909,1
1661754643,2
1661783901,2
1662186621,1
1662215902,1
1662273020,1
1662302302,1
1662359420,1
1662388701,1
1662964220,1
1662993501,1
1664001021,1
1664030301,1
1664433023,1
1664462299,1
1664635096,1
