1662877847,10
1662907237,10
1662964357,7
1662993645,7
1663050638,13
1663080057,13
1663137169,8
1663166448,8
1663223564,7
1663252844,7
1663309969,7
1663339237,7
1663396358,13
1663425653,13
1663482759,9
1663512042,9
1663569159,6
1663598447,6
1663655565,7
1663684725,7
1663741840,19
1663771124,19
1663828239,9
1663857524,9
1663914640,15
1663943934,15
1664001039,9
1664030318,9
1664087438,19
1664116722,19
1664173842,2
1664203127,2
