1658298758,19
1658328052,19
1658385041,38
1658414447,38
1658471560,33
1658500847,33
1658557962,35
1658587247,35
1658644360,15
1658673645,15
1658730762,27
1658760045,27
1658817160,25
1658846453,25
1658903439,25
1658932848,25
1658989840,25
1659019246,25
1659076365,23
1659105646,23
1659162770,32
1659192044,32
1659249159,31
1659278470,31
1659335565,28
1659364847,28
1659421963,30
1659451128,30
1659508368,21
1659537519,21
1659594767,6
1659624049,6
