1642478484,17
1642564885,15
1642651226,14
1642676514,14
1642769502,20
1642771604,20
1642805136,20
1642805851,20
1642824026,17
1642855125,17
1642910490,15
1642924655,15
1642934565,15
1642937864,15
1642996892,15
1643083292,13
1643169628,14
1643256090,21
1643342487,13
1643428827,1
1643515288,5
1643601634,4
1643622207,4
1643688028,6
1643708607,6
1643774489,4
1643860889,7
1643947288,5
1644033629,7
1644120088,7
1644206493,6
1644292831,8
1644321030,8
1644388289,5
1644407490,5
1644474692,7
1644493888,7
1644561030,3
1644647492,4
1644733834,6
1644770508,6
1644820292,2
1644906689,7
1644993090,6
1645079499,4
1645165829,6
1645252290,1
1645338629,3
1645425030,6
1645467113,6
1645470826,6
1645511492,12
1645597892,7
1645684232,2
1645770629,5
1645857150,4
1645943553,4
1646029893,4
1646116237,5
1646202760,4
1646289033,1
1646375551,4
1646461951,1
1646548229,4
