1659335565,11
1659364847,11
1659421963,6
1659451128,6
1659508368,17
1659537519,17
1659594767,7
1659624049,7
1659681160,15
1659710444,15
1659767561,5
1659796845,5
1659853840,6
1659883130,6
1659940369,9
1659969638,9
1660026647,3
1660056049,3
