1655274636,43
1655361158,31
1655447555,35
1655533836,34
1655620256,36
1655706645,34
1655793158,44
1655879557,30
1655965955,36
1656052365,25
1656138754,39
1656225155,36
1656311556,29
1656397956,29
1656484356,11
