1642769464,1
1642771512,1
1642805117,1
1642805834,1
1642924636,1
1642934533,1
1642937831,1
1644561017,2
1644733822,1
1644770413,1
1644993017,1
1645252217,4
1645511417,1
1645770616,1
1645857016,8
1646029817,1
1647239417,1
1648362619,1
1648535417,5
1648967418,1
1650349817,1
1650436217,1
1650522617,1
1650609029,1
1650695416,8
1650781820,1
1650868217,1
1650954617,2
1651041017,1
1651127418,1
1651213817,1
1651300219,1
1651386622,1
1651473017,1
1651559421,2
1651645827,1
1651818617,1
1651905018,1
1651991417,1
1652077818,1
1652164218,1
1652250621,3
1652423417,1
1652509817,1
1652596217,1
1652769018,1
1652855418,1
1653028217,1
1653201018,1
1653546617,1
1653633018,1
1653719418,1
1653805821,1
1653892219,1
1654065018,3
1654151419,1
1654237818,1
1654324218,2
1654410618,1
1654497019,1
1654669819,2
1654756220,1
1654842619,1
1654929020,1
1655015420,1
1655101820,1
1655188220,2
1655361020,1
1655533820,1
1655620219,1
1655706620,1
1655879419,1
1657780221,1
1657802862,1
1657804268,1
1657809502,1
1658212225,2
1658241501,2
1658989823,3
1659019101,3
1661236224,1
1661265501,1
1661754643,1
1661783901,1
1661870301,1
1663828220,1
1663857500,1
1664173822,1
1664203101,1
1664260231,1
1664289502,1
1664605817,1
1664635096,1
1668350508,1
1668355650,1
1668356487,1
1668360366,1
1681709434,1
1692941433,1
1693114233,1
1696483842,1
1696743043,1
1697002242,1
1700807441,1
