1656052365,7
1656138754,16
1656225155,9
1656311556,11
1656397956,9
1656484356,7
1656570758,11
1656743558,6
1656829841,19
1656916357,8
1657002637,13
1657089163,12
1657175559,22
1657261838,9
1657348240,11
1657434758,10
1657521164,12
1657607566,10
1657693957,5
1657780357,20
1657803090,20
1657804447,20
1657809517,20
1657866760,11
1657896040,11
1657953158,9
1657982325,9
1658039438,13
1658068726,13
1658125843,10
1658155247,10
1658212362,9
1658241661,9
1658298758,15
1658328052,15
1658385041,11
1658414447,11
1658471560,12
1658500847,12
1658557962,6
1658587247,6
1658644360,11
1658673645,11
1658730762,10
1658760045,10
1658817160,18
1658846453,18
1658903439,8
1658932848,8
1658989840,7
1659019246,7
1659076365,5
1659105646,5
1659162770,11
1659192044,11
1659249159,6
1659278470,6
1659335565,14
1659364847,14
1659421963,16
1659451128,16
1659508368,7
1659537519,7
1659594767,5
1659624049,5
1659681160,5
1659710444,5
