1636286412,68
1636286488,69
1636895594,787
1636898490,836
1636900709,873
1637070326,821
1637070818,831
1637072812,1435
1637122028,1439
1637208446,1435
1637294806,1434
1637381227,1434
1637467621,1434
1637554087,1435
1637589848,1435
1637726914,1434
1637813369,1434
1638072517,1433
1638158887,1434
1638245235,1435
1638331638,1434
1639904549,1434
1639907950,1434
1639980923,1438
1639983233,1438
1639985995,1438
1640059226,1436
1640080313,1436
1640145685,1436
1640232083,1434
1640318424,1435
1640404823,1435
1640491284,1435
1640577691,1435
1640664024,1434
1640750484,1435
1640836884,1434
1640923223,1434
1641009626,1434
1641096084,1434
1641182484,1434
1641268824,1435
1641355224,1434
1641441684,1434
1641528084,1428
1641700884,1435
1641787224,1435
1641873686,1431
1642392088,1002
1642408942,1002
1642478484,1441
1642564885,1440
1642651226,1440
1642676514,1440
1642805851,1441
1642824026,1442
1642855125,1442
1642910490,1443
1642924655,1443
1642934565,1443
1642937864,1443
1642996892,1447
1643083292,1440
1643169628,1440
1643256090,1437
1643342487,1440
1643428827,1440
1643515288,1439
1643601634,1440
1643622207,1440
1643688028,1440
1643708607,1440
1643774489,1441
1643860889,1440
1643947288,1440
1644033629,1439
1644120088,1439
1644206493,1440
1644292831,1439
1644321030,1439
1644388289,1441
1644407490,1441
1644474692,1441
1644493888,1441
1644561030,1441
1644647492,1440
1644733834,1439
1644770508,1439
1644820292,1446
1644906689,1440
1644993090,1440
1645079499,1439
1645165829,1439
1645252290,1440
1645338629,1440
1645425030,1439
1645467113,1439
1645470826,1439
1645511492,1442
1645597892,1440
1645684232,1440
1645770629,1440
1645857150,1439
1645943553,1440
1646029893,1440
1646116237,1440
1646202760,1440
1646289033,1439
1646375551,1440
1646461951,1440
1646548229,1440
1646634751,1439
1646721161,1440
1646807431,1440
1646893952,1440
1646980230,1440
1647066751,1440
1647153150,1440
1647239550,1439
1647325952,1440
1647412352,1440
1647498752,1439
1647585151,1440
1647757954,1440
1647844355,1440
1647930752,1440
1648017150,1440
1648103550,1440
1648189831,1440
1648276229,1440
1648362752,1440
1648449033,1440
1648535442,1440
1648621952,1440
1648708231,1439
1648794750,1439
1648881149,1440
1648967561,1440
1649053832,1440
1649140351,1440
1649226751,1439
1649313029,1440
1649399549,1440
1649485949,1440
1649572354,1439
1649658750,1440
1649745150,1440
1649831565,1440
1649917950,1439
1650004228,1440
1650090628,1440
1650177150,1439
1650263549,1440
1650349831,1440
1650436229,1440
1650522756,1440
1650609163,1440
1650695550,1440
1650781953,1440
1650868349,1440
1650954630,1440
1651041030,1440
1651127552,1439
1651213951,1439
1651300352,1440
1651386755,1440
1651473034,1440
1651559564,1439
1651645850,1440
1651732362,1440
1651818753,1440
1651905153,1440
1651991564,1440
1652077954,1439
1652164360,1440
1652250764,1440
1652337032,1440
1652423553,1440
1652509832,1439
1652596232,1440
1652682759,1440
1652769160,1439
1652855561,1440
1652941964,1438
1653028353,1440
1653114753,1439
1653201159,1440
1653287558,1440
1653373954,1440
1653460234,1439
1653546755,1440
1653633154,1440
1653719553,1440
1653805957,1440
1653892236,1439
1653978755,1440
1654065033,1440
1654151553,1439
1654237831,1440
1654324351,1440
1654410631,1439
1654497153,1440
1654583555,1439
1654669837,1440
1654756356,1438
1654842756,1440
1654929156,1439
1655015436,1440
1655101838,1440
1655188357,1440
1655274636,1439
1655361158,1440
1655447555,1440
1655533836,1440
1655620256,1440
1655706645,1440
1655793158,1440
1655879557,1439
1655965955,1440
1656052365,1440
1656138754,1440
1656225155,1439
1656311556,1440
1656397956,1440
1656484356,1440
1656570758,1439
1656743558,1439
1656829841,1439
1656916357,1440
1657002637,1439
1657089163,1440
1657175559,1440
1657261838,1440
1657348240,1440
1657434758,1439
1657521164,1440
1657607566,1440
1657693957,1439
1657780357,1440
1657803090,1440
1657804447,1440
1657809517,1440
1657866760,1444
1657896040,1444
1657953158,1440
1657982325,1440
1658039438,1441
1658068726,1441
1658125843,1440
1658155247,1440
1658212362,1440
1658241661,1440
1658298758,1440
1658328052,1440
1658385041,1441
1658414447,1441
1658471560,1440
1658500847,1440
1658557962,1441
1658587247,1441
1658644360,1441
1658673645,1441
1658730762,1441
1658760045,1441
1658817160,1440
1658846453,1440
1658903439,1441
1658932848,1441
1658989840,1441
1659019246,1441
1659076365,1441
1659105646,1441
1659162770,1440
1659192044,1440
1659249159,1441
1659278470,1441
1659335565,1441
1659364847,1441
1659421963,1440
1659451128,1440
1659508368,1441
1659537519,1441
1659594767,1441
1659624049,1441
1659681160,1441
1659710444,1441
1659767561,1440
1659796845,1440
1659853840,1441
1659883130,1441
1659940369,1441
1659969638,1441
1660026647,1441
1660056049,1441
1660113163,1440
1660142439,1440
1660199441,1441
1660228849,1441
1660285970,1440
1660315250,1440
1660372250,1441
1660401521,1441
1660458761,1440
1660488049,1440
1660545162,1441
1660574449,1441
1660631564,1440
1660660730,1440
1660717841,1441
1660747248,1441
1660804362,1441
1660833647,1441
1660890760,1440
1660920046,1440
1660977162,1441
1661006455,1441
1661063442,1441
1661092854,1441
1661149842,1441
1661179125,1441
1661236366,1441
1661265647,1441
1661322641,1441
1661352051,1441
1661409162,1441
1661438449,1441
1661495561,1441
1661524735,1441
1661581964,1441
1661611239,1441
1661668363,1440
1661697647,1440
1661700049,1440
1661754784,1442
1661784048,1442
1661870448,1441
1661927560,1441
1661956724,1441
1662013964,1441
1662043246,1441
1662100359,1441
1662129642,1441
1662186760,1441
1662216045,1441
1662273039,1441
1662302447,1441
1662359559,1441
1662388727,1441
1662445958,1441
1662475124,1441
1662532358,1440
1662561643,1440
1662618758,1438
1662647931,1438
1662705164,1440
1662734437,1440
1662791558,1441
1662820724,1441
1662877847,1441
1662907237,1441
1662964357,1440
1662993645,1440
1663050638,1441
1663080057,1441
1663137169,1441
1663166448,1441
1663223564,1438
1663252844,1438
1663309969,1441
1663339237,1441
1663396358,1441
1663425653,1441
1663482759,1441
1663512042,1441
1663569159,1440
1663598447,1440
1663655565,1441
1663684725,1441
1663741840,1441
1663771124,1441
1663828239,1441
1663857524,1441
1663914640,1440
1663943934,1440
1664001039,1441
1664030318,1441
1664087438,1441
1664116722,1441
1664173842,1440
1664203127,1440
1664260251,1441
1664289537,1441
1664346641,1441
1664375951,1441
1664433041,1441
1664462320,1441
1664519554,1441
1664548711,1441
1664605833,1441
1664635111,1441
1668081545,1439
1668350533,1439
1668355972,1439
1668356757,1439
1668360810,1439
1668474184,1439
1668560577,1440
1668646979,1440
1671629111,1439
1671630664,1439
1671632450,1439
1671634011,1439
1673516775,1440
1674367285,1440
1674455475,1441
1674541884,1440
1674628285,1440
1674714694,1441
1674801082,1440
1674887480,1441
1674973872,1440
1675060281,1439
1675146682,1440
1675233071,1441
1675319481,1440
1675405883,1440
1675492281,1441
1675578681,1440
1675665075,1440
1675751474,1442
1675837863,777
1676356254,1111
1676442661,1441
1676529061,1440
1676615450,1440
1676701857,1440
1676788249,1441
1676874662,1440
1676961061,1440
1677047454,1441
1677133857,1440
1677220262,1440
1677306660,1440
1677393061,1441
1677479458,1440
1677565859,1439
1677652257,1930
1677738657,1440
1677825057,1441
1677911460,1440
1677997847,1440
1678084257,1440
1678170666,1441
1678257055,1440
1678343445,1445
1679569142,1442
1679584407,1442
1679589867,1442
1679596494,1442
1679602915,1442
1679607956,1442
1679639532,1448
1679722309,1440
1679808717,1439
1679895117,827
1679981518,1440
1680067912,1440
1680154308,1440
1680240714,1440
1680327097,1441
1680413504,1440
1680499902,1440
1680586299,1440
1680672702,1444
1680759104,1441
1680845523,1440
1680931899,1440
1681018301,1441
1681104713,1440
1681191117,1440
1681277516,1440
1681363906,1442
1681450306,1440
1681536706,1440
1681623105,1441
1681709528,1440
1681795909,1440
1681882326,1440
1681968706,1441
1682055103,1440
1682141505,1440
1682227910,1440
1682314324,1440
1682400707,1441
1682487105,1440
1682573524,1440
1682659898,1440
1682746309,1441
1682832700,1440
1682919107,1440
1683005499,1440
1683091901,1441
1683178309,1440
1683264713,1440
1683351101,1440
1683437506,1441
1683523904,1440
1683610328,1440
1683696716,1440
1683783116,1440
1683869508,1440
1683955918,1440
1684042308,1441
1685544777,1439
1685597496,1441
1685683902,1440
1685770303,1440
1685856701,1441
1685943100,1440
1686029502,1440
1686115904,1440
1686202306,1441
1686288711,1440
1686375108,1440
1686461512,1440
1686547909,1441
1686634309,1440
1686720704,1440
1686807105,1440
1686893562,1441
1686979954,1440
1687066360,1440
1687152774,1441
1687239150,1440
1687411953,1440
1687498393,1441
1687584774,1440
1687671173,1440
1687757568,1440
1687843969,1442
1687930377,1440
1688016807,1440
1688103218,1440
1688189597,1441
1688275996,1440
1688362412,1440
1688535215,1440
1688621614,1440
1688708029,1440
1688794420,1440
1688880821,1441
1688967219,1440
1689053626,1440
1689140028,1440
1689226424,1441
1689312837,1440
1689399195,1440
1689485597,1440
1689572000,1440
1689658397,1441
1689744807,1440
1689831241,1440
1689917640,1440
1690004042,1441
1690090404,1440
1690176817,1440
1690263240,1441
1690349617,1440
1690436012,1440
1690522443,1440
1690608808,1441
1690695212,1440
1690781617,1440
1690868047,1440
1690954421,1441
1691040818,1440
1691127250,1440
1691213630,1440
1691300015,1440
1691386395,1396
1691472821,1440
1691559206,1440
1691645653,1440
1691732035,1441
1691818443,1440
1691904834,1440
1691991184,1440
1692077570,1441
1692163972,1440
1692250382,1440
1692336773,1440
1692423180,1441
1692509573,1440
1692595944,431
1692682368,1440
1692768764,1441
1692855167,1440
1692941568,1440
1693027980,1440
1693114356,1440
1693200777,1441
1693287141,919
1693373568,1440
1693459952,1440
1693546364,1440
1693632754,1441
1693719144,1440
1693805540,1440
1693891949,1441
1693978362,1440
1694064749,1440
1694151151,1440
1694237547,1441
1694323959,1440
1694410362,1440
1694496769,1440
1694583178,1440
1694669562,1441
1694755972,1440
1694842363,1440
1694928766,1440
1695015165,1441
1695187975,1440
1695274380,1441
1695360784,1440
1695447164,1440
1695533586,1441
1695619990,1440
1695706406,1440
1695792808,1441
1695879218,1440
1695965624,1440
1696052011,1440
1696138408,1441
1696224807,1440
1696311219,1440
1696397621,1441
1696484041,1440
1696570435,1440
1696656841,1441
1696743237,1440
1696829644,1440
1696916048,1440
1697002439,1441
1697088838,1438
1697175238,1440
1697261644,1441
1697348050,1440
1697434425,1440
1697520844,1440
1697607247,1441
1697693651,1440
1697780021,1440
1697866447,1441
1697952848,1440
1698039229,1440
1698125641,1440
1698212053,1441
1698298423,1795
1698384826,1440
1698474862,1441
1698561261,1440
1698647660,1440
1698734051,1440
1698820440,1441
1698906836,1441
1698993260,1440
1699079643,1440
1699166057,1440
1699252467,1440
1699338847,1441
1699425254,1440
1699511642,1440
1699598052,1441
1699684453,1440
1699770845,1441
1699857241,1440
1699943653,1440
1700030030,1440
1700116443,1441
1700202865,1440
1700289223,1440
1700375637,1441
1700462021,1440
1700548451,1440
1700634836,1441
1700721246,1440
1700807657,1440
1700894058,1440
1700980458,1441
