1655879557,1
1655965955,7
1656052365,17
1656138754,20
1656225155,8
1656311556,13
1656397956,7
1656484356,7
1656570758,13
1656743558,13
1656829841,12
1656916357,7
1657002637,13
1657089163,8
1657175559,14
1657261838,13
1657348240,18
1657434758,9
1657521164,15
1657607566,9
1657693957,6
1657780357,13
1657803090,13
1657804447,13
1657809517,13
