1695533434,1
1695619839,1
1695965441,1
1696311044,1
1696483842,1
1696570241,1
1696656645,1
1696743043,1
1696829444,1
1697261447,1
1697347842,1
1697520642,1
1697607044,1
1697866244,1
1697952644,1
1698211845,1
1698474646,1
1698561046,1
1698647445,1
