1668350508,2
1668355650,2
1668356487,2
1668360366,2
1679639432,1
1679981431,1
1680240629,1
1680845434,1
1683437432,1
1683610233,1
1686720636,1
1687498241,1
1688016640,1
1688103041,1
1688275841,1
1688362240,1
1688535044,1
1688621445,2
1688707844,1
1688794245,1
1688880644,1
1688967042,1
1689053441,1
1689139840,1
1689226241,1
1689312653,1
1689831044,1
1689917446,1
1690003846,1
1690263047,1
1690522245,1
1690867847,1
1691127048,1
1691645448,1
1691818247,1
1691991040,1
1692077440,1
1692163831,1
1692250233,1
1692336633,1
1692423035,1
1692509432,1
1692682233,1
1692768633,1
1692855035,1
1692941433,1
1693027839,1
1693114233,1
1693200633,1
1693978232,1
1694151031,1
1694583036,1
1694669436,1
1694755834,1
1694842234,1
1694928634,1
1695274234,1
1695360634,2
1695533434,1
1695619839,1
1696483842,15
1696570241,15
1696656645,12
1696743043,15
1696829444,15
1696915841,13
1697002242,13
1697088641,13
1697261447,13
1697347842,13
1697520642,11
1697607044,11
1697693444,12
1697866244,12
1697952644,12
1698211845,10
1698474646,12
1698561046,10
1698647445,10
1698733843,8
1698993045,17
1699079441,8
1699165843,8
1699252253,32
1699425038,6
1699597838,11
1699684239,6
1699770639,6
1699857040,6
1699943446,4
1700116239,4
1700202637,8
1700548240,2
1700721041,2
1700807441,8
1700893840,4
1700980240,4
