1661063442,1
1661092854,1
1661149842,11
1661179125,11
1661236366,14
1661265647,14
1661322641,7
1661352051,7
1661409162,14
1661438449,14
1661495561,15
1661524735,15
1661581964,13
1661611239,13
1661668363,3
1661697647,3
1661700049,3
1661754784,7
1661784048,7
1661870448,5
1661927560,17
1661956724,17
1662013964,3
1662043246,3
1662100359,2
1662129642,2
