1679584314,2
1679589759,2
1679596397,2
1679602819,2
1679607852,2
1679639432,2
1679981431,2
1680240629,2
1680845434,2
1682573432,2
1686288634,1
1687498241,6
1688016640,7
1688103041,7
1688275841,1
1688362240,6
1688535044,4
1688621445,3
1688707844,3
1688794245,3
1688880644,3
1688967042,3
1689053441,2
1689139840,2
1689226241,2
1689312653,2
1694323834,1
1700116239,1
1700202637,2
1700548240,1
1700721041,1
1700807441,2
1700893840,1
1700980240,1
