1645511492,16
1645597892,2
1645684232,2
1645770629,2
1645857150,2
1645943553,2
1646029893,2
1646116237,2
1646202760,2
1646289033,2
1646375551,2
1646461951,2
1646548229,2
1646634751,2
1646721161,2
1646807431,2
1646893952,2
1646980230,2
1647066751,2
1647153150,2
1647239550,2
1647325952,2
1647412352,2
1647498752,2
1647585151,2
1647757954,2
1647844355,2
1647930752,2
1648017150,2
1648103550,2
1648189831,2
1648276229,2
1648362752,2
1648449033,2
1648535442,2
1648621952,2
1648708231,2
1648794750,2
1648881149,2
1648967561,2
1649053832,2
1649140351,2
1649226751,2
1649313029,2
1649399549,2
1649485949,2
1649572354,2
1649658750,2
1649745150,2
1649831565,2
1649917950,2
1650004228,2
1650090628,2
1650177150,2
1650263549,2
1650349831,2
1650436229,2
1650522756,2
1650609163,2
1650695550,2
1650781953,2
1650868349,2
1650954630,2
1651041030,2
1651127552,2
1651213951,2
1651300352,2
1651386755,2
1651473034,2
1651559564,2
1651645850,2
1651732362,2
1651818753,2
1651905153,2
1651991564,2
1652077954,2
1652164360,2
1652250764,2
1652337032,2
1652423553,2
1652509832,2
1652596232,2
1652682759,2
1652769160,2
1652855561,2
1652941964,2
1653028353,2
1653114753,2
1653201159,2
1653287558,2
1653373954,2
1653460234,2
1653546755,2
1653633154,2
1653719553,2
1653805957,2
1653892236,2
1653978755,2
1654065033,2
1654151553,2
1654237831,2
1654324351,2
1654410631,2
1654497153,2
1654583555,2
1654669837,2
1654756356,2
1654842756,2
1654929156,2
1655015436,2
1655101838,2
1655274636,4
1655361158,2
1655447555,2
1655533836,2
1655620256,2
1655706645,2
1655793158,2
1655879557,2
1655965955,2
1656052365,2
1656138754,2
1656225155,2
1656311556,2
1656397956,2
1656484356,2
1656570758,2
1656829841,2
1656916357,2
1657002637,2
1657089163,2
1657175559,2
1657261838,2
1657348240,2
1657434758,2
1657521164,2
1657607566,2
1657693957,2
1657780357,2
1657803090,2
1657804447,2
1657809517,2
1657866760,10
1657896040,10
1657953158,4
1657982325,4
1658039438,4
1658068726,4
1658125843,4
1658155247,4
1658212362,4
1658241661,4
1658298758,4
1658328052,4
1658385041,4
1658414447,4
1658471560,4
1658500847,4
1658557962,4
1658587247,4
1658644360,4
1658673645,4
1658730762,4
1658760045,4
1658817160,4
1658846453,4
1658903439,4
1658932848,4
1658989840,4
1659019246,4
1659076365,4
1659105646,4
1659162770,4
1659192044,4
1659249159,4
1659278470,4
1659335565,4
1659364847,4
1659421963,4
1659451128,4
1659508368,4
1659537519,4
1659594767,4
1659624049,4
1659681160,4
1659710444,4
1659767561,4
1659796845,4
1659853840,4
1659883130,4
1659940369,4
1659969638,4
1660026647,4
1660056049,4
1660113163,4
1660142439,4
1660199441,4
1660228849,4
1660285970,4
1660315250,4
1660372250,4
1660401521,4
1660458761,4
1660488049,4
1660545162,4
1660574449,4
1660631564,4
1660660730,4
1660717841,4
1660747248,4
1660804362,4
1660833647,4
1660890760,4
1660920046,4
1660977162,4
1661006455,4
1661063442,4
1661092854,4
1661149842,4
1661179125,4
1661236366,4
1661265647,4
1661322641,4
1661352051,4
1661409162,4
1661438449,4
1661495561,4
1661524735,4
1661581964,4
1661611239,4
1661668363,4
1661697647,4
1661700049,4
1661754784,6
1661784048,6
1661870448,4
1661927560,4
1661956724,4
1662013964,4
1662043246,4
1662100359,2
1662129642,2
