1693114356,142
1693200777,188
1693287141,101
1693373568,195
1693459952,131
1693546364,235
1693632754,150
1693719144,129
1693805540,283
1693891949,373
1693978362,228
1694064749,19
1694151151,294
1694237547,167
1694323959,187
1694410362,58
1694496769,65
1694583178,1072
1694669562,536
1694755972,247
1694842363,155
1694928766,377
1695015165,884
1695187975,542
1695274380,129
1695360784,512
1695447164,1964
1695533586,169
1695619990,67
1695706406,256
1695792808,745
1695879218,309
1695965624,475
1696052011,167
1696138408,329
1696224807,297
1696311219,344
1696397621,159
