1657866760,11
1657896040,11
1657953158,114
1657982325,114
1658039438,129
1658068726,129
1658125843,143
1658155247,143
1658212362,123
1658241661,123
1658298758,150
1658328052,150
1658385041,191
1658414447,191
1658471560,357
1658500847,357
1658557962,162
1658587247,162
1658644360,118
1658673645,118
1658730762,124
1658760045,124
1658817160,306
1658846453,306
1658903439,308
1658932848,308
1658989840,287
1659019246,287
1659076365,727
1659105646,727
1659162770,185
1659192044,185
