1646807431,2
1646893952,3
1646980230,18
1647066751,2
1647153150,8
1647239550,1
1647325952,3
1647412352,3
1647498752,5
1647585151,6
1647757954,5
1647844355,6
1647930752,9
1648017150,5
1648103550,4
1648189831,3
1648276229,3
1648362752,4
1648449033,6
1648535442,2
1648621952,2
1648708231,2
