1642564885,2
1642651226,2
1642676514,2
1642805851,13
1643169628,27
1643342487,1
1643428827,5
1643688028,4
1643708607,4
1643774489,2
1643860889,2
1644033629,15
1644388289,46
1644407490,46
1644474692,1
1644493888,1
1644561030,1
1644647492,147
1644906689,91
1645252290,2
