1638158887,10
1638331638,25
1640145685,1
1640232083,1
1640491284,8
1640664024,2
1640750484,2
1640923223,21
1641268824,4
1641528084,104
1641700884,1
1641787224,5
1642478484,2
1642564885,2
1642805851,37
1643169628,39
1643256090,2
1643515288,1
1643688028,13
1643708607,13
1643860889,2
1643947288,15
1644120088,97
1644292831,46
1644321030,46
1644388289,1
1644407490,1
1644474692,1
1644493888,1
1644647492,8
1644906689,218
1644993090,2
1645079499,1
