1642769464,2
1642771512,2
1642805117,2
1642805834,2
1642824017,2
1642855092,7
1642910419,2
1642924636,2
1642934533,2
1642937831,2
1642996821,2
1643083221,2
1643169617,2
1643256019,2
1643342418,2
1643428818,2
1643515217,2
1643601623,2
1643622136,2
1643688017,2
1643708536,2
1643774418,2
1643860818,2
1643947216,2
1644033618,2
1644120017,2
1644206423,3
1644292820,2
1644321017,2
1644388216,3
1644407418,3
1644474619,2
1644493816,2
1644561017,5
1644647419,2
1644733822,2
1644770413,2
1644820219,2
1644906616,2
1644993017,2
1645079416,2
1645165816,2
1645252217,2
1645338616,2
1645425017,2
1645467072,2
1645470791,2
1645511417,3
1645597817,4
1645684217,2
1645770616,2
1645857016,2
1645943421,2
1646029817,3
1646116216,3
1646202626,2
1646289021,2
1646375417,2
1646461818,2
1646548217,2
1646634617,2
1646721028,2
1646807418,2
1646893818,2
1646980217,2
1647066619,2
1647153018,2
1647239417,2
1647325819,2
1647412220,2
1647498618,2
1647585017,2
1647757818,3
1647844218,2
1647930618,2
1648017017,2
1648103417,2
1648189818,9
1648276217,2
1648362619,1
1648449020,1
1648535417,1
1648621818,1
1648708217,1
1648794617,1
1649658616,2
1649917817,1
1650349817,1
1650436217,1
1650522617,1
1650609029,1
1650695416,8
1650781820,1
1650868217,1
1650954617,2
1651041017,1
1651127418,1
1651213817,7
1651300219,1
1651386622,1
1651473017,1
1651559421,1
1651645827,1
1651818617,2
1651991417,1
1652077818,1
1652164218,1
1652250621,1
1652423417,1
1652509817,1
1652596217,1
1652769018,1
1652855418,1
1653028217,1
1653201018,1
1653460218,1
1653546617,1
1653633018,2
1653719418,1
1653805821,1
1653892219,1
1654065018,1
1654151419,1
1654237818,1
1654324218,8
1654410618,3
1654497019,1
1654669819,1
1654756220,1
1654842619,1
1654929020,1
1655015420,1
1655101820,1
1655188220,1
1655361020,1
1655533820,1
1655620219,2
1655706620,1
1656311420,3
1657866623,1
1657895901,1
1661236224,7
1661265501,7
1661409023,1
1661438302,1
1663137032,1
1663828220,1
1663857500,1
1664519418,1
1664548696,1
1668350508,1
1668355650,1
1668356487,1
1668360366,1
