1636286412,142
1636286488,145
1636895594,2027
1636898490,2114
1636900709,2180
1637070326,2120
1637070818,2137
1637072812,3321
1637122028,3355
1637208446,3386
1637294806,3344
1637381227,3248
1637467621,3106
1637554087,3308
1637589848,3308
1637726914,3351
1637813369,3373
1638072517,3081
1638158887,3288
1638245235,3301
1638331638,3333
1639904549,3229
1639907950,3229
1639980923,3345
1639983233,3345
1639985995,3345
1640059226,3348
1640080313,3348
1640145685,3400
1640232083,3357
1640318424,2982
1640404823,3172
1640491284,3240
1640577691,3302
1640664024,3440
1640750484,3422
1640836884,3387
1640923223,3056
1641009626,2962
1641096084,3216
1641182484,3271
1641268824,3402
1641355224,3377
1641441684,3397
1641528084,3216
1641700884,3213
1641787224,3336
1641873686,3312
1642392088,2012
1642408942,2012
1642478484,3309
1642564885,3282
1642651226,3296
1642676514,3296
1642805851,3255
1642824026,3036
1642855125,3036
1642910490,3155
1642924655,3155
1642934565,3155
1642937864,3155
1642996892,3370
1643083292,3466
1643169628,3437
1643256090,3479
1643342487,3544
1643428827,3517
1643515288,3444
1643601634,3504
1643622207,3504
1643688028,3424
1643708607,3424
1643774489,3486
1643860889,3533
1643947288,3488
1644033629,3527
1644120088,3490
1644206493,3545
1644292831,3571
1644321030,3571
1644388289,3505
1644407490,3505
1644474692,3577
1644493888,3577
1644561030,3616
1644647492,3558
1644733834,3509
1644770508,3509
1644820292,3565
1644906689,3588
1644993090,3575
1645079499,3644
1645165829,3514
1645252290,3563
1645338629,3592
1645425030,3570
1645467113,3570
1645470826,3570
1645511492,3637
1645597892,3244
1645684232,3265
1645770629,3635
1645857150,3569
1645943553,3441
1646029893,3608
1646116237,3534
1646202760,3484
1646289033,3565
1646375551,3541
1646461951,3496
1646548229,3546
1646634751,3615
1646721161,3519
1646807431,3606
1646893952,3489
1646980230,3606
1647066751,3638
1647153150,3631
1647239550,3630
1647325952,3633
1647412352,3683
1647498752,3673
1647585151,3690
1647757954,3634
1647844355,2789
1647930752,1540
1648017150,1454
1648103550,1451
1648189831,1441
1648276229,1441
1648362752,1441
1648449033,1441
1648535442,1444
1648621952,1441
1648708231,1440
1648794750,1441
1648881149,1441
1648967561,1441
1649053832,1441
1649140351,1441
1649226751,1440
1649313029,1441
1649399549,1441
1649485949,1441
1649572354,1441
1649658750,2228
1649745150,2881
1649831565,2881
1649917950,2881
1650004228,2881
1650090628,2881
1650177150,2881
1650263549,2881
1650349831,2881
1650436229,2881
1650522756,2881
1650609163,2881
1650695550,2881
1650781953,2881
1650868349,2881
1650954630,2881
1651041030,2881
1651127552,2881
1651213951,2881
1651300352,2881
1651386755,2881
1651473034,2881
1651559564,2881
1651645850,2881
1651732362,2881
1651818753,2881
1651905153,2881
1651991564,2881
1652077954,2881
1652164360,2881
1652250764,2881
1652337032,2881
1652423553,2881
1652509832,2879
1652596232,2881
1652682759,2881
1652769160,2881
1652855561,2882
1652941964,2881
1653028353,2880
1653114753,2881
1653201159,2881
1653287558,2881
1653373954,2881
1653460234,2881
1653546755,2881
1653633154,2881
1653719553,2881
1653805957,2881
1653892236,2880
1653978755,2882
1654065033,2881
1654151553,2881
1654237831,2881
1654324351,2881
1654410631,2881
1654497153,2881
1654583555,2881
1654669837,2881
1654756356,2881
1654842756,2881
1654929156,2881
1655015436,2881
1655101838,2880
1655188357,2881
1655274636,2881
1655361158,2881
1655447555,2881
1655533836,2880
1655620256,2881
1655706645,2883
1655793158,2881
1655879557,2881
1655965955,1950
1656052365,1441
1656138754,1441
1656225155,1441
1656311556,1439
1656397956,1441
1656484356,1441
1656570758,1438
1656743558,1440
1656829841,1441
1656916357,1441
1657002637,1441
1657089163,1441
1657175559,1441
1657261838,1441
1657348240,1441
1657434758,1441
1657521164,1441
1657607566,1441
1657693957,1441
1657780357,1441
1657803090,1441
1657804447,1441
1657809517,1441
1657866760,1445
1657896040,1445
1657953158,1441
1657982325,1441
1658039438,1442
1658068726,1442
1658125843,1442
1658155247,1442
1658212362,1442
1658241661,1442
1658298758,1442
1658328052,1442
1658385041,1441
1658414447,1441
1658471560,1442
1658500847,1442
1658557962,1442
1658587247,1442
1658644360,1442
1658673645,1442
1658730762,1442
1658760045,1442
1658817160,1442
1658846453,1442
1658903439,1442
1658932848,1442
1658989840,1442
1659019246,1442
1659076365,1442
1659105646,1442
1659162770,1442
1659192044,1442
1659249159,1442
1659278470,1442
1659335565,1442
1659364847,1442
1659421963,1442
1659451128,1442
1659508368,1442
1659537519,1442
1659594767,1442
1659624049,1442
1659681160,1442
1659710444,1442
1659767561,1442
1659796845,1442
1659853840,1442
1659883130,1442
1659940369,1442
1659969638,1442
1660026647,1441
1660056049,1441
1660113163,1441
1660142439,1441
1660199441,1442
1660228849,1442
1660285970,1442
1660315250,1442
1660372250,1442
1660401521,1442
1660458761,1442
1660488049,1442
1660545162,1442
1660574449,1442
1660631564,1442
1660660730,1442
1660717841,1442
1660747248,1442
1660804362,1442
1660833647,1442
1660890760,1442
1660920046,1442
1660977162,1442
1661006455,1442
1661063442,1442
1661092854,1442
1661149842,1442
1661179125,1442
1661236366,1442
1661265647,1442
1661322641,1442
1661352051,1442
1661409162,1442
1661438449,1442
1661495561,1442
1661524735,1442
1661581964,1442
1661611239,1442
1661668363,1442
1661697647,1442
1661700049,1442
1661754784,1443
1661784048,1443
1661870448,1442
1661927560,1442
1661956724,1442
1662013964,1442
1662043246,1442
1662100359,1442
1662129642,1442
1662186760,1442
1662216045,1442
1662273039,1442
1662302447,1442
1662359559,1442
1662388727,1442
1662445958,1442
1662475124,1442
1662532358,1442
1662561643,1442
1662618758,1442
1662647931,1442
1662705164,1442
1662734437,1442
1662791558,1442
1662820724,1442
1662877847,1442
1662907237,1442
1662964357,1442
1662993645,1442
1663050638,1441
1663080057,1441
1663137169,1442
1663166448,1442
1663223564,1442
1663252844,1442
1663309969,1442
1663339237,1442
1663396358,1442
1663425653,1442
1663482759,1442
1663512042,1442
1663569159,1442
1663598447,1442
1663655565,1442
1663684725,1442
1663741840,1442
1663771124,1442
1663828239,1442
1663857524,1442
1663914640,1442
1663943934,1442
1664001039,1442
1664030318,1442
1664087438,1442
1664116722,1442
1664173842,1442
1664203127,1442
1664260251,1442
1664289537,1442
1664346641,1442
1664375951,1442
1664433041,1442
1664462320,1442
1664519554,1442
1664548711,1442
1664605833,1442
1664635111,1442
1668081545,1440
1668350533,1440
1668355972,1440
1668356757,1440
1668360810,1440
1668474184,1440
1668560577,1441
1668646979,1441
1671629111,1440
1671630664,1440
1671632450,1440
1671634011,1440
1673516775,1441
1674367285,1441
1674455475,1441
1674541884,1441
1674628285,1425
1674714694,1441
1674801082,1441
1674887480,1441
1674973872,1441
1675060281,1441
1675146682,1440
1675233071,1441
1675319481,1441
1675405883,1440
1675492281,1441
1675578681,1441
1675665075,1441
1675751474,1451
1675837863,777
1676356254,1440
1676442661,1440
1676529061,1441
1676615450,1441
1676701857,1441
1676788249,1441
1676874662,1441
1676961061,1441
1677047454,1441
1677133857,1441
1677220262,1441
1677306660,1441
1677393061,1441
1677479458,1441
1677565859,1441
1677652257,2196
1677738657,1441
1677825057,1441
1677911460,1441
1677997847,1441
1678084257,1441
1678170666,1437
1678257055,1442
1678343445,1454
1679569142,1442
1679584407,1442
1679589867,1442
1679596494,1442
1679602915,1442
1679607956,1442
1679639532,1449
1679722309,1441
1679808717,1441
1679895117,827
1679981518,1441
1680067912,1441
1680154308,1689
1680240714,2893
1680327097,2861
1680413504,2866
1680499902,2908
1680586299,2864
1680672702,2882
1680759104,2885
1680845523,2881
1680931899,2881
1681018301,2881
1681104713,2881
1681191117,2822
1681277516,2858
1681363906,2849
1681450306,2881
1681536706,2881
1681623105,2881
1681709528,2881
1681795909,2881
1681882326,2883
1681968706,2881
1682055103,2881
1682141505,2881
1682227910,2882
1682314324,2881
1682400707,2881
1682487105,2881
1682573524,2881
1682659898,2881
1682746309,2881
1682832700,2881
1682919107,2881
1683005499,2888
1683091901,2891
1683178309,2322
1683264713,1441
1683351101,1440
1683437506,1440
1683523904,1440
1683610328,1442
1683696716,1440
1683783116,1440
1683869508,1439
1683955918,1439
1684042308,1440
1685544777,1437
1685597496,1437
1685683902,1439
1685770303,1439
1685856701,1438
1685943100,1440
1686029502,1439
1686115904,1439
1686202306,1438
1686288711,1439
1686375108,1438
1686461512,1438
1686547909,522
1686634309,3
1686720704,2
1686807105,2
1686893562,2
1686979954,2
1687066360,2
1687152774,2
1687239150,2
1687411953,2
1687498393,2
1687584774,2
1687671173,2
1687757568,2
1687843969,2
1687930377,2
1688016807,2
1688103218,2
1688189597,2
1688275996,2
1688362412,2
1688535215,2
1688621614,2
1688708029,2
1688794420,2
1688880821,2
1688967219,2
1689053626,2
1689140028,2
1689226424,2
1689312837,2
1689399195,2
1689485597,2
1689572000,2
1689658397,2
1689744807,2
1689831241,2
1689917640,2
1690004042,2
1690090404,2
1690176817,2
1690263240,2
1690349617,2
1690436012,2
1690522443,2
1690608808,2
1690695212,2
1690781617,2
1690868047,2
1690954421,2
1691040818,2
1691127250,2
1691213630,2
1691300015,2
1691386395,2
1691472821,2
1691559206,2
1691645653,2
1691732035,2
1691818443,2
1691904834,2
1691991184,2
1692077570,2
1692163972,2
1692250382,2
1692336773,2
1692423180,2
1692509573,2
1692595944,2
1692682368,2
1692768764,2
1692855167,2
1692941568,2
1693027980,2
1693114356,2
1693200777,2
1693287141,2
1693373568,2
1693459952,2
1693546364,2
1693632754,2
1693719144,2
1693805540,2
1693891949,2
1693978362,2
1694064749,2
1694151151,2
1694237547,2
1694323959,2
1694410362,2
1694496769,2
1694583178,2
1694669562,2
1694755972,2
1694842363,2
1694928766,2
1695015165,2
1695187975,2
1695274380,2
1695360784,2
1695447164,2
1695533586,2
1695619990,4
1695706406,2
1695792808,3
1695879218,2
1695965624,2
1696052011,2
1696138408,2
1696224807,2
1696311219,2
1696397621,2
1696484041,2
1696570435,2
1696656841,2
1696743237,2
1696829644,2
1696916048,2
1697002439,2
1697088838,2
1697175238,2
1697261644,2
1697348050,2
1697434425,2
1697520844,2
1697607247,2
1697693651,2
1697780021,2
1697866447,2
1697952848,2
1698039229,2
1698125641,2
1698212053,2
1698298423,2
1698384826,2
1698474862,2
1698561261,2
1698647660,2
1698734051,2
1698820440,2
1698906836,2
1698993260,2
1699079643,2
1699166057,2
1699252467,2
1699338847,2
1699425254,2
1699511642,2
1699598052,4
1699684453,2
1699770845,2
1699857241,2
1699943653,2
1700030030,2
1700116443,2
1700202865,2
1700289223,2
1700375637,2
1700462021,2
1700548451,2
1700634836,2
1700721246,2
1700807657,2
1700894058,2
1700980458,2
