1662100359,1
1662129642,1
1662186760,19
1662216045,19
1662273039,15
1662302447,15
1662359559,24
1662388727,24
1662445958,22
1662475124,22
1662532358,7
1662561643,7
1662618758,13
1662647931,13
1662705164,13
1662734437,13
1662791558,10
1662820724,10
1662877847,4
1662907237,4
