1662100359,7
1662129642,7
1662186760,98
1662216045,98
1662273039,198
1662302447,198
1662359559,239
1662388727,239
1662445958,272
1662475124,272
1662532358,113
1662561643,113
1662618758,238
1662647931,238
1662705164,103
1662734437,103
1662791558,124
1662820724,124
1662877847,42
1662907237,42
