1663396358,12
1663425653,12
1663482759,175
1663512042,175
1663569159,312
1663598447,312
1663655565,113
1663684725,113
1663741840,235
1663771124,235
1663828239,119
1663857524,119
1663914640,96
1663943934,96
1664001039,107
1664030318,107
1664087438,96
1664116722,96
1664173842,117
1664203127,117
1664260251,109
1664289537,109
1664346641,255
1664375951,255
1664433041,105
1664462320,105
1664519554,113
1664548711,113
1664605833,98
1664635111,98
