1688016807,3
1688103218,7
1688189597,17
1688275996,7
1688362412,6
1688535215,8
1688621614,5
1688708029,14
1688794420,16
1688880821,13
1688967219,7
1689053626,25
1689140028,6
1689226424,7
1689312837,4
1689399195,4
1689485597,2
1689572000,2
1689658397,1
1689744807,8
1689831241,16
1689917640,1
1690004042,2
1690090404,3
1690176817,5
1690263240,3
1690349617,10
1690436012,8
