1639904549,16
1639907950,16
1639980923,32
1639983233,32
1639985995,32
1640059226,13
1640080313,13
1640145685,15
1640232083,17
1640318424,20
1640404823,23
1640491284,13
1640577691,12
1640664024,29
1640750484,15
1640836884,20
1640923223,11
1641009626,9
