1680327097,13
1680413504,19
1680499902,33
1680586299,28
1680672702,21
1680759104,21
1680845523,19
1680931899,24
1681018301,22
1681104713,16
1681191117,19
1681277516,18
1681363906,24
1681450306,23
1681536706,19
1681623105,27
1681709528,20
1681795909,28
1681882326,23
1681968706,22
1682055103,28
1682141505,26
1682227910,25
1682314324,33
1682400707,35
1682487105,21
1682573524,20
1682659898,21
1682746309,24
1682832700,22
1682919107,18
1683005499,3
1683091901,25
1683178309,22
1683264713,25
1683351101,25
1683437506,20
1683523904,24
1683610328,19
1683696716,23
1683783116,23
1683869508,24
1683955918,94
1684042308,23
