1646807431,211
1646893952,131
1646980230,243
1647066751,223
1647153150,177
1647239550,592
1647325952,149
1647412352,148
1647498752,265
1647585151,183
1647757954,150
1647844355,136
1647930752,118
1648017150,272
1648103550,171
1648189831,189
1648276229,155
1648362752,263
1648449033,148
1648535442,160
1648621952,159
1648708231,171
1648794750,274
1648881149,229
