1693719144,6
1693805540,2
1693891949,8
1693978362,15
1694064749,6
1694151151,5
1694237547,3
1694323959,7
1694410362,19
1694496769,13
1694583178,9
1694669562,2
1694755972,11
1694842363,3
1694928766,4
1695015165,6
1695187975,10
1695274380,3
1695447164,4
1695533586,6
