1688707844,1
1688794245,1
1688967042,1
1689053441,1
1689139840,1
1689226241,1
1689312653,1
1689831044,1
1689917446,1
1690003846,1
1690263047,1
1690435846,1
1690522245,1
1691818247,1
1691904646,1
1691991040,1
1692077440,1
1692163831,1
1692250233,1
1692336633,1
1692423035,1
1692509432,1
1692682233,1
1692768633,1
1692855035,1
1692941433,1
1693027839,1
1693114233,1
1693200633,1
1694755834,1
1694842234,1
1694928634,1
1695274234,1
1695360634,1
1695533434,1
1695619839,1
