1693632754,52
1693719144,81
1693805540,162
1693891949,372
1693978362,141
1694064749,80
1694151151,326
1694237547,91
1694323959,202
1694410362,46
1694496769,118
1694583178,956
1694669562,288
1694755972,204
1694842363,126
1694928766,264
1695015165,172
