1639904549,4
1639907950,4
1639980923,7
1639983233,7
1639985995,7
1640059226,3
1640080313,3
1640145685,3
1640232083,4
1640318424,4
1640404823,2
1640491284,9
1640577691,4
1640664024,7
1640750484,5
1640836884,2
1640923223,3
1641009626,4
