1680327097,30
1680413504,72
1680499902,45
1680586299,57
1680759104,39
1680845523,49
1680931899,71
1681018301,60
1681104713,73
1681191117,56
1681277516,55
1681363906,56
1681450306,40
1681536706,72
1681623105,54
1681709528,68
1681795909,67
1681882326,23
1681968706,78
1682055103,50
1682141505,57
1682227910,57
1682314324,62
1682400707,74
1682487105,75
1682573524,53
1682659898,40
1682746309,64
1682832700,44
1682919107,37
1683005499,59
