1651386755,179
1651473034,196
1651559564,129
1651645850,129
1651732362,151
1651818753,139
1651905153,188
1651991564,403
1652077954,126
1652164360,207
1652250764,160
1652337032,170
1652423553,235
1652509832,666
1652596232,179
1652682759,73
