1696484041,11
1696570435,25
1696656841,27
1696743237,11
1696829644,18
1696916048,30
1697002439,9
1697088838,15
1697175238,13
1697261644,28
1697348050,23
1697434425,24
1697520844,17
1697607247,22
1697693651,9
1697780021,12
1697866447,23
1697952848,19
1698039229,22
1698125641,35
1698212053,18
1698298423,23
1698384826,9
1698474862,18
1698561261,55
1698647660,26
1698734051,17
1698820440,29
1698906836,18
1698993260,34
1699079643,20
1699166057,19
1699252467,14
1699338847,30
1699425254,12
1699511642,7
1699598052,21
1699684453,15
1699770845,20
1699857241,18
1699943653,22
1700030030,17
1700116443,6
