1646548229,12
1646634751,120
1646721161,100
1646807431,108
1646893952,115
1646980230,571
1647066751,128
1647153150,415
1647239550,117
1647325952,175
1647412352,261
1647498752,152
1647585151,172
1647757954,143
1647844355,197
1647930752,155
1648017150,337
1648103550,377
1648189831,134
1648276229,245
1648362752,157
1648449033,157
1648535442,153
1648621952,171
1648708231,165
1648794750,386
1648881149,170
1648967561,401
1649053832,141
1649140351,191
1649226751,138
