1660717841,18
1660747248,18
1660804362,4
1660833647,4
1660890760,4
1660920046,4
1660977162,4
1661006455,4
1661063442,4
1661092854,4
1661149842,4
1661179125,4
1661236366,4
1661265647,4
1661322641,4
1661352051,4
1661409162,4
1661438449,4
1661495561,4
1661524735,4
1661581964,4
1661611239,4
1661668363,4
1661697647,4
1661700049,4
1661754784,6
1661784048,6
1661870448,4
1661927560,4
1661956724,4
1662013964,6
1662043246,6
1662100359,4
1662129642,4
1662186760,4
1662216045,4
1662273039,4
1662302447,4
1662359559,4
1662388727,4
1662445958,4
1662475124,4
1662532358,7
1662561643,7
1662618758,4
1662647931,4
1662705164,4
1662734437,4
1662791558,4
1662820724,4
1662877847,4
1662907237,4
1662964357,4
1662993645,4
1663050638,4
1663080057,4
1663137169,4
1663166448,4
1663223564,4
1663252844,4
1663309969,4
1663339237,4
1663396358,4
1663425653,4
1663482759,4
1663512042,4
1663569159,4
1663598447,4
1663655565,4
1663684725,4
1663741840,4
1663771124,4
1663828239,8
1663857524,8
1663914640,4
1663943934,4
1664001039,4
1664030318,4
1664087438,4
1664116722,4
1664173842,4
1664203127,4
1664260251,4
1664289537,4
1664346641,4
1664375951,4
1664433041,4
1664462320,4
1664519554,4
1664548711,4
1664605833,4
1664635111,4
1668560577,2
1668646979,2
1673516775,15
1675060281,9
1675751474,21
1675837863,3
1676356254,1
1676442661,511
1676529061,1705
1676615450,2338
1676701857,2141
1676788249,2012
1676874662,2290
1676961061,2206
1677047454,2122
1677133857,2372
1677220262,3873
1677306660,2757
1677393061,2560
1677479458,3156
1677565859,3091
1677652257,4640
1677738657,3297
1677825057,3077
1677911460,2499
1677997847,2578
1678084257,3263
1678170666,3249
1678257055,3208
1678343445,3002
1679569142,2258
1679584407,2258
1679589867,2258
1679596494,2258
1679602915,2258
1679607956,2258
1679639532,2226
1679722309,1981
1679808717,1967
1679895117,1421
1679981518,2277
1680067912,2334
1680154308,2490
1680240714,3612
1680327097,3407
1680413504,3388
1680499902,3833
1680586299,3826
1680672702,3743
1680759104,4199
1680845523,3461
1680931899,3347
1681018301,3405
1681104713,3433
1681191117,3787
1681277516,3857
1681363906,3755
1681450306,3751
1681536706,3352
1681623105,3404
1681709528,3832
1681795909,3812
1681882326,3874
1681968706,3852
1682055103,3697
1682141505,3572
1682227910,3563
1682314324,3930
1682400707,4063
1682487105,3973
1682573524,4020
1682659898,3788
1682746309,3421
1682832700,3514
1682919107,3688
1683005499,3836
1683091901,3946
1683178309,3877
1683264713,3906
1683351101,3402
1683437506,3440
1683523904,3924
1683610328,3852
1683696716,3671
1683783116,3877
1683869508,3848
1683955918,3432
1684042308,3708
1685544777,3900
1685597496,3920
1685683902,3833
1685770303,3403
1685856701,3601
1685943100,3700
1686029502,3416
1686115904,3836
1686202306,3933
1686288711,3877
1686375108,3517
1686461512,3431
1686547909,3661
1686634309,3650
1686720704,3811
1686807105,3926
1686893562,3732
1686979954,3424
1687066360,3461
1687152774,3721
1687239150,4050
1687411953,3924
1687498393,3471
1687584774,3483
1687671173,3414
1687757568,3956
1687843969,4050
1687930377,3697
1688016807,3826
1688103218,3722
1688189597,3477
1688275996,3464
1688362412,3866
1688535215,3913
1688621614,3740
1688708029,3723
1688794420,3422
1688880821,3469
1688967219,3679
1689053626,3583
1689140028,3765
1689226424,3731
1689312837,3690
1689399195,3330
1689485597,3425
1689572000,4001
1689658397,3683
1689744807,3662
1689831241,3521
1689917640,3565
1690004042,3436
1690090404,3309
1690176817,3714
1690263240,3725
1690349617,3593
1690436012,3547
1690522443,3031
1690608808,2028
1690695212,2017
1690781617,2145
1690868047,2322
1690954421,2922
1691040818,3639
1691127250,3538
1691213630,3441
1691300015,3466
1691386395,3518
1691472821,3725
1691559206,3829
1691645653,3748
1691732035,3584
1691818443,3407
1691904834,3534
1691991184,3724
1692077570,3681
1692163972,3735
1692250382,3871
1692336773,3690
1692423180,3417
1692509573,3434
1692595944,1142
1692682368,3721
1692768764,3859
1692855167,3749
1692941568,3756
1693027980,3439
1693114356,3424
1693200777,3791
1693287141,2719
1693373568,3693
1693459952,3782
1693546364,3861
1693632754,3411
1693719144,3449
1693805540,3953
1693891949,3730
1693978362,3805
1694064749,3943
1694151151,3860
1694237547,3420
1694323959,3462
1694410362,3518
1694496769,3844
1694583178,3765
1694669562,3819
1694755972,3711
1694842363,3462
1694928766,3430
1695015165,3791
1695187975,3781
1695274380,3688
1695360784,3761
1695447164,3433
1695533586,3426
1695619990,3688
1695706406,3933
1695792808,3911
1695879218,3829
1695965624,3725
1696052011,3448
1696138408,3491
1696224807,3828
1696311219,3773
1696397621,3810
1696484041,3851
1696570435,3893
1696656841,3457
1696743237,3458
1696829644,3745
1696916048,4116
1697002439,4046
1697088838,3753
1697175238,3879
1697261644,3612
1697348050,3462
1697434425,3891
1697520844,3764
1697607247,3679
1697693651,3733
1697780021,3757
1697866447,3466
1697952848,3508
1698039229,3691
1698125641,3727
1698212053,3711
1698298423,3811
1698384826,3765
1698474862,3449
1698561261,3455
1698647660,3757
1698734051,3793
1698820440,3869
1698906836,3793
1698993260,3769
1699079643,3387
1699166057,3457
1699252467,3792
1699338847,3811
1699425254,3815
1699511642,3734
1699598052,3654
1699684453,3439
1699770845,3446
1699857241,3694
1699943653,3825
1700030030,3774
1700116443,3763
1700202865,3681
1700289223,3470
1700375637,3498
1700462021,3843
1700548451,3822
1700634836,3940
1700721246,3843
1700807657,3764
1700894058,3578
1700980458,3551
