1688016640,1
1688103041,1
1691127048,1
1691645448,1
1691818247,1
1691904646,1
1691991040,1
1692682233,1
1692768633,1
1692855035,1
1692941433,1
1693027839,1
1693114233,1
1693200633,1
1693978232,1
1694323834,2
1696483842,1
1696570241,1
1696656645,1
1696743043,1
1696829444,1
1699597838,2
1699684239,1
1699770639,1
1700116239,2
1700202637,4
1700548240,1
1700807441,2
1700893840,1
1700980240,1
