1686375108,12
1686461512,27
1686547909,30
1686634309,14
1686720704,19
1686807105,42
1686893562,29
1686979954,28
1687066360,24
1687152774,38
1687239150,29
1687411953,25
1687498393,25
1687584774,29
1687671173,33
1687757568,31
1687843969,21
1687930377,16
1688016807,15
1688103218,6
1688189597,19
1688275996,26
1688362412,18
1688535215,18
1688621614,22
1688708029,28
1688794420,27
1688880821,30
1688967219,30
1689053626,27
1689140028,34
1689226424,14
1689312837,27
1689399195,23
1689485597,12
