1663137169,4
1663166448,4
1663223564,19
1663252844,19
1663309969,1
1663339237,1
1663396358,6
1663425653,6
1663482759,4
1663512042,4
1663569159,3
1663598447,3
1663655565,5
1663684725,5
1663741840,6
1663771124,6
1663828239,2
1663857524,2
1663914640,6
1663943934,6
1664001039,5
1664030318,5
1664087438,5
1664116722,5
1664173842,8
1664203127,8
1664260251,8
1664289537,8
1664346641,20
1664375951,20
1664433041,2
1664462320,2
1664519554,17
1664548711,17
1664605833,3
1664635111,3
