1679584314,1
1679589759,1
1679596397,1
1679602819,1
1679607852,1
1679639432,1
1679981431,1
1680845434,1
1682919034,1
1683610233,1
1691645448,1
1691731846,1
1691818247,1
1691904646,1
1691991040,1
1699425038,1
1699597838,2
1699684239,1
1699770639,1
1699943446,1
1700116239,1
1700202637,2
