1663914640,194
1663943934,194
1664001039,90
1664030318,90
1664087438,116
1664116722,116
1664173842,174
1664203127,174
1664260251,106
1664289537,106
1664346641,55
1664375951,55
1664433041,205
1664462320,205
1664519554,122
1664548711,122
1664605833,179
1664635111,179
