1640923223,5
1641009626,6
1641096084,3
1641182484,13
1641268824,15
1641355224,15
1641441684,19
1641528084,23
1641700884,12
1641787224,26
1641873686,23
1642305627,17
1642319122,17
1642392088,11
1642408942,11
1642478484,16
