1658212362,7
1658241661,7
1658298758,17
1658328052,17
1658385041,5
1658414447,5
1658471560,13
1658500847,13
1658557962,4
1658587247,4
1658644360,16
1658673645,16
1658730762,20
1658760045,20
1658817160,11
1658846453,11
1658903439,12
1658932848,12
1658989840,6
1659019246,6
1659076365,9
1659105646,9
1659162770,8
1659192044,8
1659249159,12
1659278470,12
1659335565,15
1659364847,15
1659421963,16
1659451128,16
1659508368,6
1659537519,6
1659594767,9
1659624049,9
1659681160,10
1659710444,10
1659767561,8
1659796845,8
1659853840,14
1659883130,14
1659940369,12
1659969638,12
1660026647,9
1660056049,9
1660113163,9
1660142439,9
1660199441,6
1660228849,6
1660285970,6
1660315250,6
1660372250,12
1660401521,12
1660458761,6
1660488049,6
1660545162,11
1660574449,11
1660631564,4
1660660730,4
1660717841,5
1660747248,5
1660804362,6
1660833647,6
