1652941964,6
1653028353,449
1653114753,219
1653201159,205
1653287558,105
1653373954,119
1653460234,144
1653546755,255
1653633154,140
1653719553,173
1653805957,228
1653892236,340
1653978755,132
1654065033,112
1654151553,139
1654237831,174
1654324351,262
1654410631,327
1654497153,279
1654583555,157
1654669837,152
1654756356,202
1654842756,167
1654929156,132
1655015436,304
1655101838,175
1655274636,239
1655361158,116
1655447555,164
1655533836,155
1655620256,16
