1656916357,6
1657002637,29
1657089163,31
1657175559,35
1657261838,39
1657348240,32
1657434758,45
1657521164,41
1657607566,36
1657693957,43
1657780357,33
1657803090,33
1657804447,33
1657809517,33
1657866760,38
1657896040,38
1657953158,35
1657982325,35
1658039438,32
1658068726,32
1658125843,32
1658155247,32
1658212362,20
1658241661,20
1658298758,30
1658328052,30
1658385041,56
1658414447,56
1658471560,38
1658500847,38
1658557962,32
1658587247,32
1658644360,21
1658673645,21
1658730762,27
1658760045,27
1658817160,26
1658846453,26
1658903439,39
1658932848,39
1658989840,29
1659019246,29
1659076365,47
1659105646,47
1659162770,31
1659192044,31
1659249159,32
1659278470,32
1659335565,35
1659364847,35
1659421963,55
1659451128,55
1659508368,24
1659537519,24
