1659508368,10
1659537519,10
1659594767,4
1659624049,4
1659681160,6
1659710444,6
1659767561,12
1659796845,12
1659853840,4
1659883130,4
1659940369,11
1659969638,11
1660026647,8
1660056049,8
1660113163,8
1660142439,8
1660199441,7
1660228849,7
1660285970,8
1660315250,8
1660372250,10
1660401521,10
1660458761,9
1660488049,9
1660545162,9
1660574449,9
1660631564,8
1660660730,8
1660717841,3
1660747248,3
1660804362,4
1660833647,4
1660890760,7
1660920046,7
1660977162,7
1661006455,7
1661063442,5
1661092854,5
1661149842,7
1661179125,7
1661236366,8
1661265647,8
1661322641,15
1661352051,15
1661409162,11
1661438449,11
1661495561,17
1661524735,17
1661581964,17
1661611239,17
1661668363,4
1661697647,4
1661700049,4
1661754784,14
1661784048,14
1661870448,5
1661927560,8
1661956724,8
1662013964,4
1662043246,4
1662100359,2
1662129642,2
