1655706645,59
1655793158,101
1655879557,140
1655965955,293
1656052365,288
1656138754,139
1656225155,340
1656311556,187
1656397956,117
1656484356,99
1656570758,151
1656743558,321
1656829841,191
1656916357,131
1657002637,40
