1650349831,4
1650436229,12
1650522756,7
1650609163,8
1650695550,17
1650781953,15
1650868349,13
1650954630,16
1651041030,26
1651127552,23
1651213951,21
1651300352,26
1651386755,29
1651473034,28
1651559564,15
1651645850,19
