1689572000,4
1689831241,2
1689917640,3
1690090404,2
1690263240,4
1690781617,2
1691386395,1
1691472821,4
1691645653,4
1691818443,1
1691904834,2
1691991184,1
1692077570,5
1692336773,21
1692423180,28
1692595944,5
1693200777,39
1693373568,2
1693719144,2
1694323959,3
1694496769,66
1694842363,2
1694928766,1
1695015165,2
1695619990,879
1695792808,4
1695965624,4
1696829644,2
1697088838,2
1697348050,452
1697434425,36
1697693651,2
1697952848,2
1698474862,2
1698647660,12
1698734051,22
1699425254,2
