1656916357,11
1657002637,13
1657089163,6
1657175559,21
1657261838,16
1657348240,6
1657434758,13
1657521164,10
1657607566,8
1657693957,7
1657780357,21
1657803090,21
1657804447,21
1657809517,21
1657866760,8
1657896040,8
1657953158,10
1657982325,10
1658039438,10
1658068726,10
1658125843,11
1658155247,11
1658212362,4
1658241661,4
1658298758,8
1658328052,8
1658385041,9
1658414447,9
1658471560,19
1658500847,19
1658557962,6
1658587247,6
1658644360,12
1658673645,12
1658730762,17
1658760045,17
1658817160,16
1658846453,16
1658903439,7
1658932848,7
1658989840,13
1659019246,13
1659076365,14
1659105646,14
1659162770,6
1659192044,6
1659249159,9
1659278470,9
1659335565,14
1659364847,14
1659421963,5
1659451128,5
1659508368,8
1659537519,8
