1679584314,13
1679589759,13
1679596397,13
1679602819,13
1679607852,13
1679639432,15
1679981431,10
1680240629,12
1680845434,13
1682227834,1
1682573432,2
1683437432,12
1683610233,13
1686288634,4
1687066239,1
