1636286412,600
1636286488,613
1636895594,6525
1636898490,6965
1636900709,7272
1637070326,6692
1637070818,6772
1637072812,11795
1637122028,11861
1637208446,12584
1637294806,12108
1637381227,11211
1637467621,10984
1637554087,14130
1637589848,14130
1637726914,11607
1637813369,11924
1638072517,10897
1638158887,11759
1638245235,12555
1638331638,12193
1639904549,10857
1639907950,10857
1639980923,11236
1639983233,11236
1639985995,11236
1640059226,10960
1640080313,10960
1640145685,11168
1640232083,11114
1640318424,11356
1640404823,11618
1640491284,10883
1640577691,10992
1640664024,11308
1640750484,11147
1640836884,10958
1640923223,10750
1641009626,10965
1641096084,10844
1641182484,11094
1641268824,11116
1641355224,10912
1641441684,10893
1641528084,11019
1641700884,10957
1641787224,11262
1641873686,11169
1642392088,8031
1642408942,8031
1642478484,11578
1642564885,11676
1642651226,12449
1642676514,12449
1642805851,11630
1642824026,11202
1642855125,11202
1642910490,11014
1642924655,11014
1642934565,11014
1642937864,11014
1642996892,11815
1643083292,11662
1643169628,11737
1643256090,11846
1643342487,11535
1643428827,10895
1643515288,11266
1643601634,12037
1643622207,12037
1643688028,11535
1643708607,11535
1643774489,12096
1643860889,11693
1643947288,11552
1644033629,11157
1644120088,11093
1644206493,11545
1644292831,14158
1644321030,14158
1644388289,12277
1644407490,12277
1644474692,12648
1644493888,12648
1644561030,12039
1644647492,11000
1644733834,11206
1644770508,11206
1644820292,11924
1644906689,11915
1644993090,12054
1645079499,11694
1645165829,12440
1645252290,11197
1645338629,11066
1645425030,11882
1645467113,11882
1645470826,11882
1645511492,12771
1645597892,12251
1645684232,11774
1645770629,13262
1645857150,12848
1645943553,12597
1646029893,14362
1646116237,14023
1646202760,14608
1646289033,13894
1646375551,13910
1646461951,13778
1646548229,12997
1646634751,13478
1646721161,13670
1646807431,14672
1646893952,13586
1646980230,13405
1647066751,12902
1647153150,12772
1647239550,13635
1647325952,13348
1647412352,13220
1647498752,13497
1647585151,13782
1647757954,12716
1647844355,13221
1647930752,13746
1648017150,13606
1648103550,12890
1648189831,13038
1648276229,12980
1648362752,12712
1648449033,13633
1648535442,13986
1648621952,13184
1648708231,14070
1648794750,13978
1648881149,13095
1648967561,13310
1649053832,13589
1649140351,14420
1649226751,13297
1649313029,13347
1649399549,14204
1649485949,13163
1649572354,12874
1649658750,17381
1649745150,19329
1649831565,19752
1649917950,18906
1650004228,19399
1650090628,18835
1650177150,19394
1650263549,18613
1650349831,19335
1650436229,19308
1650522756,19665
1650609163,19194
1650695550,19102
1650781953,19142
1650868349,19073
1650954630,19694
1651041030,19502
1651127552,20095
1651213951,19213
1651300352,18968
1651386755,18912
1651473034,25939
1651559564,19074
1651645850,19108
1651732362,19764
1651818753,19707
1651905153,18790
1651991564,18600
1652077954,18841
1652164360,19235
1652250764,19185
1652337032,19169
1652423553,21288
1652509832,18764
1652596232,19952
1652682759,17374
1652769160,16033
1652855561,16225
1652941964,16412
1653028353,16499
1653114753,15937
1653201159,15948
1653287558,16437
1653373954,16101
1653460234,16717
1653546755,15929
1653633154,15828
1653719553,17246
1653805957,16022
1653892236,16032
1653978755,16193
1654065033,16114
1654151553,16793
1654237831,16214
1654324351,15780
1654410631,15626
1654497153,15774
1654583555,16220
1654669837,16448
1654756356,16545
1654842756,16239
1654929156,16296
1655015436,15746
1655101838,16722
1655188357,16564
1655274636,16891
1655361158,16553
1655447555,16895
1655533836,15876
1655620256,16081
1655706645,19081
1655793158,17113
1655879557,18248
1655965955,12420
1656052365,10256
1656138754,10871
1656225155,10091
1656311556,10799
1656397956,10700
1656484356,10829
1656570758,12097
1656743558,10361
1656829841,10204
1656916357,10532
1657002637,11079
1657089163,10477
1657175559,10234
1657261838,11304
1657348240,10401
1657434758,10671
1657521164,10176
1657607566,10299
1657693957,10958
1657780357,12165
1657803090,12165
1657804447,12165
1657809517,12165
1657866760,11207
1657896040,11207
1657953158,10429
1657982325,10429
1658039438,10053
1658068726,10053
1658125843,10864
1658155247,10864
1658212362,10204
1658241661,10204
1658298758,11160
1658328052,11160
1658385041,10220
1658414447,10220
1658471560,10494
1658500847,10494
1658557962,10732
1658587247,10732
1658644360,11117
1658673645,11117
1658730762,10105
1658760045,10105
1658817160,10557
1658846453,10557
1658903439,10301
1658932848,10301
1658989840,10337
1659019246,10337
1659076365,10882
1659105646,10882
1659162770,10440
1659192044,10440
1659249159,10437
1659278470,10437
1659335565,10197
1659364847,10197
1659421963,11691
1659451128,11691
1659508368,10826
1659537519,10826
1659594767,10951
1659624049,10951
1659681160,10195
1659710444,10195
1659767561,10881
1659796845,10881
1659853840,10380
1659883130,10380
1659940369,10899
1659969638,10899
1660026647,10767
1660056049,10767
1660113163,11089
1660142439,11089
1660199441,11393
1660228849,11393
1660285970,10869
1660315250,10869
1660372250,10089
1660401521,10089
1660458761,10899
1660488049,10899
1660545162,10785
1660574449,10785
1660631564,11250
1660660730,11250
1660717841,11083
1660747248,11083
1660804362,10911
1660833647,10911
1660890760,11032
1660920046,11032
1660977162,10931
1661006455,10931
1661063442,10365
1661092854,10365
1661149842,11416
1661179125,11416
1661236366,10762
1661265647,10762
1661322641,10936
1661352051,10936
1661409162,11426
1661438449,11426
1661495561,10842
1661524735,10842
1661581964,10668
1661611239,10668
1661668363,10198
1661697647,10198
1661700049,10198
1661754784,11504
1661784048,11504
1661870448,11699
1661927560,11583
1661956724,11583
1662013964,11327
1662043246,11327
1662100359,10812
1662129642,10812
1662186760,10024
1662216045,10024
1662273039,10116
1662302447,10116
1662359559,13737
1662388727,13737
1662445958,10827
1662475124,10827
1662532358,11274
1662561643,11274
1662618758,12986
1662647931,12986
1662705164,11306
1662734437,11306
1662791558,10548
1662820724,10548
1662877847,10078
1662907237,10078
1662964357,10788
1662993645,10788
1663050638,11133
1663080057,11133
1663137169,11114
1663166448,11114
1663223564,11157
1663252844,11157
1663309969,12243
1663339237,12243
1663396358,10108
1663425653,10108
1663482759,11141
1663512042,11141
1663569159,12181
1663598447,12181
1663655565,11841
1663684725,11841
1663741840,11531
1663771124,11531
1663828239,10766
1663857524,10766
1663914640,10902
1663943934,10902
1664001039,10137
1664030318,10137
1664087438,10621
1664116722,10621
1664173842,11180
1664203127,11180
1664260251,11123
1664289537,11123
1664346641,12150
1664375951,12150
1664433041,10622
1664462320,10622
1664519554,10612
1664548711,10612
1664605833,10499
1664635111,10499
1668081545,12760
1668350533,10377
1668355972,10377
1668356757,10377
1668360810,10377
1668474184,13589
1668560577,11679
1668646979,11766
1671629111,13346
1671630664,13346
1671632450,13346
1671634011,13346
1673516775,8193
1674367285,8432
1674455475,8626
1674541884,8977
1674628285,8365
1674714694,9219
1674801082,9216
1674887480,7990
1674973872,8333
1675060281,8455
1675146682,8146
1675233071,8451
1675319481,8385
1675405883,9511
1675492281,7346
1675578681,7519
1675665075,8922
1675751474,8338
1675837863,4677
1676356254,8331
1676442661,8276
1676529061,8149
1676615450,8239
1676701857,7384
1676788249,7330
1676874662,7964
1676961061,8350
1677047454,8232
1677133857,8133
1677220262,7861
1677306660,7640
1677393061,7926
1677479458,8577
1677565859,8111
1677652257,12568
1677738657,10073
1677825057,8147
1677911460,7501
1677997847,8094
1678084257,8871
1678170666,8099
1678257055,8244
1678343445,8304
1679569142,8644
1679584407,8644
1679589867,8644
1679596494,8644
1679602915,8644
1679607956,8644
1679639532,8317
1679722309,7743
1679808717,7840
1679895117,5125
1679981518,9424
1680067912,9514
1680154308,10039
1680240714,11412
1680327097,10182
1680413504,11093
1680499902,11497
1680586299,12785
1680672702,12111
1680759104,12354
1680845523,11019
1680931899,10707
1681018301,10257
1681104713,10624
1681191117,11079
1681277516,11643
1681363906,11300
1681450306,11244
1681536706,10700
1681623105,10446
1681709528,11969
1681795909,11605
1681882326,11330
1681968706,12856
1682055103,12403
1682141505,10665
1682227910,10579
1682314324,11702
1682400707,11621
1682487105,11658
1682573524,11105
1682659898,11265
1682746309,10783
1682832700,11151
1682919107,10837
1683005499,11467
1683091901,12317
1683178309,11559
1683264713,11009
1683351101,10325
1683437506,10658
1683523904,11134
1683610328,12319
1683696716,11566
1683783116,11052
1683869508,10958
1683955918,10702
1684042308,11039
1685544777,11144
1685597496,11022
1685683902,11464
1685770303,10419
1685856701,10376
1685943100,11122
1686029502,10900
1686115904,10909
1686202306,12542
1686288711,11325
1686375108,10552
1686461512,10645
1686547909,11153
1686634309,11369
1686720704,10950
1686807105,11571
1686893562,11280
1686979954,10461
1687066360,10782
1687152774,11286
1687239150,11170
1687411953,10917
1687498393,11085
1687584774,10401
1687671173,10470
1687757568,10009
1687843969,7402
1687930377,7493
1688016807,7647
1688103218,7364
1688189597,7038
1688275996,7408
1688362412,8537
1688535215,7314
1688621614,7591
1688708029,7060
1688794420,6964
1688880821,6872
1688967219,7303
1689053626,7311
1689140028,10150
1689226424,7996
1689312837,7546
1689399195,7093
1689485597,6943
1689572000,7541
1689658397,7377
1689744807,7136
1689831241,7269
1689917640,7240
1690004042,7283
1690090404,7727
1690176817,7147
1690263240,7985
1690349617,8355
1690436012,7421
1690522443,6153
1690608808,4185
1690695212,4273
1690781617,4604
1690868047,4591
1690954421,8280
1691040818,7374
1691127250,7157
1691213630,6976
1691300015,7166
1691386395,8251
1691472821,8349
1691559206,7648
1691645653,7362
1691732035,7526
1691818443,7187
1691904834,7855
1691991184,7853
1692077570,7581
1692163972,7791
1692250382,8016
1692336773,7849
1692423180,7296
1692509573,7014
1692595944,2478
1692682368,7734
1692768764,7501
1692855167,9323
1692941568,7572
1693027980,7006
1693114356,7432
1693200777,7620
1693287141,5273
1693373568,8217
1693459952,8222
1693546364,9049
1693632754,7149
1693719144,7212
1693805540,8112
1693891949,7584
1693978362,7895
1694064749,7936
1694151151,7731
1694237547,7118
1694323959,8214
1694410362,7654
1694496769,8550
1694583178,7529
1694669562,8158
1694755972,8527
1694842363,7433
1694928766,7230
1695015165,7563
1695187975,7847
1695274380,7975
1695360784,8118
1695447164,7422
1695533586,7139
1695619990,8237
1695706406,8127
1695792808,7890
1695879218,8566
1695965624,7709
1696052011,7319
1696138408,7099
1696224807,7862
1696311219,8384
1696397621,7995
1696484041,8364
1696570435,8154
1696656841,7512
1696743237,7259
1696829644,7933
1696916048,7997
1697002439,8357
1697088838,8011
1697175238,7506
1697261644,7189
1697348050,7304
1697434425,7846
1697520844,9189
1697607247,8174
1697693651,7836
1697780021,8181
1697866447,7339
1697952848,7382
1698039229,8039
1698125641,8374
1698212053,8417
1698298423,8416
1698384826,8445
1698474862,7251
1698561261,7315
1698647660,8250
1698734051,8216
1698820440,8164
1698906836,7738
1698993260,7823
1699079643,7765
1699166057,7667
1699252467,8088
1699338847,9671
1699425254,8826
1699511642,9128
1699598052,8080
1699684453,7735
1699770845,7875
1699857241,8769
1699943653,8055
1700030030,8027
1700116443,8320
1700202865,8052
1700289223,7709
1700375637,7594
1700462021,8124
1700548451,7961
1700634836,8369
1700721246,8075
1700807657,11539
1700894058,7500
1700980458,7432
