1649485949,4
1649572354,16
1649658750,22
1649745150,16
1649831565,8
1649917950,7
1650004228,14
1650090628,14
1650177150,24
1650263549,20
1650349831,9
1650436229,16
1650522756,10
1650609163,15
1650695550,14
