1636895594,8
1636898490,9
1636900709,10
1637070326,10
1637070818,11
1637072812,18
1637122028,18
1637208446,21
1637294806,22
1637381227,21
1637467621,19
1637554087,20
1637589848,20
1637640464,11
1637726914,14
1637813369,12
1637899638,15
