1654237831,49
1654324351,308
1654410631,205
1654497153,174
1654583555,148
1654669837,169
1654756356,199
1654842756,231
1654929156,211
1655015436,269
1655101838,383
1655188357,195
1655274636,330
1655361158,111
1655447555,270
1655533836,174
1655620256,34
