1663396358,1
1663425653,1
1663482759,7
1663512042,7
1663569159,7
1663598447,7
1663655565,3
1663684725,3
1663741840,4
1663771124,4
1663828239,4
1663857524,4
1663914640,5
1663943934,5
1664001039,7
1664030318,7
1664087438,16
1664116722,16
1664173842,7
1664203127,7
1664260251,2
1664289537,2
1664346641,4
1664375951,4
1664433041,3
1664462320,3
1664519554,4
1664548711,4
1664605833,11
1664635111,11
