1656570620,1
1657780221,9
1657802862,9
1657804268,9
1657809502,9
1662877820,3
1662907100,3
1664548696,3
1664635096,7
1679981431,1
1680759032,2
1681277433,2
1681709434,4
1685683833,1
1686202233,1
1687843838,1
1688362240,1
1688535044,1
1688880644,1
1689312653,1
1689658239,1
1690003846,1
1690090245,1
1690176650,1
1691991040,1
1692509432,1
1693891835,10
1694064634,1
1696224642,1
1696311044,1
1697088641,1
1697175042,1
1697434244,2
1698820251,1
1699338639,17
1700202637,2
1700289040,3
1700721041,2
