1637554087,1
1637589848,1
1638245235,1
1640923223,2
1641096084,2
1641182484,1
1641268824,2
1641355224,1
1641441684,1
1641528084,2
1641787224,1
1641873686,3
1643601634,1
1643622207,1
1643774489,1
1644206493,1
1644820292,1
1646893952,1
1647066751,1
1647239550,1
1648103550,1
1648881149,1
1648967561,1
1649572354,1
1649658750,1
1651732362,1
1652337032,1
1652769160,1
1654842756,1
1655793158,1
1655879557,1
1657175559,1
1658730762,1
1658760045,1
1659249159,1
1659278470,1
1661754784,1
1661784048,1
1663309969,1
1663339237,1
1668474184,1
1671629111,1
1671630664,1
1671632450,1
1671634011,1
1682487105,3
1696224807,1
