1662877847,1
1662907237,1
1662964357,6
1662993645,6
1663050638,9
1663080057,9
1663137169,3
1663166448,3
1663223564,4
1663252844,4
1663309969,10
1663339237,10
1663396358,12
1663425653,12
1663482759,4
1663512042,4
1663569159,3
1663598447,3
1663655565,4
1663684725,4
1663741840,3
1663771124,3
1663828239,8
1663857524,8
1663914640,4
1663943934,4
1664001039,14
1664030318,14
1664087438,3
1664116722,3
