1673516775,1440
1674367285,1439
1674455475,1439
1674541884,1440
1674628285,1439
1674714694,1439
1674801082,1440
1674887480,1439
1674973872,1439
1675060281,1440
1675146682,1439
1675233071,1439
1675319481,1440
1675405883,1439
1675492281,1439
1675578681,1440
1675665075,1440
1675751474,1441
1675837863,776
1676356254,635
1676442661,1440
1676529061,1439
1676615450,1440
1676701857,1439
1676788249,1439
1676874662,1440
1676961061,1439
1677047454,1439
1677133857,1440
1677220262,1439
1677306660,1440
1677393061,1439
1677479458,1439
1677565859,1440
1677652257,2122
1677738657,1440
1677825057,1439
1677911460,1439
1677997847,1440
1678084257,1439
1678170666,1439
1678257055,1440
1678343445,1439
1679569142,1439
1679584407,1439
1679589867,1439
1679596494,1439
1679602915,1439
1679607956,1439
1679639532,1440
1679722309,1439
1679808717,1439
1679895117,1294
1679981518,1378
1680067912,1439
1680154308,1439
1680240714,1440
1680327097,1439
1680413504,1439
1680499902,1439
1680586299,1439
1680672702,1440
1680759104,1439
1680845523,1439
1680931899,1439
1681018301,1440
1681104713,1439
1681191117,1439
1681277516,1439
1681363906,1440
1681450306,1439
1681536706,1439
1681623105,1440
1681709528,1439
1681795909,1439
1681882326,1440
1681968706,1439
1682055103,1439
1682141505,1440
1682227910,1439
1682314324,1440
1682400707,1439
1682487105,1439
1682573524,1440
1682659898,1439
1682746309,1439
1682832700,1440
1682919107,1439
1683005499,1440
1683091901,1439
1683178309,1439
1683264713,1440
1683351101,1439
1683437506,1439
1683523904,1441
1683610328,1439
1683696716,1439
1683783116,1439
1683869508,1439
1683955918,1440
1684042308,1439
1685544777,1439
1685597496,1440
1685683902,1439
1685770303,1439
1685856701,1440
1685943100,1439
1686029502,1439
1686115904,1439
1686202306,1440
1686288711,1439
1686375108,1439
1686461512,1440
1686547909,1439
1686634309,1439
1686720704,1357
1686807105,1439
1686893562,1440
1686979954,1439
1687066360,1439
1687152774,1440
1687239150,1439
1687411953,1439
1687498393,1439
1687584774,1440
1687671173,1439
1687757568,1439
1687843969,1440
1687930377,1439
1688016807,1440
1688103218,1439
1688189597,1440
1688275996,1439
1688362412,1439
1688535215,1439
1688621614,1439
1688708029,1440
1688794420,1439
1688880821,1439
1688967219,1440
1689053626,1032
1689140028,1440
1689226424,1439
1689312837,1439
1689399195,1440
1689485597,1439
1689572000,1439
1689658397,1440
1689744807,1439
1689831241,1440
1689917640,1439
1690004042,1439
1690090404,1440
1690176817,1439
1690263240,1439
1690349617,1440
1690436012,1439
1690522443,1439
1690608808,1440
1690695212,1439
1690781617,1439
1690868047,1440
1690954421,1439
1691040818,1440
1691127250,1439
1691213630,1439
1691300015,1440
1691386395,1395
1691472821,1439
1691559206,1440
1691645653,1439
1691732035,1439
1691818443,1440
1691904834,1439
1691991184,1439
1692077570,1440
1692163972,1439
1692250382,1439
1692336773,1440
1692423180,1439
1692509573,1439
1692595944,430
1692682368,1439
1692768764,1439
1692855167,1440
1692941568,1439
1693027980,1439
1693114356,1439
1693200777,1440
1693287141,918
1693373568,1432
1693459952,1439
1693546364,1440
1693632754,1439
1693719144,1439
1693805540,1439
1693891949,1440
1693978362,1439
1694064749,1439
1694151151,1439
1694237547,1440
1694323959,1439
1694410362,1439
1694496769,1439
1694583178,1439
1694669562,1440
1694755972,1439
1694842363,1439
1694928766,1439
1695015165,1439
1695187975,1304
1695274380,1439
1695360784,1439
1695447164,1439
1695533586,1440
1695619990,1439
1695706406,1439
1695792808,1439
1695879218,1440
1695965624,1439
1696052011,1439
1696138408,1439
1696224807,1439
1696311219,1438
1696397621,1439
1696484041,1439
1696570435,1440
1696656841,1439
1696743237,1439
1696829644,1439
1696916048,1440
1697002439,1439
1697088838,1439
1697175238,1439
1697261644,1440
1697348050,1439
1697434425,1439
1697520844,1440
1697607247,1439
1697693651,1439
1697780021,1439
1697866447,1440
1697952848,1439
1698039229,1439
1698125641,1439
1698212053,1440
1698298423,1438
1698384826,1439
1698474862,1439
1698561261,1439
1698647660,1439
1698734051,1440
1698820440,1439
1698906836,1439
1698993260,1439
1699079643,1439
1699166057,1439
1699252467,1439
1699338847,1440
1699425254,1440
1699511642,1439
1699598052,1439
1699684453,1440
1699770845,1439
1699857241,1439
1699943653,1439
1700030030,1439
1700116443,1440
1700202865,1439
1700289223,1439
1700375637,1439
1700462021,1440
1700548451,1439
1700634836,1439
1700721246,1439
1700807657,1439
1700894058,1440
1700980458,1439
