1645597892,57
1645684232,105
1645770629,92
1645857150,130
1645943553,117
1646029893,180
1646116237,155
1646202760,130
1646289033,127
1646375551,114
1646461951,277
1646548229,147
1646634751,132
1646721161,147
1646807431,240
1646893952,107
1646980230,303
1647066751,249
1647153150,179
1647239550,255
1647325952,192
1647412352,168
1647498752,156
1647585151,315
1647757954,145
1647844355,147
1647930752,230
1648017150,260
1648103550,158
1648189831,145
1648276229,145
1648362752,265
1648449033,163
1648535442,164
1648621952,136
1648708231,25
1648794750,272
1648881149,179
1648967561,166
1649053832,147
1649140351,185
1649226751,160
1649313029,166
1649399549,265
1649485949,267
1649572354,153
1649658750,287
1649745150,395
1649831565,180
1649917950,163
1650004228,251
1680240714,34
1680327097,195
1680413504,371
1680499902,241
1680586299,289
1680672702,170
1680759104,140
1680845523,234
1680931899,95
