1646116237,1
1646202760,3
1646289033,2
1646375551,4
1646461951,2
1646548229,3
1646634751,5
1646721161,2
1646807431,3
1646893952,3
1646980230,6
1647066751,5
1647153150,4
1647239550,5
1647325952,2
1647412352,5
1647498752,4
1647585151,3
1647757954,5
1647844355,7
1647930752,3
1648017150,1
1648103550,6
1648189831,5
1648276229,12
1648362752,8
1648449033,4
1648535442,6
1648621952,15
1648708231,3
