1649140351,20
1649226751,145
1649313029,175
1649399549,244
1649485949,246
1649572354,154
1649658750,366
1649745150,338
1649831565,189
1649917950,195
1650004228,271
1650090628,232
1650177150,218
1650263549,259
1650349831,249
1650436229,142
1650522756,144
1650609163,523
1650695550,156
1650781953,148
1650868349,140
1650954630,297
1651041030,136
1651127552,167
1651213951,270
1651300352,454
1651386755,410
1651473034,220
1651559564,123
1651645850,734
1651732362,275
1651818753,27
