1679584314,1
1679589759,1
1679596397,1
1679602819,1
1679607852,1
1679639432,1
1679981431,1
1680240629,1
1680845434,1
1683437432,1
1683610233,1
1688103041,1
1688967042,1
1689053441,1
1689139840,1
1689226241,1
1689312653,1
1693027839,1
1693114233,1
1693200633,1
1695965441,1
1697607044,1
1697693444,1
1697866244,1
1697952644,1
1698211845,1
1698474646,1
1698561046,1
1698647445,1
1700807441,2
1700893840,1
1700980240,1
