1662445958,17
1662475124,17
1662532358,2
1662561643,2
1662618758,2
1662647931,2
1662705164,2
1662734437,2
1662791558,2
1662820724,2
1662877847,2
1662907237,2
1662964357,2
1662993645,2
1663050638,2
1663080057,2
1663137169,2
1663166448,2
1663223564,2
1663252844,2
1663309969,2
1663339237,2
1663396358,2
1663425653,2
1663482759,2
1663512042,2
1663569159,2
1663598447,2
1663655565,2
1663684725,2
1663741840,2
1663771124,2
1663828239,2
1663857524,2
1663914640,2
1663943934,2
1664001039,2
1664030318,2
1664087438,2
1664116722,2
1664173842,2
1664203127,2
1664260251,2
1664289537,2
1664346641,2
1664375951,2
1664433041,2
1664462320,2
1664519554,2
1664548711,2
1664605833,2
1664635111,2
1668560577,1
1668646979,1
1675751474,16
1680672702,8
1682573524,1
1682659898,1
1682832700,1
1682919107,1
1683437506,1
1683783116,1
1683869508,1
1684042308,1
1685770303,1
1685943100,1
1687498393,1
1687584774,1
1689312837,1
1689399195,1
1692595944,1
1698298423,2
