1679584314,1
1679589759,1
1679596397,1
1679602819,1
1679607852,1
1679639432,1
1679981431,1
1680240629,1
1680845434,1
1681623032,1
1683610233,1
1695533434,1
1695619839,1
1695965441,1
1696829444,1
1698211845,1
