1697261447,1
1697347842,1
1697520642,1
1697607044,1
1697693444,1
1697866244,1
1697952644,1
1698211845,1
1698474646,2
1698561046,1
1698647445,1
1698733843,2
1698993045,1
1699079441,1
1699165843,1
1699252253,6
