1650954630,4
1651041030,2
1651127552,2
1651213951,2
1651300352,2
1651386755,2
1651473034,2
1651559564,2
1651645850,2
1651732362,2
1651818753,2
1651905153,2
1651991564,2
1652077954,2
1652164360,2
1652250764,2
1652337032,2
1652423553,2
1652509832,2
1652596232,2
1652682759,2
1652769160,2
1652855561,2
1652941964,2
1653028353,2
1653114753,2
1653201159,2
1653287558,2
1653373954,2
1653460234,2
1653546755,2
1653633154,2
1653719553,2
1653805957,2
1653892236,2
1653978755,2
1654065033,6
1654151553,2
1654237831,2
1654324351,2
1654410631,2
1654497153,2
1654583555,2
1654669837,2
1654756356,2
1654842756,2
1654929156,2
1655015436,2
1655101838,2
1655274636,4
1655361158,2
1655447555,2
1655533836,6
1655620256,2
1655706645,2
1655793158,2
1655879557,2
1655965955,2
1656052365,2
1656138754,2
1656225155,2
1656311556,2
1656397956,2
1656484356,2
1656570758,2
1656829841,2
1656916357,2
1657002637,2
1657089163,2
1657175559,2
1657261838,2
1657348240,6
1657434758,2
1657521164,2
1657607566,2
1657693957,6
1657780357,2
1657803090,2
1657804447,2
1657809517,2
1657866760,10
1657896040,10
1657953158,4
1657982325,4
1658039438,4
1658068726,4
1658125843,4
1658155247,4
1658212362,4
1658241661,4
1658298758,4
1658328052,4
1658385041,4
1658414447,4
1658471560,4
1658500847,4
1658557962,4
1658587247,4
1658644360,4
1658673645,4
1658730762,4
1658760045,4
1658817160,4
1658846453,4
1658903439,4
1658932848,4
1658989840,4
1659019246,4
1659076365,4
1659105646,4
1659162770,4
1659192044,4
1659249159,4
1659278470,4
1659335565,4
1659364847,4
1659421963,4
1659451128,4
1659508368,4
1659537519,4
1659594767,4
1659624049,4
1659681160,8
1659710444,8
1659767561,4
1659796845,4
1659853840,4
1659883130,4
1659940369,4
1659969638,4
1660026647,4
1660056049,4
1660113163,4
1660142439,4
1660199441,8
1660228849,8
1660285970,4
1660315250,4
1660372250,4
1660401521,4
1660458761,4
1660488049,4
1660545162,4
1660574449,4
1660631564,8
1660660730,8
1660717841,4
1660747248,4
1660804362,4
1660833647,4
1660890760,4
1660920046,4
1660977162,4
1661006455,4
1661063442,4
1661092854,4
1661149842,4
1661179125,4
1661236366,4
1661265647,4
1661322641,4
1661352051,4
1661409162,4
1661438449,4
1661495561,4
1661524735,4
1661581964,4
1661611239,4
1661668363,4
1661697647,4
1661700049,4
1661754784,6
1661784048,6
1661870448,4
1661927560,4
1661956724,4
1662013964,4
1662043246,4
1662100359,2
1662129642,2
