1649485949,14
1649572354,7
1649658750,15
1649745150,28
1649831565,6
1649917950,10
1650004228,11
1650090628,15
1650177150,16
1650263549,13
1650349831,16
1650436229,14
1650522756,11
1650609163,20
1650695550,16
