1636895594,29
1636898490,29
1636900709,29
1637070326,23
1637070818,25
1637072812,31
1637122028,32
1637208446,47
1637294806,29
1637381227,2
1637467621,16
1637554087,6
1637589848,6
1637726914,6
1637813369,15
1638158887,19
1638245235,34
1638331638,2
1639980923,21
1639983233,21
1639985995,21
1640059226,6
1640080313,6
1640145685,6
1640232083,16
1640318424,2
1640404823,2
1640491284,2
1640577691,2
1640664024,9
1640750484,18
1640836884,15
1640923223,2
1641009626,2
1641096084,2
1641182484,51
1641268824,29
1641355224,18
1641441684,2
1641528084,18
1641700884,2
1641787224,32
1641873686,16
1642392088,36
1642408942,36
1642478484,18
1642564885,54
1642651226,43
1642676514,43
1642805851,45
1642824026,6
1642855125,6
1642910490,8
1642924655,8
1642934565,8
1642937864,8
1642996892,43
1643083292,29
1643169628,38
1643256090,48
1643342487,9
1643428827,2
1643515288,2
1643601634,9
1643622207,9
1643688028,47
1643708607,47
1643774489,38
1643860889,22
1643947288,40
1644033629,2
1644120088,2
1644206493,56
1644292831,9
1644321030,9
1644388289,45
1644407490,45
1644474692,44
1644493888,44
1644561030,29
1644647492,2
1644733834,2
1644770508,2
1644820292,51
1644906689,51
1644993090,18
1645079499,41
1645165829,25
1645252290,2
1645338629,2
1645425030,9
1645467113,9
1645470826,9
1645511492,34
1645597892,140
1645684232,74
1645770629,17
1645857150,2
1645943553,2
1646029893,31
1646116237,2
1646202760,2
1646289033,31
1646375551,16
1646461951,2
1646548229,2
1646634751,78
1646721161,58
1646807431,53
1646893952,59
1646980230,27
1647066751,2
1647153150,2
1647239550,43
1647325952,72
1647412352,47
1647498752,28
1647585151,40
1647757954,2
1647844355,72
1647930752,80
1648017150,56
1648103550,98
1648189831,58
1648276229,2
1648362752,2
1648449033,52
1648535442,213
1648621952,107
1648708231,118
1648794750,80
1648881149,2
1648967561,2
1649053832,185
1649140351,84
1649226751,150
1649313029,46
1649399549,39
1649485949,2
1649572354,2
1649658750,64
1649745150,42
1649831565,90
1649917950,99
1650004228,2
1650090628,2
1650177150,2
1650263549,2
1650349831,120
1650436229,214
1650522756,104
1650609163,75
1650695550,10
1650781953,2
1650868349,118
1650954630,61
1651041030,32
1651127552,56
1651213951,58
1651300352,2
1651386755,2
1651473034,45
1651559564,40
1651645850,12
1651732362,27
1651818753,2
1651905153,2
1651991564,2
1652077954,71
1652164360,55
1652250764,50
1652337032,3
1652423553,19
1652509832,2
1652596232,2
1652682759,7
1652769160,28
1652855561,41
1652941964,19
1653028353,9
1653114753,2
1653201159,2
1653287558,56
1653373954,18
1653460234,21
1653546755,2
1653633154,29
1653719553,2
1653805957,2
1653892236,30
1653978755,37
1654065033,52
1654151553,27
1654237831,4
1654324351,2
1654410631,2
1654497153,2
1654583555,20
1654669837,18
1654756356,37
1654842756,20
1654929156,2
1655015436,2
1655101838,31
1655188357,17
1655274636,28
1655361158,10
1655447555,11
1655533836,2
1655620256,2
1655706645,2
1655793158,14
1655879557,2
1655965955,17
1656052365,2
1656138754,2
1656225155,2
1656311556,2
1656397956,24
1656484356,2
1656570758,2
1656829841,2
1656916357,24
1657002637,25
1657089163,5
1657175559,8
1657261838,19
1657348240,2
1657434758,2
1657521164,40
1657607566,50
1657693957,8
1657780357,5
1657803090,5
1657804447,5
1657809517,5
1657866760,41
1657896040,41
1657953158,4
1657982325,4
1658039438,4
1658068726,4
1658125843,8
1658155247,8
1658212362,21
1658241661,21
1658298758,29
1658328052,29
1658385041,40
1658414447,40
1658471560,20
1658500847,20
1658557962,4
1658587247,4
1658644360,4
1658673645,4
1658730762,30
1658760045,30
1658817160,30
1658846453,30
1658903439,29
1658932848,29
1658989840,29
1659019246,29
1659076365,11
1659105646,11
1659162770,4
1659192044,4
1659249159,4
1659278470,4
1659335565,8
1659364847,8
1659421963,52
1659451128,52
1659508368,40
1659537519,40
1659594767,26
1659624049,26
1659681160,27
1659710444,27
1659767561,4
1659796845,4
1659853840,4
1659883130,4
1659940369,4
1659969638,4
1660026647,4
1660056049,4
1660113163,4
1660142439,4
1660199441,4
1660228849,4
1660285970,4
1660315250,4
1660372250,4
1660401521,4
1660458761,4
1660488049,4
1660545162,4
1660574449,4
1660631564,4
1660660730,4
1660717841,4
1660747248,4
1660804362,4
1660833647,4
1660890760,4
1660920046,4
1660977162,4
1661006455,4
1661063442,4
1661092854,4
1661149842,22
1661179125,22
1661236366,18
1661265647,18
1661322641,5
1661352051,5
1661409162,7
1661438449,7
1661495561,13
1661524735,13
1661581964,4
1661611239,4
1661668363,4
1661697647,4
1661700049,4
1661754784,27
1661784048,27
1661870448,22
1661927560,9
1661956724,9
1662013964,4
1662043246,4
1662100359,10
1662129642,10
1662186760,4
1662216045,4
1662273039,4
1662302447,4
1662359559,12
1662388727,12
1662445958,4
1662475124,4
1662532358,7
1662561643,7
1662618758,21
1662647931,21
1662705164,23
1662734437,23
1662791558,4
1662820724,4
1662877847,4
1662907237,4
1662964357,19
1662993645,19
1663050638,12
1663080057,12
1663137169,6
1663166448,6
1663223564,19
1663252844,19
1663309969,12
1663339237,12
1663396358,4
1663425653,4
1663482759,4
1663512042,4
1663569159,21
1663598447,21
1663655565,20
1663684725,20
1663741840,5
1663771124,5
1663828239,18
1663857524,18
1663914640,5
1663943934,5
1664001039,4
1664030318,4
1664087438,4
1664116722,4
1664173842,4
1664203127,4
1664260251,12
1664289537,12
1664346641,44
1664375951,44
1664433041,9
1664462320,9
1664519554,12
1664548711,12
1664605833,4
1664635111,4
1668560577,2
1668646979,2
1675751474,10
1680586299,28
1680672702,11
1680759104,10
1680845523,3
1682227910,3
1682314324,4
1682573524,2
1682659898,2
1682746309,2
1682832700,2
1682919107,2
1683005499,2
1683091901,2
1683178309,2
1683264713,2
1683351101,2
1683437506,2
1683523904,2
1683610328,2
1683696716,2
1683783116,2
1683869508,2
1683955918,2
1684042308,2
1685597496,2
1685683902,2
1685770303,2
1685856701,2
1685943100,2
1686029502,2
1686115904,2
1686202306,2
1686288711,2
1686375108,2
1686461512,2
1686547909,2
1686634309,2
1686720704,2
1686807105,2
1686893562,2
1686979954,2
1687066360,2
1687152774,2
1687239150,2
1687411953,2
1687498393,2
1687584774,2
1687671173,2
1687757568,2
1687843969,2
1687930377,2
1688016807,2
1688103218,2
1688189597,2
1688275996,2
1688362412,2
1688535215,2
1688621614,2
1688708029,2
1688794420,2
1688880821,2
1688967219,2
1689053626,2
1689140028,2
1689226424,2
1689312837,2
1689399195,2
1689485597,2
1689572000,2
1689658397,2
1689744807,2
1689831241,2
1689917640,2
1690004042,2
1690090404,2
1690176817,2
1690263240,2
1690349617,2
1690436012,2
1690522443,2
1690608808,2
1690695212,2
1690781617,2
1690868047,2
1690954421,2
1691040818,2
1691127250,2
1691213630,2
1691300015,2
1691386395,2
1691472821,2
1691559206,2
1691645653,2
1691732035,2
1691818443,2
1691904834,2
1691991184,2
1692077570,2
1692163972,2
1692250382,2
1692336773,2
1692423180,2
1692509573,2
1692595944,2
1692682368,2
1692768764,2
1692855167,2
1692941568,2
1693027980,2
1693114356,2
1693200777,2
1693287141,2
1693373568,2
1693459952,2
1693546364,2
1693632754,2
1693719144,2
1693805540,2
1693891949,2
1693978362,2
1694064749,2
1694151151,2
1694237547,2
1694323959,2
1694410362,2
1694496769,2
1694583178,2
1694669562,2
1694755972,2
1694842363,2
1694928766,2
1695015165,2
1695187975,2
1695274380,2
1695360784,2
1695447164,2
1695533586,2
1695619990,2
1695706406,2
1695792808,2
1695879218,2
1695965624,2
1696052011,2
1696138408,2
1696224807,2
1696311219,2
1696397621,2
1696484041,2
1696570435,2
1696656841,2
1696743237,2
1696829644,2
1696916048,2
1697002439,2
1697088838,2
1697175238,2
1697348050,2
1697434425,2
1697520844,2
1697607247,2
1697693651,2
1697780021,2
1697866447,2
1697952848,2
1698039229,2
1698125641,2
1698212053,2
1698298423,3
1698384826,2
1698474862,2
1698561261,2
1698647660,2
1698734051,2
1698820440,2
1698906836,2
1698993260,2
1699079643,2
1699166057,2
1699252467,2
1699338847,2
1699425254,2
1699511642,2
1699598052,4
1699684453,2
1699770845,2
1699857241,2
1699943653,2
1700030030,2
1700116443,2
1700202865,2
1700289223,2
1700375637,2
1700462021,2
1700548451,2
1700634836,2
1700721246,2
1700807657,2
1700894058,2
1700980458,2
