1663914640,41
1663943934,41
1664001039,76
1664030318,76
1664087438,122
1664116722,122
1664173842,144
1664203127,144
1664260251,85
1664289537,85
1664346641,96
1664375951,96
1664433041,200
1664462320,200
1664519554,114
1664548711,114
1664605833,58
1664635111,58
