1653114753,373
1653201159,320
1653287558,102
1653373954,122
1653460234,129
1653546755,531
1653633154,128
1653719553,489
1653805957,113
1653892236,216
1653978755,246
1654065033,348
1654151553,121
1654237831,253
1654324351,350
1654410631,9
