1691645653,3
1691732035,30
1691818443,20
1691904834,29
1691991184,19
1692077570,25
1692163972,21
1692250382,24
1692336773,23
1692423180,29
1692509573,22
1692595944,5
1692682368,33
1692768764,20
1692855167,25
1692941568,15
1693027980,17
1693114356,5
