1679639432,1
1679981431,1
1680240629,1
1680845434,1
1683437432,1
1683610233,1
1686720636,1
1692250233,1
1692336633,1
1692423035,1
1692509432,1
1692682233,1
1692768633,1
1692855035,1
1692941433,1
1693027839,1
1693200633,1
1693978232,1
1694323834,1
1694496634,1
1694583036,1
1694669436,2
1694755834,1
1694842234,1
1694928634,1
1698993045,2
1699079441,1
1699165843,1
1699252253,4
1699338639,1
1699425038,1
1699597838,1
1699684239,1
1699770639,1
1699943446,1
1700116239,1
1700202637,2
1700548240,1
1700721041,1
1700807441,2
1700893840,1
1700980240,1
