1688016807,19
1688103218,27
1688189597,34
1688275996,32
1688362412,27
1688535215,27
1688621614,30
1688708029,28
1688794420,25
1688880821,25
1688967219,21
1689053626,22
1689140028,40
1689226424,21
1689312837,28
1689399195,25
1689485597,23
1689572000,24
1689658397,27
1689744807,31
1689831241,26
1689917640,26
1690004042,24
1690090404,23
1690176817,33
1690263240,29
1690349617,32
1690436012,19
