1646202760,3
1646289033,3
1646375551,13
1646461951,2
1646548229,1
1646721161,3
1646807431,4
1646893952,3
1646980230,8
1647066751,2
1647153150,5
1647239550,4
1647325952,5
1647412352,5
1647498752,5
1647585151,4
1647757954,1
1647844355,3
1647930752,3
1648017150,2
1648103550,7
1648189831,4
1648276229,5
1648362752,4
1648449033,5
1648535442,4
1648621952,5
1648708231,3
1648794750,4
1648881149,3
1648967561,1
1649053832,6
1649140351,1
