1693287141,3
1693373568,6
1693459952,3
1693546364,4
1693632754,4
1693805540,11
1693891949,4
1693978362,7
1694064749,6
1694151151,8
1694237547,8
1694323959,6
1694410362,2
1694496769,13
1694583178,28
1694669562,3
1694755972,21
1694842363,2
1694928766,6
1695015165,1
