1650004228,308
1650090628,457
1650177150,257
1650263549,131
1650349831,119
1650436229,169
1650522756,247
1650609163,220
1650695550,141
1650781953,115
1650868349,151
1650954630,133
1651041030,383
1651127552,119
1651213951,350
1651300352,201
1651386755,115
1651473034,502
1651559564,133
1651645850,204
1651732362,143
1651818753,246
1651905153,286
1651991564,109
1652077954,139
1652164360,166
1652250764,151
1652337032,169
1652423553,190
1652509832,160
1652596232,167
1652682759,45
