1687066360,482
1687152774,547
1687239150,147
1687411953,589
1687498393,146
1687584774,186
1687671173,267
1687757568,209
1687843969,206
1687930377,585
1688016807,205
1688103218,77
1688189597,43
1688275996,103
