1695533586,1
1695619990,3
1695706406,3
1695792808,4
1695879218,3
1695965624,1
1696052011,19
1696138408,3
1696224807,2
1696311219,6
1696397621,3
1696484041,3
1696570435,4
1696656841,10
1696743237,22
1696829644,6
1696916048,2
1697002439,5
1697088838,4
1697175238,3
1697261644,11
1697434425,21
1697520844,3
1697607247,3
1697693651,8
1697780021,1
1697866447,6
1697952848,3
1698039229,3
1698125641,31
1698212053,2
1698298423,3
1698384826,5
1698474862,2
1698561261,8
1698647660,6
1698734051,11
1698820440,24
1698906836,2
1698993260,3
1699079643,3
1699166057,6
1699252467,5
1699338847,2
1699425254,2
1699511642,2
