1694669562,28
1694842363,1
1694928766,1
1695187975,1
1695447164,1
1695706406,1
1695792808,1
1695879218,17
1695965624,1
1696138408,1
1696224807,1
1696311219,6
1696484041,1
1696656841,1
1696743237,1
1696829644,8
1697088838,7
1697434425,1
1698384826,8
1699079643,1
1699598052,2
1699684453,1
1699770845,1
1700116443,1
1700202865,1
1700289223,1
1700375637,1
1700548451,1
1700807657,1
1700894058,1
1700980458,1
