1653892236,77
1653978755,408
1654065033,242
1654151553,219
1654237831,172
1654324351,204
1654410631,343
1654497153,138
1654583555,153
1654669837,160
1654756356,260
1654842756,214
1654929156,335
1655015436,168
1655101838,65
