1647498752,1
1647585151,2
1647757954,2
1647844355,2
1647930752,2
1648017150,2
1648103550,2
1648189831,2
1648276229,2
1648362752,2
1648449033,2
1648535442,2
1648621952,2
1648708231,2
1648794750,3
1648881149,2
1648967561,3
1649053832,2
1649140351,2
1649226751,2
1649313029,2
1649399549,2
1649485949,2
1649572354,2
1649658750,2
1649745150,2
1649831565,3
1649917950,2
1650004228,2
1650090628,2
1650177150,2
1650263549,2
1650349831,2
1650436229,2
1650522756,2
1650609163,2
1650695550,2
1650781953,2
1650868349,2
1650954630,2
1651041030,2
1651127552,2
1651213951,2
1651300352,3
1651386755,2
1651473034,2
1651559564,2
1651645850,2
1651732362,2
1651818753,2
1651905153,2
1651991564,2
1652077954,2
1652164360,2
1652250764,2
1652337032,2
1652423553,2
1652509832,2
1652596232,3
1652682759,2
1652769160,3
1652855561,2
1652941964,2
1653028353,2
1653114753,2
1653201159,2
1653287558,3
1653373954,2
1653460234,2
1653546755,3
1653633154,2
1653719553,2
1653805957,2
1653892236,2
1653978755,2
1654065033,2
1654151553,2
1654237831,2
1654324351,2
1654410631,2
1654497153,2
1654583555,2
1654669837,2
1654756356,2
1654842756,2
1654929156,2
1655015436,2
1655101838,2
1655188357,3
1655274636,2
1655361158,2
1655447555,2
1655533836,2
1655620256,2
1655706645,2
1655793158,2
1655879557,2
1655965955,2
1656052365,3
1656138754,2
1656225155,2
1656311556,2
1656397956,2
1656484356,3
1656570758,2
1656829841,2
1656916357,2
1657002637,3
1657089163,2
1657175559,2
1657261838,2
1657348240,2
1657434758,2
1657521164,2
1657607566,2
1657693957,2
1657780357,2
1657803090,2
1657804447,2
1657809517,2
1657866760,11
1657896040,11
1657953158,4
1657982325,4
1658039438,4
1658068726,4
1658125843,4
1658155247,4
1658212362,4
1658241661,4
1658298758,4
1658328052,4
1658385041,4
1658414447,4
1658471560,4
1658500847,4
1658557962,4
1658587247,4
1658644360,4
1658673645,4
1658730762,4
1658760045,4
1658817160,4
1658846453,4
1658903439,4
1658932848,4
1658989840,4
1659019246,4
1659076365,4
1659105646,4
1659162770,4
1659192044,4
1659249159,4
1659278470,4
1659335565,5
1659364847,5
1659421963,4
1659451128,4
1659508368,4
1659537519,4
1659594767,4
1659624049,4
1659681160,4
1659710444,4
1659767561,4
1659796845,4
1659853840,4
1659883130,4
1659940369,5
1659969638,5
1660026647,4
1660056049,4
1660113163,4
1660142439,4
1660199441,4
1660228849,4
1660285970,4
1660315250,4
1660372250,4
1660401521,4
1660458761,4
1660488049,4
1660545162,4
1660574449,4
1660631564,4
1660660730,4
1660717841,4
1660747248,4
1660804362,4
1660833647,4
1660890760,4
1660920046,4
1660977162,4
1661006455,4
1661063442,4
1661092854,4
1661149842,4
1661179125,4
1661236366,4
1661265647,4
1661322641,4
1661352051,4
1661409162,4
1661438449,4
1661495561,4
1661524735,4
1661581964,4
1661611239,4
1661668363,4
1661697647,4
1661700049,4
1661754784,6
1661784048,6
1661870448,4
1661927560,4
1661956724,4
1662013964,4
1662043246,4
1662100359,4
1662129642,4
1662186760,4
1662216045,4
1662273039,4
1662302447,4
1662359559,4
1662388727,4
1662445958,4
1662475124,4
1662532358,5
1662561643,5
1662618758,4
1662647931,4
1662705164,4
1662734437,4
1662791558,4
1662820724,4
1662877847,4
1662907237,4
1662964357,4
1662993645,4
1663050638,4
1663080057,4
1663137169,4
1663166448,4
1663223564,4
1663252844,4
1663309969,4
1663339237,4
1663396358,4
1663425653,4
1663482759,4
1663512042,4
1663569159,4
1663598447,4
1663655565,4
1663684725,4
1663741840,4
1663771124,4
1663828239,4
1663857524,4
1663914640,4
1663943934,4
1664001039,4
1664030318,4
1664087438,4
1664116722,4
1664173842,4
1664203127,4
1664260251,4
1664289537,4
1664346641,4
1664375951,4
1664433041,4
1664462320,4
1664519554,4
1664548711,4
1664605833,4
1664635111,4
1668560577,2
1668646979,2
1673516775,2
1674367285,2
1674455475,2
1674541884,2
1674628285,2
1674801082,2
1674887480,2
1674973872,2
1675060281,2
1675233071,2
1675319481,2
1675405883,2
1675492281,2
1675578681,2
1675837863,2
1676442661,2
1676615450,2
1676701857,2
1676788249,2
1676961061,2
1677047454,2
1677133857,2
1677220262,3
1677306660,2
1677393061,2
1677479458,2
1677738657,2
1677825057,2
1677911460,2
1677997847,3
1678257055,2
1678343445,10
1679569142,5
1679584407,5
1679589867,5
1679596494,5
1679602915,5
1679607956,5
1679639532,18
1679722309,2
1679808717,2
1679895117,2
1679981518,2
1680067912,2
1680154308,2
1680327097,3
1680413504,2
1680499902,2
1680586299,2
1680845523,3
1681018301,2
1681104713,2
1681277516,2
1681363906,2
1681536706,2
1681623105,2
1681709528,3
1682055103,2
1682141505,2
1682227910,3
1682487105,2
1682573524,2
1682659898,2
1682746309,2
1682832700,2
1682919107,2
1683005499,2
1683091901,2
1683178309,3
1683264713,2
1683351101,2
1683437506,2
1683523904,2
1683610328,2
1683696716,3
1683783116,2
1683869508,2
1683955918,2
1684042308,2
1685597496,2
1685683902,2
1685770303,2
1685856701,2
1685943100,2
1686029502,2
1686115904,2
1686202306,2
1686288711,2
1686375108,2
1686461512,2
1686547909,2
1686634309,2
1686720704,2
1686807105,2
1686893562,3
1686979954,2
1687066360,2
1687152774,2
1687239150,2
1687411953,2
1687498393,2
1687584774,2
1687671173,2
1687757568,2
1687843969,2
1687930377,2
1688016807,2
1688103218,2
1688189597,2
1688275996,2
1688362412,2
1688535215,2
1688621614,2
1688708029,3
1688794420,2
1688880821,2
1688967219,2
1689053626,2
1689140028,2
1689226424,2
1689312837,2
1689399195,2
1689485597,2
1689572000,2
1689658397,2
1689744807,2
1689831241,2
1689917640,2
1690004042,2
1690090404,2
1690176817,2
1690263240,2
1690349617,2
1690436012,2
1690522443,2
1690608808,3
1690695212,2
1690781617,2
1690868047,2
1690954421,2
1691040818,2
1691127250,2
1691213630,2
1691300015,2
1691386395,2
1691472821,2
1691559206,2
1691645653,2
1691732035,2
1691818443,2
1691904834,2
1691991184,2
1692077570,2
1692163972,2
1692250382,2
1692336773,2
1692423180,2
1692509573,2
1692595944,2
1692682368,2
1692768764,2
1692855167,2
1692941568,3
1693027980,2
1693114356,2
1693200777,2
1693287141,2
1693373568,2
1693459952,2
1693546364,2
1693632754,2
1693719144,2
1693805540,2
1693891949,2
1693978362,2
1694064749,2
1694151151,2
1694237547,2
1694323959,2
1694410362,2
1694496769,2
1694583178,2
1694669562,2
1694755972,2
1694842363,2
1694928766,2
1695015165,2
1695187975,2
1695274380,2
1695360784,2
1695447164,2
1695533586,2
1695619990,2
1695706406,2
1695792808,2
1695879218,2
1695965624,2
1696052011,2
1696138408,2
1696224807,2
1696311219,2
1696397621,2
1696484041,2
1696570435,2
1696656841,2
1696743237,2
1696829644,2
1696916048,2
1697002439,2
1697088838,2
1697175238,2
1697261644,2
1697348050,2
1697434425,2
1697520844,2
1697607247,2
1697693651,2
1697780021,2
1697866447,2
1697952848,2
1698039229,2
1698125641,2
1698212053,2
1698298423,4
1698384826,2
1698474862,2
1698561261,2
1698647660,2
1698734051,2
1698820440,2
1698906836,2
1698993260,2
1699079643,2
1699166057,2
1699252467,2
1699338847,2
1699425254,2
1699511642,2
1699598052,4
1699684453,2
1699770845,2
1699857241,2
1699943653,2
1700030030,2
1700116443,2
1700202865,2
1700289223,2
1700375637,2
1700462021,2
1700548451,2
1700634836,2
1700721246,2
1700807657,2
1700894058,2
1700980458,2
