1659076365,1
1659105646,1
1659162770,10
1659192044,10
1659249159,6
1659278470,6
1659335565,11
1659364847,11
1659421963,8
1659451128,8
1659508368,18
1659537519,18
1659594767,4
1659624049,4
1659681160,6
1659710444,6
1659767561,13
1659796845,13
1659853840,7
1659883130,7
1659940369,6
1659969638,6
1660026647,15
1660056049,15
1660113163,11
1660142439,11
1660199441,7
1660228849,7
1660285970,7
1660315250,7
1660372250,11
1660401521,11
