1642392088,25
1642408942,25
1642478484,28
1642564885,33
1642651226,30
1642676514,30
1642769502,26
1642771604,26
1642805136,26
1642805851,26
1642824026,137
1642855125,137
1642910490,25
1642924655,25
1642934565,25
1642937864,25
1642996892,28
1643083292,37
1643169628,38
1643256090,33
1643342487,37
1643428827,11
1643515288,20
1643601634,12
1643622207,12
1643688028,9
1643708607,9
1643774489,15
1643860889,15
1643947288,15
1644033629,29
1644120088,23
1644206493,15
1644292831,15
1644321030,15
1644388289,12
1644407490,12
1644474692,7
1644493888,7
1644561030,21
1644647492,8
1644733834,13
1644770508,13
1644820292,20
1644906689,24
1644993090,11
1645079499,9
1645165829,19
1645252290,16
1645338629,9
