1642910490,2
1642924655,2
1642934565,2
1642937864,2
1642996892,13
1643083292,16
1643169628,13
1643256090,19
1643342487,15
1643428827,4
1643515288,4
1643601634,8
1643622207,8
1643688028,7
1643708607,7
1643774489,3
1643860889,4
1643947288,5
1644033629,5
1644120088,5
1644206493,4
1644292831,9
1644321030,9
1644388289,5
1644407490,5
1644474692,4
1644493888,4
1644561030,4
1644647492,6
1644733834,3
1644770508,3
1644820292,4
1644906689,3
1644993090,6
1645079499,2
1645165829,3
