1636895594,3
1636898490,7
1636900709,8
1637467621,12
1638072517,6
1640232083,11
1640750484,11
1641268824,12
1641787224,6
1641873686,5
1642910490,2
1642924655,2
1642934565,2
1642937864,2
1643515288,4
1645511492,4
1646807431,4
1649140351,6
1650349831,3
1651991564,1
1652596232,2
1653719553,1
1653978755,2
1655447555,18
1656225155,23
1657953158,10
1657982325,10
1658039438,13
1658068726,13
1659767561,9
1659796845,9
1659853840,11
1659883130,11
