1655620256,2
1655706645,11
1655793158,12
1655879557,6
1655965955,9
1656052365,9
1656138754,11
1656225155,7
1656311556,10
1656397956,10
1656484356,5
1656570758,10
1656743558,12
1656829841,9
1656916357,1
