1657866760,29
1657896040,29
1657953158,41
1657982325,41
1658039438,77
1658068726,77
1658125843,93
1658155247,93
1658212362,272
1658241661,272
1658298758,121
1658328052,121
1658385041,164
1658414447,164
1658471560,54
1658500847,54
1658557962,150
1658587247,150
1658644360,117
1658673645,117
1658730762,113
1658760045,113
1658817160,304
1658846453,304
1658903439,36
1658932848,36
1658989840,67
1659019246,67
