1690090404,2
1692509573,2
1692768764,2
1693027980,2
1693200777,2
1693459952,2
1693719144,2
1693978362,2
1694323959,2
1694669562,2
1695015165,2
1695360784,2
1695619990,2
1695879218,2
1696052011,2
1696138408,2
1696484041,2
1696743237,2
1697693651,2
1698039229,2
1698561261,2
1698820440,2
1699079643,2
1699338847,2
1699425254,2
1699770845,4
1700030030,2
1700289223,2
1700548451,2
1700807657,2
1700980458,2
