1656570758,66
1656743558,346
1656829841,269
1656916357,168
1657002637,175
1657089163,519
1657175559,535
1657261838,224
1657348240,377
1657434758,249
1657521164,220
1657607566,137
1657693957,124
1657780357,142
1657803090,142
1657804447,142
1657809517,142
1657866760,189
1657896040,189
