1685544777,1
1685597496,62
1685683902,159
1685770303,1
1685856701,1
1685943100,6098
1686115904,1217
1686202306,668
1686288711,89
1686375108,2
1686461512,2
1686547909,96
1686634309,62
1686720704,277
1686807105,88
1686893562,234
1686979954,74
1687066360,73
1687152774,262
1687239150,82
1687411953,530
1687498393,1
1687584774,1
1687671173,1
1687757568,231
1687843969,406
1687930377,583
1688016807,30
1688103218,143
1688189597,27
1688275996,74
1688362412,90
1688535215,67
1688621614,1312
1688708029,2933
1688794420,2907
1688880821,2881
1688967219,2881
1689053626,2881
1689140028,2881
1689226424,2883
1689312837,2894
1689399195,2881
1689485597,2881
1689572000,2881
1689658397,2881
1689744807,2881
1689831241,2881
1689917640,2881
1690004042,2881
1690090404,2881
1690176817,2881
1690263240,2881
1690349617,2881
1690436012,2881
1690522443,2311
1690608808,1441
1690695212,1441
1690781617,1441
1690868047,1441
1690954421,2179
1691040818,2881
1691127250,2881
1691213630,2881
1691300015,2881
1691386395,2792
1691472821,2881
1691559206,2881
1691645653,2893
1691732035,2881
1691818443,2881
1691904834,2881
1691991184,2984
1692077570,2950
1692163972,2882
1692250382,2905
1692336773,2947
1692423180,2881
1692509573,2881
1692595944,861
1692682368,2892
1692768764,2907
1692855167,2954
1692941568,2881
1693027980,2881
1693114356,2881
1693200777,2882
1693287141,1839
1693373568,2881
1693459952,2881
1693546364,2881
1693632754,2881
1693719144,2881
1693805540,2915
1693891949,2881
1693978362,2881
1694064749,2905
1694151151,2904
1694237547,2881
1694323959,2881
1694410362,2881
1694496769,2881
1694583178,2926
1694669562,2881
1694755972,2881
1694842363,2881
1694928766,2881
1695015165,2881
1695187975,2913
1695274380,2881
1695360784,2901
1695447164,2881
1695533586,2881
1695619990,2881
1695706406,2882
1695792808,2888
1695879218,2919
1695965624,2894
1696052011,2881
1696138408,2881
1696224807,3075
1696311219,3223
1696397621,2910
1696484041,2912
1696570435,2882
1696656841,2881
1696743237,2881
1696829644,2898
1696916048,2920
1697002439,3057
1697088838,2992
1697175238,2967
1697261644,2881
1697348050,2881
1697434425,2920
1697520844,2954
1697607247,2920
1697693651,2947
1697780021,2938
1697866447,2881
1697952848,2881
1698039229,2894
1698125641,2982
1698212053,2920
1698298423,2908
1698384826,2886
1698474862,2881
1698561261,2881
1698647660,2900
1698734051,3062
1698820440,3109
1698906836,3011
1698993260,2881
1699079643,2881
1699166057,2881
1699252467,2881
1699338847,2881
1699425254,2882
1699511642,2879
1699598052,2882
1699684453,2881
1699770845,2881
1699857241,2883
1699943653,2883
1700030030,2881
1700116443,2881
1700202865,2900
1700289223,2881
1700375637,2881
1700462021,2881
1700548451,2881
1700634836,2946
1700721246,2881
1700807657,2881
1700894058,2881
1700980458,2881
