1649053832,1
1649140351,3
1649226751,6
1649313029,5
1649399549,12
1649485949,2
1649572354,4
1649658750,6
1649745150,2
1649831565,9
1649917950,5
1650004228,4
1650090628,5
1650177150,9
1650263549,16
1650349831,10
