1636895594,92
1636898490,92
1636900709,92
1637070326,46
1637070818,47
1637072812,5
1637122028,49
1637208446,6
1637294806,1
1637381227,5
1637467621,1
1637554087,1
1637589848,1
1637726914,15
1637813369,1
1638158887,23
1638245235,7
1638331638,1
1639980923,50
1639983233,50
1639985995,50
1640059226,3
1640080313,3
1640145685,3
1640232083,7
1640318424,1
1640404823,1
1640491284,1
1640577691,1
1640664024,13
1640750484,71
1640836884,1
1640923223,1
1641009626,1
1641096084,1
1641182484,1
1641268824,1
1641355224,1
1641441684,1
1641528084,1180
1641700884,1
1641787224,1
1641873686,1
1642392088,4
1642408942,4
1642478484,2
1642564885,13
1642651226,7
1642676514,7
1642805851,2
1642824026,3
1642855125,3
1642910490,4
1642924655,4
1642934565,4
1642937864,4
1642996892,8
1643083292,20
1643169628,8
1643256090,1
1643342487,1
1643428827,5
1643515288,1
1643601634,1
1643622207,1
1643688028,14
1643708607,14
1643774489,2
1643860889,2
1643947288,13
1644033629,1
1644120088,1
1644206493,1
1644292831,1
1644321030,1
1644388289,2
1644407490,2
1644474692,2
1644493888,2
1644561030,3
1644647492,3
1644733834,1
1644770508,1
1644820292,39
1644906689,1
1644993090,7
1645079499,1
1645165829,1
1645252290,1
1645338629,1
1645425030,1
1645467113,1
1645470826,1
1645511492,17
1645597892,13
1645684232,8
1645770629,1
1645857150,1
1645943553,1
1646029893,11
1646116237,1
1646202760,1
1646289033,25
1646375551,11
1646461951,1
1646548229,1
1646634751,1
1646721161,59
1646807431,5
1646893952,1
1646980230,1
1647066751,1
1647153150,1
1647239550,7
1647325952,1
1647412352,1
1647498752,1
1647585151,1
1647757954,1
1647844355,3
1647930752,15
1648017150,21
1648103550,29
1648189831,7
1648276229,1
1648362752,1
1648449033,7
1648535442,9
1648621952,1
1648708231,2
1648794750,1
1648881149,1
1648967561,1
1649053832,1
1649140351,1
1649226751,1
1649313029,1
1649399549,1
1649485949,1
1649572354,1
1649658750,7
1649745150,7
1649831565,1
1649917950,1
1650004228,1
1650090628,5
1650177150,1
1650263549,1
1650349831,1
1650436229,1
1650522756,1
1650609163,9
1650695550,1
1650781953,1
1650868349,1
1650954630,1
1651041030,1
1651127552,1
1651213951,21
1651300352,1
1651386755,1
1651473034,1
1651559564,1
1651645850,1
1651732362,33
1651818753,1
1651905153,1
1651991564,1
1652077954,7
1652164360,1
1652250764,1
1652337032,1
1652423553,1
1652509832,1
1652596232,1
1652682759,7
1652769160,1
1652855561,1
1652941964,1
1653028353,1
1653114753,1
1653201159,1
1653287558,1
1653373954,1
1653460234,1
1653546755,1
1653633154,1
1653719553,1
1653805957,1
1653892236,1
1653978755,1
1654065033,1
1654151553,1
1654237831,1
1654324351,1
1654410631,1
1654497153,1
1654583555,1
1654669837,1
1654756356,61
1654842756,40
1654929156,1
1655015436,1
1655101838,49
1655188357,63
1655274636,1
1655361158,27
1655447555,1
1655533836,1
1655620256,1
1655706645,379
1655793158,144
1655879557,1
1655965955,1
1656052365,1
1656138754,1
1656225155,1
1656311556,27
1656397956,31
1656484356,229
1656570758,252
1656829841,1
1656916357,738
1657002637,1
1657089163,1
1657175559,1
1657261838,1
1657348240,1
1657434758,1
1657521164,13
1657607566,35
1657693957,23
1657780357,1
1657803090,1
1657804447,1
1657809517,1
1657866760,5
1657896040,5
1657953158,2
1657982325,2
1658039438,2
1658068726,2
1658125843,2
1658155247,2
1658212362,2
1658241661,2
1658298758,2
1658328052,2
1658385041,2
1658414447,2
1658471560,2
1658500847,2
1658557962,2
1658587247,2
1658644360,2
1658673645,2
1658730762,2
1658760045,2
1658817160,2
1658846453,2
1658903439,2
1658932848,2
1658989840,2
1659019246,2
1659076365,2
1659105646,2
1659162770,2
1659192044,2
1659249159,2
1659278470,2
1659335565,2
1659364847,2
1659421963,2
1659451128,2
1659508368,2
1659537519,2
1659594767,2
1659624049,2
1659681160,2
1659710444,2
1659767561,2
1659796845,2
1659853840,2
1659883130,2
1659940369,2
1659969638,2
1660026647,41
1660056049,41
1660113163,2
1660142439,2
1660199441,2
1660228849,2
1660285970,2
1660315250,2
1660372250,2
1660401521,2
1660458761,2
1660488049,2
1660545162,2
1660574449,2
1660631564,2
1660660730,2
1660717841,2
1660747248,2
1660804362,22
1660833647,22
1660890760,2
1660920046,2
1660977162,2
1661006455,2
1661063442,2
1661092854,2
1661149842,8
1661179125,8
1661236366,20
1661265647,20
1661322641,4
1661352051,4
1661409162,3
1661438449,3
1661495561,2
1661524735,2
1661581964,2
1661611239,2
1661668363,2
1661697647,2
1661700049,2
1661754784,3
1661784048,3
1661870448,14
1661927560,2
1661956724,2
1662013964,2
1662043246,2
1662100359,2
1662129642,2
1662186760,2
1662216045,2
1662273039,2
1662302447,2
1662359559,2
1662388727,2
1662445958,2
1662475124,2
1662532358,2
1662561643,2
1662618758,2
1662647931,2
1662705164,2
1662734437,2
1662791558,2
1662820724,2
1662877847,2
1662907237,2
1662964357,2
1662993645,2
1663050638,2
1663080057,2
1663137169,2
1663166448,2
1663223564,2
1663252844,2
1663309969,2
1663339237,2
1663396358,2
1663425653,2
1663482759,2
1663512042,2
1663569159,2
1663598447,2
1663655565,2
1663684725,2
1663741840,2
1663771124,2
1663828239,2
1663857524,2
1663914640,2
1663943934,2
1664001039,2
1664030318,2
1664087438,2
1664116722,2
1664173842,2
1664203127,2
1664260251,2
1664289537,2
1664346641,2
1664375951,2
1664433041,2
1664462320,2
1664519554,2
1664548711,2
1664605833,2
1664635111,2
1668560577,1
1668646979,37
1675751474,11
1675837863,3
1676529061,3
1676615450,3
1678343445,15
1682573524,2
1682659898,2
1682746309,2
1682832700,2
1682919107,2
1683005499,2
1683091901,2
1683178309,2
1683264713,2
1683351101,2
1683437506,2
1683523904,2
1683610328,2
1683696716,2
1683783116,2
1683869508,2
1683955918,2
1684042308,2
1685597496,2
1685683902,2
1685770303,2
1685856701,2
1685943100,2
1686029502,2
1686115904,2
1686202306,2
1686288711,2
1686375108,2
1686461512,2
1686547909,2
1686634309,2
1686720704,2
1686807105,2
1686893562,2
1686979954,2
1687066360,2
1687152774,2
1687239150,2
1687411953,2
1687498393,2
1687584774,2
1687671173,2
1687757568,2
1687843969,2
1687930377,2
1688016807,2
1688103218,2
1688189597,2
1688275996,2
1688362412,2
1688535215,2
1688621614,2
1688708029,2
1688794420,2
1688880821,2
1688967219,2
1689053626,2
1689140028,2
1689226424,2
1689312837,2
1689399195,2
1689485597,2
1689572000,2
1689658397,2
1689744807,2
1689831241,2
1689917640,2
1690004042,2
1690090404,2
1690176817,2
1690263240,2
1690349617,2
1690436012,2
1690522443,2
1690608808,2
1690695212,2
1690781617,2
1690868047,2
1690954421,2
1691040818,2
1691127250,2
1691213630,2
1691300015,2
1691386395,2
1691472821,2
1691559206,2
1691645653,2
1691732035,2
1691818443,2
1691904834,2
1691991184,2
1692077570,2
1692163972,2
1692250382,2
1692336773,2
1692423180,2
1692509573,2
1692595944,2
1692682368,2
1692768764,2
1692855167,2
1692941568,2
1693027980,2
1693114356,2
1693200777,2
1693287141,2
1693373568,2
1693459952,2
1693546364,2
1693632754,2
1693719144,2
1693805540,2
1693891949,2
1693978362,2
1694064749,2
1694151151,2
1694237547,2
1694323959,2
1694410362,2
1694496769,2
1694583178,2
1694669562,2
1694755972,2
1694842363,2
1694928766,2
1695015165,2
1695187975,2
1695274380,2
1695360784,2
1695447164,2
1695533586,2
1695619990,2
1695706406,2
1695792808,2
1695879218,2
1695965624,2
1696052011,2
1696138408,2
1696224807,2
1696311219,2
1696397621,2
1696484041,2
1696570435,2
1696656841,2
1696743237,2
1696829644,2
1696916048,2
1697002439,2
1697088838,2
1697175238,2
1697261644,2
1697348050,2
1697434425,2
1697520844,2
1697607247,2
1697693651,2
1697780021,2
1697866447,2
1697952848,2
1698039229,2
1698125641,2
1698212053,2
1698298423,2
1698384826,2
1698474862,2
1698561261,2
1698647660,2
1698734051,2
1698820440,2
1698906836,2
1698993260,2
1699079643,2
1699166057,2
1699252467,2
1699338847,2
1699425254,2
1699511642,2
1699598052,4
1699684453,2
1699770845,2
1699857241,2
1699943653,2
1700030030,2
1700116443,2
1700202865,2
1700289223,2
1700375637,2
1700462021,2
1700548451,2
1700634836,2
1700721246,2
1700807657,2
1700894058,2
1700980458,2
