1687411953,109
1687498393,137
1687584774,239
1687671173,232
1687757568,115
1687843969,179
1687930377,426
1688016807,41
1688103218,40
1688189597,37
1688275996,1054
1688362412,61
1688535215,56
1688621614,209
1688708029,380
1688794420,380
1688880821,132
1688967219,508
1689053626,146
1689140028,658
1689226424,58
1689312837,266
1689399195,99
1689485597,127
