1659335565,2
1659364847,2
1659421963,8
1659451128,8
1659508368,6
1659537519,6
1659594767,16
1659624049,16
1659681160,6
1659710444,6
1659767561,17
1659796845,17
1659853840,4
1659883130,4
1659940369,4
1659969638,4
1660026647,2
1660056049,2
