1650349831,27
1650436229,253
1650522756,140
1650609163,130
1650695550,140
1650781953,142
1650868349,119
1650954630,284
1651041030,137
1651127552,277
1651213951,160
1651300352,245
1651386755,260
1651473034,208
1651559564,134
1651645850,122
