1691127048,1
1691645448,1
1691904646,1
1692077440,1
1692163831,1
1692250233,1
1692336633,1
1692423035,1
1692509432,1
1692682233,1
1692768633,1
1692855035,1
1692941433,1
1693027839,1
1693200633,1
1700548240,1
1700721041,1
1700807441,2
1700893840,1
1700980240,1
