1646807431,1
1646893952,5
1646980230,5
1647066751,3
1647153150,8
1647239550,3
1647325952,4
1647412352,2
1647498752,4
1647585151,3
1647757954,5
1647844355,4
1647930752,5
1648017150,6
1648103550,5
1648189831,3
1648276229,1
1648362752,5
1648449033,6
1648535442,5
1648621952,1
1648708231,4
1648794750,5
1648881149,3
1648967561,3
1649053832,3
1649140351,3
1649226751,4
1649313029,2
1649399549,10
1649485949,3
1649572354,4
1649658750,6
1649745150,8
1649831565,6
1649917950,5
1650004228,6
