1662100359,2
1662129642,2
1662186760,14
1662216045,14
1662273039,16
1662302447,16
1662359559,20
1662388727,20
1662445958,26
1662475124,26
1662532358,10
1662561643,10
1662618758,9
1662647931,9
1662705164,8
1662734437,8
1662791558,12
1662820724,12
1662877847,4
1662907237,4
