1651300352,101
1651386755,137
1651473034,207
1651559564,180
1651645850,152
1651732362,194
1651818753,260
1651905153,272
1651991564,248
1652077954,136
1652164360,180
1652250764,163
1652337032,178
1652423553,139
1652509832,117
1652596232,37
