1683783032,1
1684042234,1
1685544705,1
1685770233,1
1685856632,1
1685943031,1
1686375033,1
1686461431,1
1686634231,1
1686720636,1
1686807032,1
1686893441,1
1686979840,1
1687152641,1
1687239039,1
1687584640,1
1687671039,1
1687930240,1
1688275841,1
1690435846,1
1693114233,1
