1679584314,1
1679589759,1
1679596397,1
1679602819,1
1679607852,1
1679639432,1
1679981431,1
1680240629,1
1680845434,1
1681623032,1
1682141433,1
1682573432,1
1685597429,1
1685856632,1
1687152641,1
1687498241,2
1688016640,2
1688103041,2
1688362240,2
1688535044,2
1688621445,2
1688707844,2
1688794245,2
1688880644,2
1688967042,2
1689053441,2
1689139840,2
1689226241,2
1689312653,2
1689831044,2
1689917446,2
1690003846,2
1690263047,2
1690522245,2
1690867847,2
1691127048,2
1694583036,1
1694755834,1
1694842234,1
1694928634,1
1695965441,1
1696483842,1
1696656645,1
1696743043,1
1696829444,1
1696915841,1
1697002242,1
1697088641,1
1697175042,1
1697261447,1
1697347842,1
