1646548229,9
1646634751,16
1646721161,13
1646807431,18
1646893952,14
1646980230,14
1647066751,7
1647153150,17
1647239550,19
1647325952,13
1647412352,14
1647498752,20
1647585151,28
1647757954,10
1647844355,13
1647930752,12
1648017150,19
1648103550,13
1648189831,15
1648276229,9
1648362752,13
1648449033,11
1648535442,11
1648621952,13
1648708231,29
1648794750,24
1648881149,19
1648967561,13
1649053832,3
