1688362240,1
1688535044,1
1688621445,1
1688707844,1
1688794245,1
1688880644,1
1689831044,1
1689917446,1
1690003846,1
1690263047,1
1690522245,2
1690867847,1
1691127048,1
1695360634,1
1695533434,1
1695619839,2
1700807441,2
1700893840,1
1700980240,1
