1660458622,2
1660487902,2
1660631425,1
1660660703,1
1660804224,1
1660833502,1
1661409023,2
1661438302,2
1661495422,3
1661524710,3
1661581822,2
1661611101,2
1661668224,4
1661697464,4
1661699946,4
1680327029,1
1681104631,7
1681709434,8
1682400635,1
1691299847,1
1692250233,1
1694237434,7
1698993045,1
1699425038,1
1700375440,1
