1679584314,1
1679589759,1
1679596397,1
1679602819,1
1679607852,1
1679639432,1
1679981431,1
1680845434,1
1682573432,1
1687498241,1
1688016640,1
1688103041,1
1688275841,1
1688362240,1
1688535044,1
1688621445,1
1688707844,1
1688794245,1
1688967042,1
1689053441,1
1689139840,1
1689226241,1
1689312653,2
1689744640,1
1689831044,1
1689917446,1
1690003846,1
1690522245,1
1690867847,1
1691127048,1
1691213447,10
1691645448,1
1691731846,1
1691904646,1
1691991040,1
1693978232,1
1694151031,1
1694323834,1
1694583036,1
1694755834,1
1694842234,1
1694928634,1
1695274234,1
1695360634,1
1695533434,1
1695619839,1
