1651300352,3
1651386755,24
1651473034,11
1651559564,22
1651645850,12
1651732362,12
1651818753,11
1651905153,14
1651991564,5
1652077954,7
1652164360,12
1652250764,3
1652337032,7
1652423553,7
1652509832,16
1652596232,4
1652682759,12
1652769160,17
1652855561,23
1652941964,18
1653028353,24
1653114753,15
1653201159,13
1653287558,21
1653373954,22
1653460234,20
1653546755,14
1653633154,23
1653719553,20
1653805957,17
1653892236,18
1653978755,7
