1642392088,12
1642408942,12
1642478484,15
1642564885,14
1642651226,16
1642676514,16
1642769502,20
1642771604,20
1642805136,20
1642805851,20
1642824026,16
1642855125,16
1642910490,12
1642924655,12
1642934565,12
1642937864,12
1642996892,9
1643083292,15
1643169628,13
1643256090,18
1643342487,15
1643428827,3
1643515288,2
1643601634,4
1643622207,4
1643688028,4
1643708607,4
1643774489,4
1643860889,5
1643947288,4
1644033629,10
1644120088,6
1644206493,4
1644292831,10
1644321030,10
1644388289,4
1644407490,4
1644474692,7
1644493888,7
1644561030,5
1644647492,4
1644733834,4
1644770508,4
1644820292,4
1644906689,6
1644993090,5
1645079499,1
1645165829,3
1645252290,3
1645338629,6
1645425030,4
1645467113,4
1645470826,4
