1659335565,143
1659364847,143
1659421963,392
1659451128,392
1659508368,166
1659537519,166
1659594767,658
1659624049,658
1659681160,265
1659710444,265
1659767561,252
1659796845,252
1659853840,283
1659883130,283
1659940369,179
1659969638,179
1660026647,165
1660056049,165
1660113163,140
1660142439,140
1660199441,268
1660228849,268
1660285970,125
1660315250,125
1660372250,440
1660401521,440
1660458761,118
1660488049,118
1660545162,331
1660574449,331
1660631564,85
1660660730,85
