1660545162,1
1660574449,1
1660631564,2
1660660730,2
1660717841,2
1660747248,2
1660804362,2
1660833647,2
1660890760,2
1660920046,2
1660977162,2
1661006455,2
1661063442,2
1661092854,2
1661149842,2
1661179125,2
1661236366,2
1661265647,2
1661322641,2
1661352051,2
1661409162,2
1661438449,2
1661495561,2
1661524735,2
1661581964,2
1661611239,2
1661668363,2
1661697647,2
1661700049,2
1661754784,3
1661784048,3
1661870448,2
1661927560,2
1661956724,2
1662013964,2
1662043246,2
1662100359,2
1662129642,2
1662186760,2
1662216045,2
1662273039,2
1662302447,2
1662359559,2
1662388727,2
1662445958,2
1662475124,2
1662532358,2
1662561643,2
1662618758,2
1662647931,2
1662705164,2
1662734437,2
1662791558,2
1662820724,2
1662877847,2
1662907237,2
1662964357,2
1662993645,2
1663050638,2
1663080057,2
1663137169,2
1663166448,2
1663223564,2
1663252844,2
1663309969,2
1663339237,2
1663396358,2
1663425653,2
1663482759,2
1663512042,2
1663569159,2
1663598447,2
1663655565,2
1663684725,2
1663741840,2
1663771124,2
1663828239,2
1663857524,2
1663914640,2
1663943934,2
1664001039,2
1664030318,2
1664087438,2
1664116722,2
1664173842,2
1664203127,2
1664260251,2
1664289537,2
1664346641,2
1664375951,2
1664433041,2
1664462320,2
1664519554,2
1664548711,2
1664605833,2
1664635111,2
1668560577,1
1668646979,1
1675751474,3
1680672702,5
1682573524,1
1682659898,1
1682746309,1
1682832700,1
1682919107,1
1683091901,1
1683178309,1
1683264713,1
1683351101,1
1683437506,1
1683523904,1
1683610328,1
1683783116,1
1683869508,1
1683955918,1
1684042308,1
1685597496,1
1685683902,1
1685770303,1
1685856701,1
1685943100,1
1686202306,1
1686288711,1
1686375108,1
1686720704,1
1686807105,1
1687239150,1
1687411953,1
1687498393,1
1687584774,1
1687671173,1
1687757568,1
1687843969,1
1687930377,2
1688275996,1
1688621614,1
1688708029,1
1688794420,1
1688880821,1
1688967219,1
1689053626,1
1689140028,1
1689312837,1
1689399195,1
1689485597,1
1689572000,1
1689658397,1
1689744807,1
1689831241,1
1690004042,1
1690090404,1
1690176817,1
1690695212,1
1690868047,1
1690954421,1
1691300015,1
1691386395,1
1691645653,1
1691732035,1
1691818443,1
1691904834,1
1691991184,1
1692077570,1
1692163972,1
1692250382,1
1692336773,1
1692423180,1
1692509573,1
1692595944,1
1692682368,1
1692768764,1
1692855167,1
1692941568,1
1693027980,1
1693114356,1
1693287141,1
1693719144,1
1694237547,1
1694669562,1
1694842363,1
1694928766,1
1695187975,1
1695447164,1
1695619990,1
1695706406,1
1695792808,1
1695879218,1
1695965624,1
1696138408,1
1696224807,1
1696311219,1
1696397621,1
1696484041,1
1696656841,1
1696743237,1
1697434425,1
1698561261,1
1699079643,1
1699598052,2
1699684453,1
1699770845,1
1699857241,1
1700116443,1
1700202865,1
1700289223,1
1700375637,1
1700548451,1
1700807657,1
1700894058,1
1700980458,1
