1657953158,30
1657982325,30
1658039438,47
1658068726,47
1658125843,76
1658155247,76
1658212362,82
1658241661,82
1658298758,59
1658328052,59
1658385041,186
1658414447,186
1658471560,135
1658500847,135
1658557962,166
1658587247,166
1658644360,47
1658673645,47
1658730762,62
1658760045,62
1658817160,550
1658846453,550
1658903439,70
1658932848,70
1658989840,52
1659019246,52
1659076365,232
1659105646,232
1659162770,37
1659192044,37
1659249159,7
1659278470,7
