1693632754,21
1693719144,97
1693805540,311
1693891949,284
1693978362,75
1694064749,158
1694151151,192
1694237547,127
1694323959,52
1694410362,89
1694496769,246
1694583178,991
1694669562,211
1694755972,199
1694842363,90
1694928766,552
1695015165,225
1695187975,404
1695274380,76
1695360784,467
1695447164,63
1695533586,44
