1658385041,20
1658414447,20
1658471560,26
1658500847,26
1658557962,5
1658587247,5
1658644360,26
1658673645,26
1658730762,30
1658760045,30
1658817160,30
1658846453,30
1658903439,9
1658932848,9
1658989840,24
1659019246,24
