1679584314,1
1679589759,1
1679596397,1
1679602819,1
1679607852,1
1679639432,1
1679981431,1
1680845434,1
1681623032,1
1682573432,1
1683610233,1
1691818247,1
1691991040,1
1694669436,1
1694755834,1
1697261447,1
1697347842,1
1700807441,2
1700893840,1
1700980240,1
