1654756356,56
1654842756,5
1654929156,1
1655015436,1
1655101838,11
1655188357,140
1655274636,1
1655361158,270
1655447555,507
1655533836,1
1655620256,1
1655706645,76
1655793158,56
1655879557,514
1655965955,146
1656052365,1
1656138754,1
1656225155,1
1656311556,181
1656397956,205
1656484356,109
1656570758,374
1656829841,1
1656916357,178
1657002637,221
1657089163,68
1657175559,79
1657261838,96
1657348240,1
1657434758,1
1657521164,154
1657607566,80
1657693957,124
1657780357,131
1657803090,131
1657804447,131
1657809517,131
1657866760,139
1657896040,139
1657953158,2
1657982325,2
1658039438,2
1658068726,2
1658125843,136
1658155247,136
1658212362,209
1658241661,209
1658298758,64
1658328052,64
1658385041,67
1658414447,67
1658471560,184
1658500847,184
1658557962,2
1658587247,2
1658644360,2
1658673645,2
1658730762,326
1658760045,326
1658817160,230
1658846453,230
1658903439,287
1658932848,287
1658989840,173
1659019246,173
1659076365,273
1659105646,273
1659162770,2
1659192044,2
1659249159,2
1659278470,2
1659335565,275
1659364847,275
1659421963,271
1659451128,271
1659508368,298
1659537519,298
1659594767,186
1659624049,186
1659681160,358
1659710444,358
1659767561,2
1659796845,2
1659853840,2
1659883130,2
1659940369,219
1659969638,219
1660026647,298
1660056049,298
1660113163,188
1660142439,188
1660199441,88
1660228849,88
1660285970,98
1660315250,98
1660372250,2
1660401521,2
1660458761,2
1660488049,2
1660545162,198
1660574449,198
1660631564,98
1660660730,98
1660717841,90
1660747248,90
1660804362,120
1660833647,120
1660890760,240
1660920046,240
1660977162,2
1661006455,2
1661063442,2
1661092854,2
1661149842,65
1661179125,65
1661236366,14
1661265647,14
1661322641,3
1661352051,3
1661409162,6
1661438449,6
1661495561,12
1661524735,12
1661581964,2
1661611239,2
1661668363,2
1661697647,2
1661700049,2
1661754784,6
1661784048,6
1661870448,38
1661927560,68
1661956724,68
1662013964,2
1662043246,2
1662100359,4
1662129642,4
1662186760,2
1662216045,2
1662273039,4
1662302447,4
1662359559,28
1662388727,28
1662445958,2
1662475124,2
1662532358,18
1662561643,18
1662618758,2
1662647931,2
1662705164,4
1662734437,4
1662791558,2
1662820724,2
1662877847,2
1662907237,2
1662964357,23
1662993645,23
1663050638,148
1663080057,148
1663137169,76
1663166448,76
1663223564,51
1663252844,51
1663309969,2
1663339237,2
1663396358,8
1663425653,8
1663482759,2
1663512042,2
1663569159,8
1663598447,8
1663655565,2
1663684725,2
1663741840,2
1663771124,2
1663828239,2
1663857524,2
1663914640,2
1663943934,2
1664001039,2
1664030318,2
1664087438,2
1664116722,2
1664173842,2
1664203127,2
1664260251,2
1664289537,2
1664346641,2
1664375951,2
1664433041,2
1664462320,2
1664519554,2
1664548711,2
1664605833,2
1664635111,2
1668560577,1
1668646979,1
1671629111,46
1671630664,46
1671632450,46
1671634011,46
1674455475,3
1674541884,8
1674714694,3
1675751474,19
1676874662,3
1678343445,164
1680672702,9
1680759104,5
1681277516,3
1682314324,3
1682573524,1
1682659898,1
1682832700,1
1682919107,1
1683091901,75
1683178309,192
1683264713,65
1683351101,1
1683437506,1
1683610328,6
1683783116,48
1683869508,22
1683955918,1
1684042308,1
1685597496,1
1685683902,1
1685770303,1
1685856701,1
1685943100,4
1686115904,2
1686288711,1
1686634309,14
1686720704,3
1687411953,21
1687498393,1
1687584774,1
1687671173,1
1687757568,7
1688967219,1
1689312837,1
1689399195,1
1689744807,16
1690349617,3
1690781617,3
1691040818,5
1691904834,1
1692077570,3
1692509573,1
1692595944,1
1693373568,97
1693459952,3
1693891949,3
1694151151,17
1694583178,3
1695360784,9
1695706406,5
1696138408,1
1696224807,1
1698039229,9
1700894058,1
