1660804362,40
1660833647,40
1660890760,128
1660920046,128
1660977162,482
1661006455,482
1661063442,178
1661092854,178
1661149842,164
1661179125,164
1661236366,152
1661265647,152
1661322641,424
1661352051,424
1661409162,315
1661438449,315
1661495561,297
1661524735,297
1661581964,119
1661611239,119
1661668363,118
1661697647,118
1661700049,118
1661754784,173
1661784048,173
1661870448,325
1661927560,127
1661956724,127
1662013964,244
1662043246,244
1662100359,58
1662129642,58
