1663050638,58
1663080057,58
1663137169,200
1663166448,200
1663223564,238
1663252844,238
1663309969,146
1663339237,146
1663396358,83
1663425653,83
1663482759,65
1663512042,65
1663569159,140
1663598447,140
1663655565,2
1663684725,2
1663741840,174
1663771124,174
1663828239,53
1663857524,53
1663914640,11
1663943934,11
