1688016640,1
1688103041,1
1694583036,1
1694669436,1
1694755834,1
1694842234,1
1694928634,1
1698993045,3
1699079441,1
1699165843,1
1699252253,6
1700548240,1
1700721041,1
1700807441,4
1700893840,2
1700980240,2
