1679584314,1
1679589759,1
1679596397,1
1679602819,1
1679607852,1
1679639432,1
1680845434,1
1682227834,1
1682573432,1
1686288634,1
1687498241,1
1691127048,1
1691213447,11
1691645448,1
1691731846,1
1691818247,1
1691991040,1
1692077440,1
1692163831,1
1692250233,1
1692336633,1
1692423035,1
1692509432,1
1692682233,1
1692768633,1
1692855035,1
1692941433,1
1693027839,1
1693200633,1
1693978232,1
1694496634,1
1694583036,1
1694755834,1
1694842234,1
1694928634,1
1696829444,1
