1679584314,1
1679589759,1
1679596397,1
1679602819,1
1679607852,1
1679639432,1
1680240629,1
1680845434,1
1682573432,1
1683437432,1
1683610233,1
1687498241,1
1688016640,1
1688103041,1
1688362240,1
1688535044,1
1688621445,1
1688707844,1
1688794245,1
1688880644,1
1688967042,1
1689053441,1
1689139840,1
1689226241,1
1689312653,1
1689744640,1
1689831044,1
1689917446,1
1690003846,1
1690522245,1
1690867847,1
1691127048,1
1691645448,2
1691731846,2
1691818247,1
1691904646,1
1691991040,2
1692077440,2
1692163831,2
1692250233,2
1692336633,2
1692423035,2
1692509432,2
1692682233,2
1692768633,2
1692855035,2
1692941433,2
1693027839,2
1693114233,1
1693200633,2
1693978232,1
1694496634,1
1694583036,1
1694669436,1
1694755834,1
1694842234,1
1694928634,1
1695187834,1
1695274234,1
1695360634,1
1695533434,1
1695619839,1
1695965441,1
1696483842,1
1696570241,1
1696656645,1
1696743043,1
1696829444,1
1696915841,1
1697002242,1
1697088641,1
1697261447,1
1697347842,1
1697520642,1
1697607044,1
1697693444,1
1697866244,1
1697952644,1
1698211845,1
1698474646,1
1698561046,1
1698647445,1
1698733843,1
1698993045,1
1699079441,1
1699165843,1
1699252253,4
1700548240,1
1700721041,1
1700807441,2
1700893840,1
1700980240,1
