1659335565,1
1659364847,1
1659421963,4
1659451128,4
1659508368,1
1659537519,1
1659594767,94
1659624049,94
1659681160,3
1659710444,3
1659767561,32
1659796845,32
1659853840,3
1659883130,3
1659940369,93
1659969638,93
1660026647,2
1660056049,2
1660113163,3
1660142439,3
1660199441,14
1660228849,14
1660285970,3
1660315250,3
1660372250,2
1660401521,2
1660458761,2
1660488049,2
1660545162,1
1660574449,1
1660631564,1
1660660730,1
1660717841,3
1660747248,3
1660977162,1
1661006455,1
1661322641,1
1661352051,1
1661409162,1
1661438449,1
1661495561,4
1661524735,4
