1646548229,84
1646634751,109
1646721161,118
1646807431,1112
1646893952,121
1646980230,506
1647066751,131
1647153150,429
1647239550,133
1647325952,148
1647412352,288
1647498752,166
1647585151,137
1647757954,170
1647844355,355
1647930752,141
1648017150,154
1648103550,384
1648189831,132
1648276229,253
1648362752,152
1648449033,180
1648535442,158
1648621952,173
1648708231,176
1648794750,277
1648881149,187
1648967561,410
1649053832,265
