1646980230,30
1647066751,327
1647153150,219
1647239550,113
1647325952,131
1647412352,258
1647498752,272
1647585151,284
1647757954,387
1647844355,254
1647930752,185
1648017150,140
1648103550,265
1648189831,238
1648276229,126
1648362752,129
1648449033,160
1648535442,140
1648621952,279
1648708231,155
1648794750,265
1648881149,137
1648967561,351
1649053832,97
1649140351,292
1649226751,159
1649313029,149
1649399549,252
1649485949,124
1649572354,124
1649658750,204
1649745150,287
1649831565,381
1649917950,166
1650004228,419
1650090628,462
1650177150,410
1650263549,163
1650349831,178
