1657780357,3
1657803090,3
1657804447,3
1657809517,3
1657866760,4
1657896040,4
1657953158,15
1657982325,15
1658039438,4
1658068726,4
1658125843,12
1658155247,12
1658212362,10
1658241661,10
1658298758,16
1658328052,16
1658385041,9
1658414447,9
1658471560,9
1658500847,9
1658557962,11
1658587247,11
1658644360,9
1658673645,9
1658730762,7
1658760045,7
1658817160,8
1658846453,8
1658903439,8
1658932848,8
1658989840,12
1659019246,12
1659076365,4
1659105646,4
