1642392088,1
1642408942,1
1642478484,4
1642564885,2
1642651226,6
1642676514,6
1642805851,6
1642824026,8
1642855125,8
1642910490,11
1642924655,11
1642934565,11
1642937864,11
1642996892,18
1643083292,3
1643169628,3
1643256090,2
1643342487,2
1643428827,4
1643515288,6
1643601634,2
1643622207,2
1643688028,6
1643708607,6
1643774489,6
1643860889,5
1643947288,3
1644033629,3
1644120088,3
1644206493,3
1644292831,2
1644321030,2
1644388289,5
1644407490,5
1644474692,4
1644493888,4
1644561030,4
1644647492,2
1644733834,2
1644770508,2
1644820292,2
