1691818443,10
1691904834,604
1691991184,95
1692077570,291
1692163972,101
1692250382,87
1692336773,254
1692423180,140
1692509573,179
1692595944,26
1692682368,78
1692768764,120
1692855167,93
1692941568,81
1693027980,193
