1689312653,1
1689485439,1
1689744640,1
1690090245,1
1690781448,1
1691040648,1
1691299847,1
1691472645,1
1691559043,1
1691818247,1
1692250233,1
1693027839,1
1693459835,1
1693632645,1
1693719037,1
1694410234,1
1694583036,1
1694669436,1
1695879053,1
1696397445,1
1696570241,1
1696743043,1
1699511438,1
