1646893952,5
1647412352,15
1647498752,12
1647844355,5
1648017150,60
1648103550,2
1648189831,1
1648276229,8
1648362752,2
1648535442,18
1648708231,12
1648794750,2
1648881149,81
1648967561,2
1649226751,218
