1679584314,1
1679589759,1
1679596397,1
1679602819,1
1679607852,1
1679639432,2
1679981431,1
1680845434,1
1681623032,1
1682573432,1
1685770233,2
1685943031,1
1686807032,1
1687498241,1
1688016640,1
1688103041,1
1688362240,1
1688535044,1
1688621445,1
1688707844,1
1688794245,1
1688880644,1
1688967042,1
1689053441,1
1689139840,1
1689226241,1
1689312653,1
1689831044,1
1689917446,1
1690003846,1
1690263047,1
1690522245,1
1690867847,1
1691127048,1
1691213447,11
1691645448,1
1691731846,1
1691818247,1
1691904646,1
1691991040,1
1692077440,1
1692163831,1
1692250233,1
1692336633,1
1692423035,1
1692509432,1
1692682233,1
1692768633,1
1692855035,1
1692941433,1
1693027839,1
1693200633,1
1693978232,1
1694583036,1
1694755834,1
1694842234,1
1694928634,1
1695187834,1
1695274234,1
1695360634,1
1695533434,1
1695619839,1
1695965441,1
1696483842,1
1696656645,1
1696743043,1
1696829444,1
1696915841,1
1697002242,1
1697088641,1
