1636286412,2
1636286488,2
1636895594,103
1636898490,106
1636900709,106
1637070326,77
1637070818,80
1637072812,125
1637122028,162
1637208446,426
1637294806,353
1637381227,567
1637467621,469
1637554087,465
1637589848,465
1637640464,852
1637726914,456
1637813369,420
1637899638,422
1637986004,205
1638072517,598
1638158887,510
1638245235,518
1638331638,383
