1642392088,71
1642408942,71
1642478484,263
1642564885,135
1642651226,254
1642676514,254
1642769502,131
1642771604,131
1642805136,131
1642805851,131
1642824026,128
1642855125,128
1642910490,214
1642924655,214
1642934565,214
1642937864,214
1642996892,208
1643083292,274
1643169628,197
1643256090,290
1643342487,148
1643428827,134
1643515288,206
1643601634,212
1643622207,212
1643688028,155
1643708607,155
1643774489,186
1643860889,183
1643947288,223
1644033629,108
1644120088,165
1644206493,201
1644292831,115
1644321030,115
1644388289,156
1644407490,156
1644474692,211
1644493888,211
1644561030,168
1644647492,221
1644733834,106
1644770508,106
1644820292,184
1644906689,296
1644993090,158
1645079499,106
1645165829,109
1645252290,86
1645338629,116
1645425030,92
1645467113,92
1645470826,92
1645511492,275
1645597892,145
1645684232,336
1645770629,169
1645857150,130
1645943553,141
1646029893,272
1646116237,220
1646202760,140
1646289033,126
1646375551,135
1646461951,285
1646548229,180
1646634751,135
1646721161,174
1646807431,115
1646893952,90
