1654583555,1
1654669837,36
1654756356,25
1654842756,22
1654929156,42
1655015436,23
1655101838,40
1655188357,18
1655274636,31
1655361158,32
1655447555,28
1655533836,27
1655620256,28
1655706645,35
1655793158,33
1655879557,31
1655965955,6
