1660458761,73
1660488049,73
1660545162,114
1660574449,114
1660631564,295
1660660730,295
1660717841,110
1660747248,110
1660804362,219
1660833647,219
1660890760,245
1660920046,245
1660977162,305
1661006455,305
1661063442,121
1661092854,121
1661149842,118
1661179125,118
1661236366,123
1661265647,123
1661322641,90
1661352051,90
1661409162,131
1661438449,131
1661495561,124
1661524735,124
1661581964,101
1661611239,101
1661668363,127
1661697647,127
1661700049,127
1661754784,4
1661784048,4
