1693978232,1
1694151031,1
1694583036,1
1694669436,1
1694755834,1
1694842234,1
1694928634,1
1695274234,1
1695360634,1
1695533434,1
1695619839,1
1696915841,1
1697002242,1
1697088641,1
1697175042,1
1697261447,1
1697347842,1
1697866244,1
1697952644,1
1698211845,1
1698474646,2
1698561046,1
1698647445,1
1698733843,1
1698993045,1
1699165843,1
1699252253,1
1700548240,1
1700807441,2
1700893840,1
1700980240,1
