1617156000,74458
1617242400,70436
1617328800,71797
1617415200,70845
1617501600,69878
1617588000,67842
1617674400,65687
1617760800,67271
1617847200,69045
1617933600,70434
1618020000,70398
1618106400,69685
1618192800,65815
1618279200,66853
1618365600,68867
1618452000,69370
1618538400,69370
1618624800,74331
1618711200,74134
1618797600,69950
1618884000,72218
1618970400,73885
1619056800,76048
1619143200,76976
1619229600,79395
1619316000,77232
1619402400,73333
1619488800,75576
1619575200,76738
1619661600,78913
1619748000,79515
1619834400,71363
1619920800,73460
1620007200,69913
1620093600,72372
1620180000,75153
1620266400,77261
1620352800,78184
1620439200,79843
1620525600,79423
1620612000,75735
1620698400,77572
1620784800,78938
1620871200,80944
1620957600,80874
1621044000,76928
1621130400,76593
1621216800,72779
1621303200,76208
1621389600,78352
1621476000,79220
1621562400,80576
1621648800,80141
1621735200,80057
1621821600,74617
1621908000,76389
1621994400,78492
1622080800,80220
1622167200,81664
1622253600,82715
1622340000,81265
1622426400,74823
1622512800,75568
1622599200,75675
1622685600,76183
1622772000,77118
1622858400,77101
1622944800,77138
1623031200,76031
1623117600,75738
1623204000,76094
1623290400,76716
1623376800,77386
1623463200,77337
1623549600,76651
1623636000,76135
1623722400,75614
1623808800,76135
1623895200,75325
1623981600,77818
1624068000,77538
1624154400,76119
1624240800,72698
1624327200,72920
1624413600,74514
1624500000,75200
1624672800,74228
1624759200,73179
1624845600,70084
1624932000,71142
1625018400,72907
1625104800,71728
1625191200,70403
1625277600,68945
1625364000,68500
1625450400,66316
1625536800,67504
1625623200,69928
1625709600,70908
1625796000,73267
1625882400,74426
1625968800,73895
1626055200,71853
1626141600,72971
1626228000,73744
1626314400,74191
1626400800,74394
1626487200,74849
1626573600,73944
1626660000,72199
1626746400,73762
1626832800,74228
1626919200,75345
1627005600,73812
1627092000,73297
1627178400,73126
1627264800,71667
1627351200,72538
1627437600,73285
1627524000,74118
1627610400,74484
1627696800,73833
1627783200,70339
1627869600,68061
1627956000,69142
1628042400,70885
1628128800,71043
1628215200,72448
1628301600,71962
1628388000,70781
1628474400,67775
1628560800,67905
1628647200,69650
1628733600,70541
1628906400,71922
1628992800,71507
1629079200,65161
1629165600,64467
1629252000,66935
1629338400,69023
1629424800,71321
1629511200,72449
1629597600,72266
1629684000,67964
1629770400,67934
1629856800,70251
1629943200,71946
1630029600,76893
1630116000,78588
1630202400,77714
1630288800,74941
1630375200,75791
1630461600,70232
1630548000,71609
1630634400,74704
1630720800,75814
1630807200,76304
1630893600,72768
1630980000,74172
1631066400,76431
1631152800,78347
1631239200,80642
1631325600,81248
1631412000,81948
1631498400,77896
1631584800,79313
1631671200,82513
1631757600,83163
1631844000,84573
1631930400,85096
1632016800,85024
1632103200,80109
1632189600,80113
1632276000,82283
1632362400,86024
1632448800,87630
1632535200,85514
1632621600,88421
1632708000,84365
1632794400,85974
1632880800,88135
1632967200,88135
1633053600,84279
1633140000,83522
1633226400,83965
1633312800,79350
1633399200,80159
1633485600,83997
1633572000,87066
1633658400,89285
1633744800,90557
1633831200,89148
1633917600,84634
1634004000,86353
1634090400,88489
1634176800,89718
1634263200,90797
1634349600,91676
1634436000,90743
1634522400,86336
1634695200,91311
1634781600,91408
1634868000,92271
1634954400,94163
1635040800,93460
1635127200,88980
1635213600,90914
1635300000,92710
1635386400,95154
1635472800,96711
1635559200,97640
1635645600,96425
1635732000,85819
1635818400,86956
1635904800,89661
1635991200,91849
1636077600,93276
1636164000,94977
1636250400,94143
1636336800,89833
1636423200,91444
1636509600,93831
1636596000,95383
1636682400,96982
1636768800,98368
1636855200,98211
1637028000,93266
1637114400,95314
1637200800,97737
1637287200,99191
1637373600,100195
1637460000,99817
1637546400,94174
1637632800,94693
1637719200,98649
1637805600,100302
1637892000,100927
1637978400,101045
1638064800,100481
1638151200,95893
1638237600,96839
1638324000,91336
1638410400,92330
1638496800,93018
1638583200,93872
1638669600,92572
1638756000,88150
1638842400,90164
1638928800,91085
1639015200,93402
1639101600,93801
1639188000,94727
1639274400,94121
1639360800,88831
1639447200,88832
1639533600,93390
1639620000,94545
1639706400,95252
1639879200,95787
1639965600,91593
1640052000,93719
1640138400,96884
1641175200,93142
1641261600,90576
1641348000,94510
1641434400,95711
1641520800,95192
1641693600,93374
1641780000,85165
1641866400,84641
1641952800,87171
1642039200,89049
1642125600,91626
1642212000,92739
1642298400,91441
1642384800,84866
1642730400,96267
1642816800,97559
1642816800,97559
1642816800,97559
1642816800,97559
1642903200,97243
1642989600,93341
1642989600,93341
1642989600,93341
1643162400,99007
1643248800,102179
1643680800,95405
1643767200,98483
1644372000,107842
1644458400,109870
1644458400,109870
1644544800,112283
1644544800,112283
1644631200,113334
1644717600,109846
1644804000,107473
1644804000,107473
1644890400,109068
1644976800,111444
1645063200,113778
1645149600,114958
1645236000,117084
1645322400,116496
1645408800,110209
1645495200,111500
1645495200,111500
1645495200,111500
1645581600,115192
1645668000,117337
1645754400,119619
1645840800,120524
1645927200,120037
1646013600,114618
1646100000,106842
1646186400,107549
1646272800,110195
1646359200,112726
1646445600,113845
1646532000,108972
1646618400,108808
1646704800,110374
1646791200,113031
1646877600,115736
1646964000,117105
1647050400,119540
1647136800,118468
1647223200,112609
1647309600,114021
1647396000,115681
1647482400,118473
1647568800,120031
1647655200,121108
1647741600,119785
1647914400,115364
1648000800,118712
1648087200,120518
1648173600,123403
1648346400,119416
1648432800,114886
1648519200,121090
1648605600,123493
1648692000,125918
1648778400,116867
1648864800,117006
1648951200,117238
1649037600,111937
1649124000,114139
1649210400,117296
1649296800,119820
1649383200,121699
1649469600,123050
1649556000,122271
1649642400,116326
1649728800,118888
1649815200,122161
1649901600,124429
1649988000,125230
1650074400,121517
1650160800,119950
1650247200,110952
1650333600,110895
1650420000,113162
1650506400,114859
1650592800,117206
1650679200,118265
1650765600,117777
1650852000,111231
1650938400,112897
1651024800,116052
1651111200,118835
1651197600,120318
1651284000,120800
1651370400,109732
1651456800,104225
1651543200,107411
1651629600,112072
1651716000,114390
1651802400,117012
1651888800,118432
1651975200,117679
1652061600,112087
1652148000,109498
1652234400,116912
1652320800,119471
1652407200,122598
1652493600,124051
1652580000,123170
1652666400,116804
1652752800,118710
1652839200,121574
1652839200,121574
1652925600,125070
1653012000,126345
1653184800,123946
1653271200,119375
1653357600,121882
1653444000,124058
1653444000,124058
1653444000,124058
1653703200,123448
1653789600,121795
1653876000,115189
1653962400,116462
1654048800,108095
1654135200,108101
1654221600,110839
1654308000,111688
1654394400,110630
1654480800,105915
1654567200,102960
1654653600,104304
1654740000,106592
1654826400,109118
1654912800,108748
1654999200,107727
1655085600,101911
1655172000,102934
1655258400,105202
1655344800,104597
1655431200,106311
1655517600,107355
1655604000,105719
1655690400,100849
1655863200,103228
1655949600,104475
1656036000,105447
1656122400,104118
1656208800,103002
1656295200,99567
1656381600,99843
1656468000,102387
1656554400,103907
1656640800,95933
1656813600,96711
1656900000,93939
1656986400,95937
1657072800,98107
1657159200,99953
1657245600,101448
1657332000,102845
1657418400,102253
1657504800,99754
1657591200,100557
1657677600,102221
1657764000,101426
1657850400,102009
1657850400,102009
1657850400,102009
1657936800,100121
1657936800,100121
1658023200,100478
1658023200,100478
1658109600,97662
1658109600,97662
1658196000,100003
1658196000,100003
1658282400,99914
1658282400,99914
1658368800,100630
1658368800,100630
1658455200,99989
1658455200,99989
1658541600,100385
1658541600,100385
1658628000,100561
1658628000,100561
1658714400,98839
1658714400,98839
1658800800,100975
1658800800,100975
1658887200,101736
1658887200,101736
1658973600,102037
1658973600,102037
1659060000,102322
1659060000,102322
1659146400,101686
1659146400,101686
1659232800,100421
1659232800,100421
1659319200,93117
1659319200,93117
1659405600,94019
1659405600,94019
1659492000,95063
1659492000,95063
1659578400,97513
1659578400,97513
1659664800,98076
1659664800,98076
1659751200,97913
1659751200,97913
1659837600,97137
1659837600,97137
1659924000,92448
1659924000,92448
1660010400,93738
1660010400,93738
1660096800,96868
1660096800,96868
1660183200,98945
1660183200,98945
1660269600,100340
1660269600,100340
1660356000,100880
1660356000,100880
1660442400,100167
1660442400,100167
1660528800,93588
1660528800,93588
1660615200,93439
1660615200,93439
1660701600,96021
1660701600,96021
1660788000,96871
1660788000,96871
1660874400,100261
1660874400,100261
1660960800,101839
1660960800,101839
1661047200,101080
1661047200,101080
1661133600,95027
1661133600,95027
1661220000,97481
1661220000,97481
1661306400,99977
1661306400,99977
1661392800,97392
1661392800,97392
1661479200,103626
1661479200,103626
1661565600,104165
1661565600,104165
1661652000,99547
1661652000,99547
1661738400,100934
1661738400,100934
1661738400,100934
1661824800,101857
1661824800,101857
1661911200,104826
1661997600,94073
1661997600,94073
1662084000,95069
1662084000,91465
1662170400,93425
1662170400,93425
1662256800,92807
1662256800,92807
1662343200,88804
1662343200,93830
1662429600,94744
1662429600,96213
1662516000,97584
1662516000,98717
1662602400,95003
1662602400,95003
1662688800,96763
1662688800,96763
1662775200,98560
1662775200,98560
1662861600,98519
1662861600,98519
1662948000,93701
1662948000,93701
1663034400,95741
1663034400,95741
1663120800,98488
1663120800,98488
1663207200,100114
1663207200,100114
1663293600,100883
1663293600,100883
1663380000,102907
1663380000,102907
1663466400,101161
1663466400,101161
1663552800,96531
1663552800,96531
1663639200,98060
1663639200,98060
1663725600,99915
1663725600,99915
1663812000,96942
1663812000,96942
1663898400,101618
1663898400,101618
1663984800,103647
1663984800,103647
1664071200,101597
1664071200,101597
1664157600,97328
1664157600,97328
1664244000,99422
1664244000,99422
1664330400,102255
1664330400,102255
1664416800,103691
1664416800,103691
1664503200,105353
1664503200,105353
1664503200,105353
1664503200,105353
1664503200,105353
1664503200,105353
1668391200,95772
1668391200,95772
1668391200,95772
1668391200,95772
1668477600,96471
1668564000,99123
1668650400,95967
1671588000,94150
1671588000,94150
1671588000,94150
1671588000,94150
1671588000,94150
1671588000,94150
1671588000,94150
1671588000,94150
1671674400,97392
1671674400,97392
1671674400,97392
1671674400,97392
1671674400,97392
1671674400,97392
1673575200,94282
1674439200,93962
1674525600,95705
1674612000,98181
1674698400,100461
1674784800,102512
1674871200,103012
1674957600,25449
1675044000,98945
1675130400,100500
1675216800,94041
1675303200,96868
1675389600,95198
1675476000,101692
1675562400,100995
1675648800,97360
1675735200,0
1675821600,102294
1675908000,104451
1675994400,106807
1676080800,108166
1676167200,107624
1676253600,102941
1676340000,96145
1676426400,98530
1676512800,99012
1676599200,100494
1676685600,101162
1676772000,101051
1676858400,96389
1676944800,106268
1677031200,30760
1677117600,110826
1677204000,112291
1677204000,112291
1677376800,111774
1677463200,107242
1677549600,107135
1677636000,100904
1677722400,102738
1677808800,104837
1677895200,106526
1677981600,105537
1678068000,100998
1678154400,103684
1678240800,106358
1678327200,107925
1678413600,109363
1678413600,109363
1678500000,105036
1678586400,104641
1678672800,100149
1678759200,107097
1678759200,107097
1678759200,107097
1678845600,109305
1678932000,110289
1678932000,110289
1679018400,103476
1679104800,109650
1679277600,104285
1679364000,105416
1679450400,111555
1679536800,112981
1679536800,112981
1679623200,115033
1679623200,115033
1679623200,115033
1679623200,115033
1679623200,115033
1679623200,115033
1679623200,115033
1679623200,115033
1679623200,115033
1679709600,116568
1679796000,115575
1679882400,111098
1679968800,102989
1680055200,105225
1680141600,107472
1680228000,108870
1680314400,100382
1680400800,99260
1680487200,95040
1680573600,97584
1680660000,101713
1680746400,103368
1680832800,106367
1680919200,104428
1681005600,103137
1681092000,98607
1681178400,95799
1681264800,98526
1681351200,100279
1681437600,103147
1681524000,105058
1681610400,103398
1681696800,97199
1681783200,98472
1681869600,102298
1681956000,103474
1682042400,103801
1682128800,104015
1682215200,102884
1682301600,99016
1682388000,96014
1682474400,98397
1682560800,105889
1682647200,105379
1682733600,106194
1682820000,105715
1682906400,93045
1682992800,92971
1683079200,103757
1683165600,107152
1683252000,103283
1683338400,104344
1683424800,100306
1683511200,96619
1683597600,98954
1683684000,101865
1683770400,104625
1683856800,106577
1683943200,107696
1684029600,107896
1684116000,103125
1685584800,93560
1685671200,94378
1685757600,94963
1685844000,93853
1685930400,89741
1686016800,90142
1686103200,88734
1686189600,89009
1686276000,90035
1686362400,89920
1686448800,88616
1686535200,84257
1686621600,85443
1686708000,87162
1686708000,87162
1686880800,87044
1686967200,86383
1687053600,85328
1687140000,81800
1687226400,82977
1687312800,84146
1687485600,86822
1687572000,85002
1687658400,83539
1687744800,80084
1687831200,80964
1687917600,82956
1688004000,83984
1688090400,84729
1688176800,78827
1688263200,77564
1688349600,74979
1688436000,76390
1688608800,79857
1688695200,81116
1688781600,82239
1688868000,82138
1688954400,80015
1689040800,81353
1689127200,81718
1689213600,82935
1689300000,83385
1689386400,84053
1689472800,83411
1689559200,81767
1689645600,82486
1689732000,83314
1689818400,83149
1689904800,83254
1689991200,84074
1690077600,83508
1690164000,82622
1690250400,83386
1690336800,84566
1690423200,84585
1690509600,84448
1690596000,84389
1690682400,83833
1690768800,74741
1690855200,78725
1690941600,79367
1691028000,80423
1691114400,81529
1691200800,81799
1691287200,81185
1691373600,78376
1691460000,79349
1691546400,81168
1691632800,82650
1691719200,83637
1691805600,83271
1691892000,82744
1691978400,78306
1692064800,78563
1692151200,80086
1692237600,81634
1692324000,82739
1692410400,83644
1692496800,83202
1692583200,78731
1692669600,79675
1692756000,81609
1692842400,83247
1692928800,84607
1693015200,85393
1693101600,84620
1693188000,81634
1693274400,82893
1693360800,84420
1693447200,80462
1693533600,72698
1693620000,74378
1693706400,73472
1693792800,70785
1693879200,71877
1693965600,73878
1694052000,75335
1694138400,75854
1694224800,76763
1694311200,75747
1694397600,72392
1694484000,73303
1694570400,74829
1694656800,75832
1694743200,76496
1694829600,76397
1694916000,76381
1695002400,73091
1695088800,74060
1695261600,76602
1695348000,77904
1695434400,78983
1695520800,78346
1695607200,74935
1695693600,76056
1695780000,77519
1695866400,79364
1695952800,80132
1696039200,79921
1696125600,72363
1696212000,69379
1696298400,70878
1696384800,72791
1696471200,74148
1696557600,75181
1696644000,75997
1696730400,75147
1696816800,72295
1696903200,73700
1696989600,75530
1697076000,76256
1697162400,77142
1697248800,77507
1697335200,76745
1697421600,72955
1697508000,73992
1697594400,75207
1697680800,75628
1697767200,76233
1697853600,76200
1697940000,74850
1698026400,71234
1698026400,71234
1698199200,73362
1698285600,73682
1698372000,74269
1698458400,74035
1698544800,73912
1698631200,70887
1698717600,71459
1698804000,67528
1698890400,67104
1698976800,69348
1699063200,69390
1699149600,68392
1699236000,64962
1699322400,65254
1699408800,67664
1699495200,68892
1699581600,70308
1699668000,68691
1699754400,67970
1699840800,64331
1699927200,67476
1700013600,68899
1700100000,68668
1700186400,66183
1700272800,66712
1700359200,66662
1700445600,63591
1700532000,65221
1700618400,66516
1700704800,67199
1700791200,67532
1700877600,67944
1700964000,67731
1701050400,65208
