1654669837,1
1654842756,1
1654929156,1
1655015436,1
1655274636,12
1655620256,1
1656052365,14
1656138754,1
1656397956,6
1656484356,2
1656743558,29
1657089163,7
1657261838,17
1657348240,1
1657434758,56
1657521164,18
1657607566,19
1657693957,38
1657780357,20
1657803090,20
1657804447,20
1657809517,20
