1693632754,3
1693719144,4
1693805540,249
1693891949,3
1693978362,8
1694064749,8
1694151151,10
1694237547,15
1694323959,11
1694410362,4
1694496769,3
1694583178,7
1694669562,5
1694755972,8
1694842363,12
1694928766,4
1695015165,1
