1639904549,3
1639907950,3
1639980923,4
1639983233,4
1639985995,4
1640059226,5
1640080313,5
1640145685,3
1640232083,5
1640318424,5
1640404823,5
1640491284,2
1640577691,4
1640664024,8
1640750484,5
1640836884,2
1640923223,5
1641009626,6
1641096084,3
1641182484,16
1641268824,14
1641355224,19
1641441684,18
1641528084,25
1641700884,17
1641787224,17
1641873686,23
1642305627,16
1642319122,16
1642392088,9
1642408942,9
1642478484,17
1642564885,15
1642651226,20
1642676514,20
1642769502,15
1642771604,15
1642805136,15
1642805851,15
1642824026,18
1642855125,18
1642910490,15
1642924655,15
1642934565,15
1642937864,15
1642996892,14
1643083292,17
1643169628,14
1643256090,24
1643342487,15
1643428827,7
1643515288,3
1643601634,8
1643622207,8
1643688028,3
1643708607,3
1643774489,5
1643860889,4
1643947288,5
1644033629,4
1644120088,6
1644206493,3
1644292831,14
1644321030,14
1644388289,4
1644407490,4
1644474692,14
1644493888,14
1644561030,11
1644647492,6
1644733834,2
1644770508,2
1644820292,2
1644906689,5
1644993090,7
1645079499,3
