1654237831,2
1654324351,16
1654410631,18
1654497153,24
1654583555,20
1654669837,15
1654756356,10
1654842756,2
1654929156,16
1655015436,5
1655101838,4
1655274636,10
1655361158,12
1655447555,7
1655533836,5
