1679584314,1
1679589759,1
1679596397,1
1679602819,1
1679607852,1
1679639432,1
1679981431,1
1680240629,1
1680845434,1
1681623032,1
1682573432,1
1697693444,1
1697866244,1
1697952644,1
1698211845,1
1698474646,2
1698561046,1
1698647445,1
1698733843,1
1698906644,1
1698993045,1
1699079441,1
1699165843,1
1699252253,6
1699338639,1
1699425038,1
1699597838,2
1699684239,1
1699770639,1
1699943446,1
1700116239,2
1700202637,4
1700548240,2
1700721041,2
1700807441,4
1700893840,2
1700980240,3
