1636895594,2
1636898490,2
1636900709,2
1637070326,7
1637070818,9
1637072812,22
1637122028,25
1637208446,26
1637294806,9
1637381227,6
1637467621,27
1637554087,6
1637589848,6
1637726914,7
1637813369,5
1638072517,3
1638158887,8
1638245235,5
1638331638,21
1639904549,3
1639907950,3
1639980923,15
1639983233,15
1639985995,15
1640059226,30
1640080313,30
1640145685,9
1640232083,4
1640318424,10
1640404823,6
1640491284,11
1640577691,5
1640664024,11
1640750484,7
1640836884,11
1640923223,9
1641009626,8
1641096084,5
1641182484,5
1641268824,8
1641355224,9
1641441684,5
1641528084,8
1641700884,3
1641787224,9
1641873686,3
1642392088,8
1642408942,8
1642478484,12
1642564885,2
1642651226,12
1642676514,12
1642805851,8
1642824026,14
1642855125,14
1642910490,9
1642924655,9
1642934565,9
1642937864,9
1642996892,20
1643083292,4
1643169628,2
1643256090,6
1643342487,16
1643428827,7
1643515288,13
1643601634,10
1643622207,10
1643688028,20
1643708607,20
1643774489,13
1643860889,14
1643947288,15
1644033629,29
1644120088,24
1644206493,6
1644292831,8
1644321030,8
1644388289,21
1644407490,21
1644474692,11
1644493888,11
1644561030,7
1644647492,12
1644733834,6
1644770508,6
1644820292,20
1644906689,10
1644993090,9
1645079499,2
1645165829,7
1645252290,9
1645338629,4
1645425030,9
1645467113,9
1645470826,9
1645511492,12
1645597892,8
1645684232,7
1645770629,9
1645857150,36
1645943553,7
1646029893,5
1646116237,7
1646202760,4
1646289033,13
1646375551,29
1646461951,5
1646548229,6
1646634751,4
1646721161,53
1646807431,4
1646893952,23
1646980230,5
1647066751,15
1647153150,9
1647239550,7
1647325952,4
1647412352,19
1647498752,68
1647585151,7
1647757954,10
1647844355,8
1647930752,7
1648017150,8
1648103550,5
1648189831,7
1648276229,46
1648362752,7
1648449033,4
1648535442,6
1648621952,8
1648708231,13
1648794750,4
1648881149,8
1648967561,31
1649053832,5
1649140351,11
1649226751,5
1649313029,12
1649399549,5
1649485949,9
1649572354,66
1649658750,8
1649745150,7
1649831565,7
1649917950,8
1650004228,8
1650090628,7
1650177150,16
1650263549,4
1650349831,17
1650436229,16
1650522756,8
1650609163,6
1650695550,7
1650781953,38
1650868349,5
1650954630,15
1651041030,5
1651127552,24
1651213951,20
1651300352,7
1651386755,8
1651473034,14
1651559564,4
1651645850,6
1651732362,14
1651818753,15
1651905153,8
1651991564,18
1652077954,50
1652164360,12
1652250764,20
1652337032,8
1652423553,12
1652509832,20
1652596232,10
1652682759,7
1652769160,10
1652855561,8
1652941964,5
1653028353,12
1653114753,9
1653201159,7
1653287558,50
1653373954,6
1653460234,11
1653546755,9
1653633154,17
1653719553,7
1653805957,6
1653892236,11
1653978755,7
1654065033,8
1654151553,8
1654237831,9
1654324351,8
1654410631,6
1654497153,20
1654583555,4
1654669837,8
1654756356,7
1654842756,57
1654929156,10
1655015436,7
1655101838,5
1655188357,6
1655274636,5
1655361158,11
1655447555,6
1655533836,8
1655620256,18
1655706645,16
1655793158,8
1655879557,12
1655965955,22
1656052365,18
1656138754,6
1656225155,20
1656311556,7
1656397956,16
1656484356,10
1656570758,22
1656743558,38
1656829841,10
1656916357,12
1657002637,10
1657089163,7
1657175559,8
1657261838,17
1657348240,4
1657434758,33
1657521164,86
1657607566,9
1657693957,4
1657780357,116
1657803090,116
1657804447,116
1657809517,116
1657866760,22
1657896040,22
1657953158,9
1657982325,9
1658039438,11
1658068726,11
1658125843,9
1658155247,9
1658212362,99
1658241661,99
1658298758,191
1658328052,191
1658385041,98
1658414447,98
1658471560,187
1658500847,187
1658557962,98
1658587247,98
1658644360,8
1658673645,8
1658730762,46
1658760045,46
1658817160,9
1658846453,9
1658903439,8
1658932848,8
1658989840,13
1659019246,13
1659076365,15
1659105646,15
1659162770,10
1659192044,10
1659249159,8
1659278470,8
1659335565,21
1659364847,21
1659421963,15
1659451128,15
1659508368,38
1659537519,38
1659594767,10
1659624049,10
1659681160,30
1659710444,30
1659767561,19
1659796845,19
1659853840,18
1659883130,18
1659940369,22
1659969638,22
1660026647,9
1660056049,9
1660113163,10
1660142439,10
1660199441,22
1660228849,22
1660285970,17
1660315250,17
1660372250,18
1660401521,18
1660458761,13
1660488049,13
1660545162,105
1660574449,105
1660631564,22
1660660730,22
1660717841,14
1660747248,14
1660804362,9
1660833647,9
1660890760,41
1660920046,41
1660977162,18
1661006455,18
1661063442,8
1661092854,8
1661149842,12
1661179125,12
1661236366,9
1661265647,9
1661322641,10
1661352051,10
1661409162,11
1661438449,11
1661495561,8
1661524735,8
1661581964,11
1661611239,11
1661668363,177
1661697647,177
1661700049,177
1661754784,13
1661784048,13
1661870448,36
1661927560,12
1661956724,12
1662013964,9
1662043246,9
1662100359,10
1662129642,10
1662186760,11
1662216045,11
1662273039,14
1662302447,14
1662359559,9
1662388727,9
1662445958,12
1662475124,12
1662532358,21
1662561643,21
1662618758,11
1662647931,11
1662705164,42
1662734437,42
1662791558,11
1662820724,11
1662877847,10
1662907237,10
1662964357,94
1662993645,94
1663050638,8
1663080057,8
1663137169,9
1663166448,9
1663223564,9
1663252844,9
1663309969,8
1663339237,8
1663396358,9
1663425653,9
1663482759,19
1663512042,19
1663569159,10
1663598447,10
1663655565,8
1663684725,8
1663741840,11
1663771124,11
1663828239,10
1663857524,10
1663914640,20
1663943934,20
1664001039,9
1664030318,9
1664087438,8
1664116722,8
1664173842,13
1664203127,13
1664260251,8
1664289537,8
1664346641,25
1664375951,25
1664433041,9
1664462320,9
1664519554,20
1664548711,20
1664605833,8
1664635111,8
1668081545,1
1668350533,40
1668355972,40
1668356757,40
1668360810,40
1668474184,5
1668560577,4
1668646979,6
1671629111,440
1671630664,440
1671632450,440
1671634011,440
1673516775,5
1674367285,13
1674455475,4
1674541884,14
1674628285,4
1674714694,13
1674801082,10
1674887480,16
1674973872,18
1675060281,7
1675146682,12
1675233071,5
1675319481,6
1675405883,446
1675492281,17
1675578681,7
1675665075,19
1675751474,13
1675837863,45
1676356254,6
1676442661,23
1676529061,33
1676615450,9
1676701857,13
1676788249,21
1676874662,15
1676961061,8
1677047454,5
1677133857,20
1677220262,18
1677306660,8
1677393061,8
1677479458,9
1677565859,5
1677652257,9
1677738657,6
1677825057,9
1677911460,4
1677997847,5
1678084257,4
1678170666,6
1678257055,4
1678343445,22
1679569142,10
1679584407,10
1679589867,10
1679596494,10
1679602915,10
1679607956,10
1679639532,70
1679722309,5
1679808717,15
1679895117,5
1679981518,4
1680067912,4
1680154308,9
1680240714,9
1680327097,9
1680413504,9
1680499902,5
1680586299,7
1680672702,4
1680759104,5
1680845523,6
1680931899,12
1681018301,5
1681104713,4
1681191117,6
1681277516,5
1681363906,5
1681450306,7
1681536706,5
1681623105,11
1681709528,4
1681795909,20
1681882326,7
1681968706,4
1682055103,6
1682141505,5
1682227910,4
1682314324,7
1682400707,9
1682487105,4
1682746309,4
