1693632754,2
1693719144,4
1693805540,23
1693891949,2
1693978362,11
1694064749,12
1694151151,9
1694237547,7
1694323959,22
1694410362,7
1694496769,10
1694583178,11
1694669562,10
1694755972,3
1694842363,9
1694928766,7
1695015165,3
1695187975,20
1695274380,3
1695360784,2
1695447164,3
1695533586,1
