1679639432,1
1688016640,1
1688103041,1
1688362240,1
1688621445,1
1688707844,1
1688794245,1
1688880644,1
1688967042,1
1689053441,1
1689139840,1
1689226241,1
1689312653,1
1689831044,1
1689917446,1
1690003846,1
1690263047,1
1690522245,1
1690867847,1
1691127048,1
1691645448,1
1691731846,1
1691818247,1
1691904646,1
1691991040,1
1692077440,1
1692163831,1
1692250233,2
1692336633,2
1692423035,2
1692509432,2
1692682233,2
1692768633,1
1692855035,1
1692941433,1
1693027839,1
1693200633,1
1697175042,2
1697261447,2
1697347842,2
1697520642,2
1697607044,2
1697693444,2
1697866244,2
1697952644,2
1698211845,2
1698474646,3
1698561046,2
1698647445,2
1698733843,3
1698993045,4
1699079441,2
1699165843,2
1699252253,11
1699338639,2
1699425038,2
1699597838,4
1699684239,2
1699770639,2
1699943446,2
1700116239,2
1700202637,4
1700548240,2
1700721041,2
1700807441,2
1700893840,1
1700980240,1
