1688016640,1
1688103041,1
1688707844,1
1688794245,1
1688880644,1
1695533434,1
1695619839,1
1697002242,1
1697088641,1
1697175042,1
1697261447,1
1697347842,1
1699597838,1
1699684239,1
1699770639,1
1700807441,2
1700893840,1
1700980240,1
