1646202760,83
1646289033,102
1646375551,23
1646461951,10
1646893952,7
1646980230,183
1647239550,5
1647325952,3
1647412352,25
1647498752,12
1647757954,3
1647844355,3
1647930752,1
1648017150,69
1648276229,1
