1695360634,8
1695533434,8
1695619839,8
1695965441,7
1696483842,7
1696570241,4
1696656645,7
1696743043,7
1696829444,7
1696915841,7
1697002242,6
1697088641,6
1697261447,6
1697347842,6
1697520642,6
1697607044,6
1697693444,6
1697866244,6
1697952644,6
1698039045,2
1698211845,5
1698474646,7
1698561046,5
1698647445,5
1698733843,5
1698993045,7
1699079441,5
1699165843,5
1699252253,25
1699338639,2
1699425038,4
1699597838,7
1699684239,4
1699770639,4
1699943446,4
1700029845,2
1700116239,4
1700202637,8
1700548240,3
1700634640,2
1700721041,3
1700807441,6
1700893840,3
1700980240,3
