1643428818,1
1643860818,1
1644292820,1
1644321017,1
1644561017,2
1644647419,1
1644733822,1
1644770413,1
1644820219,1
1644993017,2
1645252217,1
1645511417,1
1645943421,1
1646029817,2
1646375417,1
1646721028,1
1647066619,1
1647239417,1
1648189818,7
1648449020,2
1648621818,2
1648967418,1
1649140217,1
1649658616,6
1649831431,1
1650177019,1
1650349817,1
1650436217,1
1650522617,2
1650609029,1
1650695416,8
1650781820,1
1650868217,1
1650954617,2
1651041017,1
1651127418,1
1651213817,7
1651300219,1
1651386622,1
1651473017,1
1651559421,2
1651645827,1
1651818617,2
1651905018,1
1651991417,2
1652077818,1
1652164218,1
1652250621,1
1652423417,1
1652509817,1
1652596217,1
1652769018,1
1652855418,1
1653028217,1
1653201018,1
1653373818,1
1653546617,1
1653633018,1
1653719418,1
1653805821,2
1653892219,1
1654065018,2
1654151419,1
1654237818,1
1654324218,9
1654410618,1
1654497019,1
1654756220,1
1654842619,1
1654929020,1
1655015420,1
1655101820,1
1655188220,1
1655361020,1
1655533820,1
1655620219,1
1655706620,1
1655879419,1
1656311420,2
1661236224,7
1661265501,7
1661754643,1
1661783901,1
1661870301,1
1661927420,1
1661956700,1
1663914621,1
1663943902,1
1664173822,1
1664203101,1
1680759032,1
1681018231,1
1681709434,1
1682919034,1
1686547832,1
1686807032,1
1690090245,1
1691991040,1
1697347842,1
