1645770629,27
1645857150,113
1645943553,155
1646029893,292
1646116237,442
1646202760,136
1646289033,134
1646375551,212
1646461951,285
1646548229,130
1646634751,126
1646721161,140
1646807431,215
1646893952,260
1646980230,269
1647066751,212
