1685544777,138
1685597496,143
1685683902,491
1685770303,70
1685856701,87
1685943100,155
1686029502,352
1686115904,158
1686202306,184
1686288711,110
1686375108,183
1686461512,220
1686547909,98
1686634309,109
1686720704,61
1686807105,122
1686893562,72
1686979954,103
1687066360,800
1687152774,439
1687239150,89
1687411953,96
1687498393,114
1687584774,76
