1645338629,3
1645425030,4
1645467113,4
1645470826,4
1645511492,3
1645597892,4
1645684232,3
1645770629,4
1645857150,7
1645943553,2
1646029893,6
1646116237,8
1646202760,6
1646289033,5
1646375551,4
1646461951,1
1646548229,2
1646634751,2
1646721161,5
1646807431,5
1646893952,2
1646980230,8
1647066751,3
1647153150,6
1647239550,6
1647325952,7
1647412352,5
1647498752,5
1647585151,3
1647757954,4
1647844355,6
1647930752,3
1648017150,6
1648103550,6
1648189831,4
1648276229,2
1648362752,4
1648449033,5
1648535442,6
1648621952,3
1648708231,11
