1662100359,6
1662129642,6
1662186760,2
1662216045,2
1662273039,2
1662302447,2
1662359559,2
1662388727,2
1662445958,2
1662475124,2
1662705164,2
1662734437,2
1662791558,7
1662820724,7
1662877847,1
1662907237,1
1662964357,5
1662993645,5
1663050638,4
1663080057,4
1663137169,2
1663166448,2
1663223564,39
1663252844,39
1663309969,4
1663339237,4
