1674714694,2
1674801082,2
1674887480,2
1674973872,3
1675060281,2
1675146682,9
1675233071,2
1675319481,2
1675405883,2
1675492281,2
1675578681,2
1675751474,39
1675837863,2
1676442661,2
1676615450,2
1676701857,2
1676788249,2
1676874662,2
1676961061,2
1677047454,2
1677133857,2
1677220262,2
1677306660,2
1677393061,2
1677479458,2
1677565859,2
1677738657,2
1677825057,2
1677911460,2
1677997847,2
1678084257,2
1678257055,2
1678343445,10
1679569142,4
1679584407,4
1679589867,4
1679596494,4
1679602915,4
1679607956,4
1679639532,18
1679722309,2
1679808717,12
1679895117,2
1679981518,2
1680067912,2
1680154308,2
1680240714,2
1680327097,2
1680413504,2
1680499902,2
1680586299,2
1680672702,2
1680845523,2
1680931899,2
1681018301,2
1681104713,2
1681191117,2
1681277516,2
1681363906,2
1681450306,2
1681536706,2
1681623105,2
1681795909,12
1681882326,2
1681968706,2
1682055103,2
1682141505,2
1682227910,2
1682400707,2
1682487105,2
