1655879557,13
1655965955,295
1656052365,158
1656138754,180
1656225155,128
1656311556,143
1656397956,131
1656484356,141
1656570758,223
1656743558,262
1656829841,399
1656916357,127
1657002637,139
1657089163,225
1657175559,259
1657261838,221
1657348240,173
1657434758,191
1657521164,188
1657607566,125
1657693957,154
1657780357,90
1657803090,90
1657804447,90
1657809517,90
