1655274636,16
1655361158,38
1655447555,43
1655533836,31
1655620256,38
1655706645,32
1655793158,39
1655879557,32
1655965955,25
1656052365,37
1656138754,25
1656225155,34
1656311556,28
1656397956,21
1656484356,29
1656570758,35
1656743558,28
1656829841,40
1656916357,40
1657002637,33
1657089163,31
1657175559,29
1657261838,28
1657348240,39
1657434758,48
1657521164,42
1657607566,43
1657693957,39
1657780357,35
1657803090,35
1657804447,35
1657809517,35
1657866760,32
1657896040,32
