1637899638,6
1637986004,21
1638072517,35
1638158887,10
1638245235,25
1638331638,14
1639904549,16
1639907950,16
1639980923,31
1639983233,31
1639985995,31
1640059226,24
1640080313,24
1640145685,20
1640232083,15
1640318424,23
1640404823,18
1640491284,29
1640577691,18
1640664024,19
1640750484,13
1640836884,17
1640923223,18
1641009626,16
1641096084,24
1641182484,30
1641268824,33
1641355224,26
1641441684,30
1641528084,26
1641700884,39
1641787224,34
1641873686,26
1642305627,46
1642319122,46
1642392088,32
1642408942,32
1642478484,38
1642564885,30
1642651226,27
1642676514,27
1642769502,34
1642771604,34
1642805136,34
1642805851,34
1642824026,34
1642855125,34
1642910490,138
1642924655,138
1642934565,138
1642937864,138
1642996892,40
1643083292,34
1643169628,31
1643256090,26
1643342487,29
1643428827,14
1643515288,20
1643601634,25
1643622207,25
1643688028,12
1643708607,12
1643774489,14
1643860889,14
1643947288,19
1644033629,22
1644120088,10
1644206493,12
1644292831,12
1644321030,12
1644388289,8
1644407490,8
1644474692,10
1644493888,10
1644561030,13
1644647492,15
1644733834,11
1644770508,11
1644820292,13
1644906689,21
1644993090,16
1645079499,8
1645165829,12
