1660545162,2
1660574449,2
1660631564,5
1660660730,5
1660717841,2
1660747248,2
1660804362,3
1660833647,3
1660890760,3
1660920046,3
1660977162,8
1661006455,8
1661063442,9
1661092854,9
1661149842,13
1661179125,13
1661236366,8
1661265647,8
1661322641,9
1661352051,9
1661409162,1
1661438449,1
1661495561,5
1661524735,5
1661581964,5
1661611239,5
1661668363,7
1661697647,7
1661700049,7
1661754784,5
1661784048,5
1661870448,2
1661927560,5
1661956724,5
