1655620256,1
1655706645,2
1656138754,1
1656484356,3
1656829841,1
1657002637,1
1657261838,217
1657348240,1
1657434758,59
1657521164,35
1657607566,27
1657693957,40
1657780357,229
1657803090,229
1657804447,229
1657809517,229
1657866760,15
1657896040,15
1657953158,18
1657982325,18
1658039438,11
1658068726,11
1658125843,35
1658155247,35
1658212362,24
1658241661,24
