1650263549,3
1650349831,5
1650436229,9
1650522756,9
1650609163,9
1650695550,7
1650781953,10
1650868349,15
1650954630,22
1651041030,18
1651127552,17
1651213951,33
1651300352,11
1651386755,13
1651473034,15
1651559564,8
