1663569159,10
1663598447,10
1663655565,86
1663684725,86
1663741840,242
1663771124,242
1663828239,121
1663857524,121
1663914640,266
1663943934,266
1664001039,49
1664030318,49
1664087438,79
1664116722,79
1664173842,42
1664203127,42
