1646807431,6
1646893952,2
1646980230,4
1647066751,2
1647153150,4
1647239550,5
1647325952,8
1647412352,2
1647498752,3
1647585151,4
1647757954,9
1647844355,6
1647930752,4
1648017150,3
1648103550,8
1648189831,5
1648276229,5
1648362752,5
1648449033,3
1648535442,4
1648621952,1
1648708231,3
1648794750,4
1648881149,5
