1650177150,1
1650263549,12
1650349831,11
1650436229,14
1650522756,10
1650609163,8
1650695550,16
1650781953,23
1650868349,16
1650954630,23
1651041030,29
1651127552,21
1651213951,27
1651300352,47
1651386755,26
1651473034,26
