1636895594,2
1636898490,2
1636900709,2
1637070326,2
1637070818,3
1637072812,1
1637122028,5
1637208446,1
1637294806,1
1637381227,1
1637467621,1
1637554087,1
1637589848,1
1637813369,1
1638072517,2
1638158887,1
1638245235,3
1638331638,1
1639980923,4
1639983233,4
1639985995,4
1640059226,3
1640080313,3
1640145685,3
1640232083,1
1640318424,1
1640404823,1
1640491284,3
1640577691,1
1640664024,1
1640750484,1
1640836884,1
1640923223,1
1641009626,1
1641096084,1
1641182484,1
1641268824,1
1641355224,1
1641441684,1
1641528084,1
1641700884,1
1641787224,1
1641873686,1
1642392088,4
1642408942,4
1642478484,2
1642564885,1
1642651226,1
1642676514,1
1642805851,2
1642824026,22
1642855125,22
1642910490,4
1642924655,4
1642934565,4
1642937864,4
1642996892,9
1643083292,1
1643169628,1
1643256090,1
1643342487,22
1643428827,1
1643515288,1
1643601634,1
1643622207,1
1643688028,2
1643708607,2
1643774489,2
1643860889,2
1643947288,1
1644033629,1
1644120088,1
1644206493,1
1644292831,1
1644321030,1
1644388289,2
1644407490,2
1644474692,2
1644493888,2
1644561030,2
1644647492,1
1644733834,1
1644770508,1
1644820292,9
1644906689,1
1644993090,1
1645079499,1
1645165829,3
1645252290,1
1645338629,1
1645425030,1
1645467113,1
1645470826,1
1645511492,3
1645597892,1
1645684232,1
1645770629,1
1645857150,1
1645943553,1
1646029893,1
1646116237,1
1646202760,46
1646289033,1
1646375551,1
1646461951,1
1646548229,1
1646634751,1
1646721161,1
1646807431,1
1646893952,1
1646980230,1
1647066751,1
1647153150,1
1647239550,1
1647325952,1
1647412352,1
1647498752,1
1647585151,3
1647757954,1
1647844355,1
1647930752,1
1648017150,2
1648103550,1
1648189831,2
1648276229,1
1648362752,3
1648449033,1
1648535442,1
1648621952,1
1648708231,2
1648794750,1
1648881149,1
1648967561,2
1649053832,1
1649140351,1
1649226751,2
1649313029,1
1649399549,1
1649485949,1
1649572354,2
1649658750,1
1649745150,1
1649831565,2
1649917950,1
1650004228,1
1650090628,1
1650177150,1
1650263549,1
1650349831,2
1650436229,3
1650522756,1
1650609163,1
1650695550,1
1650781953,1
1650868349,3
1650954630,1
1651041030,1
1651127552,2
1651213951,1
1651300352,1
1651386755,1
1651473034,1
1651559564,2
1651645850,1
1651732362,1
1651818753,1
1651905153,1
1651991564,2
1652077954,1
1652164360,1
1652250764,1
1652337032,1
1652423553,2
1652509832,2
1652596232,8
1652682759,6
1652769160,5
1652855561,5
1652941964,5
1653028353,9
1653114753,5
1653201159,8
1653287558,6
1653373954,8
1653460234,6
1653546755,5
1653633154,8
1653719553,5
1653805957,7
1653892236,5
1653978755,9
1654065033,6
1654151553,7
1654237831,6
1654324351,7
1654410631,6
1654497153,6
1654583555,8
1654669837,7
1654756356,5
1654842756,6
1654929156,6
1655015436,5
1655101838,6
1655188357,7
1655274636,7
1655361158,5
1655447555,8
1655533836,7
1655620256,7
1655706645,6
1655793158,5
1655879557,8
1655965955,5
1656052365,6
1656138754,7
1656225155,5
1656311556,9
1656397956,5
1656484356,6
1656570758,5
1656743558,4
1656829841,8
1656916357,6
1657002637,5
1657089163,7
1657175559,5
1657261838,8
1657348240,6
1657434758,6
1657521164,8
1657607566,6
1657693957,8
1657780357,5
1657803090,5
1657804447,5
1657809517,5
1657866760,11
1657896040,11
1657953158,8
1657982325,8
1658039438,7
1658068726,7
1658125843,9
1658155247,9
1658212362,7
1658241661,7
1658298758,7
1658328052,7
1658385041,5
1658414447,5
1658471560,8
1658500847,8
1658557962,8
1658587247,8
1658644360,8
1658673645,8
1658730762,8
1658760045,8
1658817160,8
1658846453,8
1658903439,7
1658932848,7
1658989840,8
1659019246,8
1659076365,12
1659105646,12
1659162770,6
1659192044,6
1659249159,8
1659278470,8
1659335565,7
1659364847,7
1659421963,8
1659451128,8
1659508368,7
1659537519,7
1659594767,7
1659624049,7
1659681160,9
1659710444,9
1659767561,5
1659796845,5
1659853840,9
1659883130,9
1659940369,5
1659969638,5
1660026647,11
1660056049,11
1660113163,6
1660142439,6
1660199441,6
1660228849,6
1660285970,9
1660315250,9
1660372250,5
1660401521,5
1660458761,7
1660488049,7
1660545162,6
1660574449,6
1660631564,7
1660660730,7
1660717841,8
1660747248,8
1660804362,7
1660833647,7
1660890760,8
1660920046,8
1660977162,7
1661006455,7
1661063442,8
1661092854,8
1661149842,7
1661179125,7
1661236366,5
1661265647,5
1661322641,8
1661352051,8
1661409162,9
1661438449,9
1661495561,7
1661524735,7
1661581964,6
1661611239,6
1661668363,9
1661697647,9
1661700049,9
1661754784,10
1661784048,10
1661870448,6
1661927560,9
1661956724,9
1662013964,8
1662043246,8
1662100359,8
1662129642,8
1662186760,8
1662216045,8
1662273039,9
1662302447,9
1662359559,7
1662388727,7
1662445958,6
1662475124,6
1662532358,21
1662561643,21
1662618758,8
1662647931,8
1662705164,9
1662734437,9
1662791558,10
1662820724,10
1662877847,6
1662907237,6
1662964357,11
1662993645,11
1663050638,8
1663080057,8
1663137169,10
1663166448,10
1663223564,11
1663252844,11
1663309969,7
1663339237,7
1663396358,12
1663425653,12
1663482759,9
1663512042,9
1663569159,12
1663598447,12
1663655565,7
1663684725,7
1663741840,12
1663771124,12
1663828239,7
1663857524,7
1663914640,12
1663943934,12
1664001039,8
1664030318,8
1664087438,11
1664116722,11
1664173842,11
1664203127,11
1664260251,10
1664289537,10
1664346641,11
1664375951,11
1664433041,8
1664462320,8
1664519554,9
1664548711,9
1664605833,11
1664635111,11
1668081545,8
1668350533,4
1668355972,4
1668356757,4
1668360810,4
1668474184,4
1668560577,6
1668646979,6
1674973872,6
1675578681,4
1676788249,4
1677220262,4
1677393061,4
1677652257,4
1682573524,2
1682659898,2
1682746309,2
1682832700,2
1682919107,2
1683005499,2
1683091901,2
1683178309,2
1683264713,2
1683351101,2
1683437506,2
1683523904,3
1683610328,2
1683696716,2
1683783116,2
1683869508,2
1683955918,2
1684042308,2
1685597496,2
1685683902,2
1685770303,2
1685856701,2
1685943100,2
1686029502,2
1686115904,2
1686202306,4
1686288711,2
1686375108,2
1686461512,2
1686547909,2
1686634309,2
1686720704,2
1686807105,2
1686893562,2
1686979954,2
1687066360,2
1687152774,2
1687239150,2
1687411953,4
1687498393,2
1687584774,2
1687671173,2
1687757568,2
1687843969,2
1687930377,2
1688016807,2
1688103218,2
1688189597,2
1688275996,2
1688362412,2
1688535215,2
1688621614,2
1688708029,2
1688794420,2
1688880821,2
1688967219,2
1689053626,2
1689140028,2
1689226424,2
1689312837,2
1689399195,2
1689485597,2
1689572000,2
1689658397,2
1689744807,3
1689831241,2
1689917640,2
1690004042,2
1690090404,2
1690176817,2
1690263240,2
1690349617,2
1690436012,2
1690522443,2
1690608808,2
1690695212,2
1690781617,2
1690868047,2
1690954421,2
1691040818,2
1691127250,2
1691213630,2
1691300015,2
1691386395,2
1691472821,2
1691559206,2
1691645653,2
1691732035,2
1691818443,2
1691904834,2
1691991184,2
1692077570,2
1692163972,2
1692250382,2
1692336773,2
1692423180,2
1692509573,2
1692595944,2
1692682368,2
1692768764,2
1692855167,2
1692941568,2
1693027980,2
1693114356,2
1693200777,2
1693287141,2
1693373568,2
1693459952,2
1693546364,2
1693632754,2
1693719144,2
1693805540,2
1693891949,2
1693978362,2
1694064749,2
1694151151,2
1694237547,2
1694323959,2
1694410362,2
1694496769,2
1694583178,2
1694669562,2
1694755972,2
1694842363,21
1694928766,2
1695015165,2
1695187975,2
1695274380,2
1695360784,2
1695447164,2
1695533586,2
1695619990,2
1695706406,2
1695792808,2
1695879218,2
1695965624,2
1696052011,2
1696138408,2
1696224807,2
1696311219,2
1696397621,2
1696484041,2
1696570435,2
1696656841,2
1696743237,2
1696829644,2
1696916048,2
1697002439,2
1697088838,2
1697175238,2
1697261644,2
1697348050,2
1697434425,12
1697520844,2
1697607247,2
1697693651,2
1697780021,2
1697866447,2
1697952848,2
1698039229,2
1698125641,2
1698212053,2
1698298423,2
1698384826,2
1698474862,2
1698561261,2
1698647660,2
1698734051,2
1698820440,2
1698906836,2
1698993260,2
1699079643,2
1699166057,2
1699252467,2
1699338847,2
1699425254,2
1699511642,2
1699598052,4
1699684453,2
1699770845,2
1699857241,2
1699943653,2
1700030030,2
1700116443,2
1700202865,2
1700289223,2
1700375637,2
1700462021,2
1700548451,2
1700634836,2
1700721246,2
1700807657,2
1700894058,2
1700980458,2
