1656743558,1
1656829841,10
1656916357,36
1657002637,1
1657175559,12
1657261838,3
1657348240,3
1657434758,90
1657521164,25
1657607566,30
1657693957,32
1657780357,129
1657803090,129
1657804447,129
1657809517,129
1657866760,219
1657896040,219
