1638245235,2
1640750484,4
1642564885,15
1642651226,2
1642676514,2
1642824026,7
1642855125,7
1646375551,4
1648621952,6
1650436229,4
1652423553,2
1653978755,3
1654065033,3
1654497153,2
1654842756,2
1655188357,11
1655274636,13
1655361158,6
1655447555,12
1655793158,1
1655965955,1
1656052365,2
1656743558,2
1657089163,2
1658039438,2
1658068726,2
1658817160,2
1658846453,2
1659681160,1
1659710444,1
1660545162,1
1660574449,1
1660977162,1
1661006455,1
1661581964,2
1661611239,2
1662705164,2
1662734437,2
