1656484356,4
1658039438,3
1658068726,3
1658125843,35
1658155247,35
1658212362,49
1658241661,49
1658298758,56
1658328052,56
1658385041,46
1658414447,46
1658471560,45
1658500847,45
1658557962,32
1658587247,32
1658644360,27
1658673645,27
1658730762,31
1658760045,31
1658817160,24
1658846453,24
1658903439,25
1658932848,25
1658989840,37
1659019246,37
1659076365,32
1659105646,32
1659162770,32
1659192044,32
1659249159,37
1659278470,37
1659335565,33
1659364847,33
