1686461512,1
1686547909,12
1686634309,13
1686720704,5
1686807105,8
1686893562,23
1686979954,3
1687066360,25
1687152774,7
1687239150,5
1687411953,3
1687498393,2
1687584774,2
1687671173,3
1687757568,1
1687843969,2
1687930377,3
1688016807,2
1688103218,6
1688189597,2
1688275996,1
1688362412,4
1688535215,3
1688621614,4
1688708029,10
