1682832700,52
1682919107,484
1683005499,209
1683091901,160
1683178309,284
1683264713,313
1683351101,189
1683437506,306
1683523904,277
1683610328,577
1683696716,148
1683783116,138
1683869508,179
1683955918,222
1684042308,209
