1637899638,19
1637986004,59
1638072517,415
1638158887,346
1638245235,186
1638331638,371
1639904549,269
1639907950,269
1639980923,169
1639983233,169
1639985995,169
1640059226,178
1640080313,178
1640145685,149
1640232083,157
1640318424,172
1640404823,162
1640491284,342
1640577691,144
1640664024,260
1640750484,132
1640836884,103
1640923223,150
1641009626,159
1641096084,241
1641182484,167
1641268824,174
1641355224,251
1641441684,256
1641528084,179
1641700884,1173
1641787224,183
1641873686,160
1642305627,146
1642319122,146
1642392088,79
1642408942,79
1642478484,197
1642564885,250
1642651226,163
1642676514,163
1642769502,163
1642771604,163
1642805136,163
1642805851,163
1642824026,125
1642855125,125
1642910490,102
1642924655,102
1642934565,102
1642937864,102
1642996892,283
1643083292,384
1643169628,191
1643256090,151
1643342487,257
1643428827,123
1643515288,194
1643601634,179
1643622207,179
1643688028,168
1643708607,168
1643774489,144
1643860889,177
1643947288,114
1644033629,738
1644120088,177
1644206493,174
1644292831,187
1644321030,187
1644388289,145
1644407490,145
1644474692,189
1644493888,189
1644561030,148
1644647492,254
1644733834,196
1644770508,196
1644820292,114
1644906689,184
1644993090,242
1645079499,96
1645165829,108
