1696829644,2
1697348050,439
1697952848,2
1698384826,3
1698647660,12
1698734051,208
1698820440,3
1699252467,2
1699598052,2
1699684453,1
1699770845,170
1700202865,2
1700289223,1
1700375637,22
1700634836,4
