1646807431,272
1646893952,227
1646980230,100
1647066751,354
1647153150,139
1647239550,128
1647325952,148
1647412352,250
1647498752,260
1647585151,263
1647757954,381
1647844355,261
1647930752,200
1648017150,140
1648103550,277
1648189831,258
1648276229,114
1648362752,132
1648449033,238
1648535442,129
1648621952,147
1648708231,71
1648794750,244
1648881149,258
1648967561,183
1649053832,134
1649140351,661
1649226751,184
1649313029,165
1649399549,163
1649485949,108
1649572354,151
1649658750,158
1649745150,341
1649831565,391
1649917950,170
1650004228,443
