1659508368,1
1659537519,1
1659594767,9
1659624049,9
1659681160,2
1659710444,2
1659767561,11
1659796845,11
1659853840,7
1659883130,7
1659940369,13
1659969638,13
1660026647,10
1660056049,10
1660113163,6
1660142439,6
1660199441,8
1660228849,8
1660285970,7
1660315250,7
1660372250,14
1660401521,14
1660458761,9
1660488049,9
1660545162,4
1660574449,4
1660631564,9
1660660730,9
1660717841,5
1660747248,5
1660804362,3
1660833647,3
