1646548229,1
1646634751,19
1646721161,8
1646807431,19
1646893952,19
1646980230,15
1647066751,21
1647153150,7
1647239550,18
1647325952,9
1647412352,16
1647498752,25
1647585151,16
1647757954,12
1647844355,16
1647930752,14
1648017150,30
1648103550,16
1648189831,19
1648276229,13
1648362752,6
1648449033,10
1648535442,12
1648621952,13
1648708231,16
1648794750,16
1648881149,15
1648967561,6
1649053832,5
