1642392088,85
1642408942,85
1642478484,95
1642564885,76
1642651226,104
1642676514,104
1642769502,93
1642771604,93
1642805136,93
1642805851,93
1642824026,102
1642855125,102
1642910490,83
1642924655,83
1642934565,83
1642937864,83
1642996892,87
1643083292,76
1643169628,94
1643256090,91
1643342487,95
1643428827,60
1643515288,68
1643601634,78
1643622207,78
1643688028,84
1643708607,84
1643774489,79
1643860889,65
1643947288,82
1644033629,88
1644120088,82
1644206493,87
1644292831,72
1644321030,72
1644388289,81
1644407490,81
1644474692,75
1644493888,75
1644561030,79
1644647492,97
1644733834,83
1644770508,83
1644820292,78
1644906689,88
1644993090,62
1645079499,80
