1636286412,2
1636286488,2
1636895594,3
1636898490,4
1636900709,6
1637070326,10
1637070818,12
1637072812,12
1637122028,20
1637208446,13
1637294806,9
1637381227,12
1637467621,13
1637554087,32
1637589848,32
1637726914,7
1637813369,36
1638072517,3
1638158887,22
1638245235,38
1638331638,14
1639904549,16
1639907950,16
1639980923,30
1639983233,30
1639985995,30
1640059226,16
1640080313,16
1640145685,14
1640232083,13
1640318424,11
1640404823,15
1640491284,9
1640577691,7
1640664024,10
1640750484,8
1640836884,11
1640923223,9
1641009626,13
1641096084,18
1641182484,13
1641268824,10
1641355224,15
1641441684,9
1641528084,16
1641700884,7
1641787224,8
1641873686,17
1642392088,17
1642408942,17
1642478484,16
1642564885,19
1642651226,20
1642676514,20
1642805851,16
1642824026,22
1642855125,22
1642910490,23
1642924655,23
1642934565,23
1642937864,23
1642996892,32
1643083292,19
1643169628,21
1643256090,17
1643342487,12
1643428827,14
1643515288,19
1643601634,13
1643622207,13
1643688028,21
1643708607,21
1643774489,15
1643860889,19
1643947288,12
1644033629,16
1644120088,21
1644206493,15
1644292831,15
1644321030,15
1644388289,20
1644407490,20
1644474692,13
1644493888,13
1644561030,21
1644647492,11
1644733834,14
1644770508,14
1644820292,34
1644906689,27
1644993090,6
1645079499,21
1645165829,14
1645252290,9
1645338629,24
1645425030,6
1645467113,6
1645470826,6
1645511492,18
1645597892,15
1645684232,9
1645770629,8
1645857150,11
1645943553,9
1646029893,13
1646116237,18
1646202760,7
1646289033,23
1646375551,21
1646461951,21
1646548229,10
1646634751,11
1646721161,15
1646807431,9
1646893952,66
1646980230,10
1647066751,29
1647153150,15
1647239550,14
1647325952,29
1647412352,16
1647498752,15
1647585151,16
1647757954,10
1647844355,13
1647930752,14
1648017150,15
1648103550,14
1648189831,15
1648276229,34
1648362752,11
1648449033,10
1648535442,17
1648621952,13
1648708231,24
1648794750,19
1648881149,14
1648967561,25
1649053832,9
1649140351,30
1649226751,10
1649313029,16
1649399549,14
1649485949,12
1649572354,14
1649658750,21
1649745150,104
1649831565,12
1649917950,8
1650004228,14
1650090628,17
1650177150,23
1650263549,19
1650349831,12
1650436229,20
1650522756,9
1650609163,15
1650695550,17
1650781953,11
1650868349,9
1650954630,7
1651041030,17
1651127552,13
1651213951,20
1651300352,11
1651386755,8
1651473034,10
1651559564,10
1651645850,20
1651732362,30
1651818753,12
1651905153,7
1651991564,15
1652077954,16
1652164360,10
1652250764,16
1652337032,7
1652423553,11
1652509832,10
1652596232,12
1652682759,28
1652769160,7
1652855561,13
1652941964,14
1653028353,16
1653114753,7
1653201159,11
1653287558,8
1653373954,9
1653460234,12
1653546755,13
1653633154,17
1653719553,8
1653805957,17
1653892236,30
1653978755,10
1654065033,12
1654151553,7
1654237831,9
1654324351,28
1654410631,18
1654497153,8
1654583555,10
1654669837,9
1654756356,19
1654842756,8
1654929156,18
1655015436,7
1655101838,8
1655188357,10
1655274636,16
1655361158,11
1655447555,9
1655533836,10
1655620256,10
1655706645,8
1655793158,9
1655879557,16
1655965955,9
1656052365,15
1656138754,8
1656225155,27
1656311556,9
1656397956,8
1656484356,14
1656570758,8
1656743558,5
1656829841,21
1656916357,9
1657002637,10
1657089163,9
1657175559,7
1657261838,11
1657348240,9
1657434758,11
1657521164,14
1657607566,17
1657693957,10
1657780357,9
1657803090,9
1657804447,9
1657809517,9
1657866760,25
1657896040,25
1657953158,13
1657982325,13
1658039438,20
1658068726,20
1658125843,12
1658155247,12
1658212362,19
1658241661,19
1658298758,13
1658328052,13
1658385041,27
1658414447,27
1658471560,14
1658500847,14
1658557962,15
1658587247,15
1658644360,13
1658673645,13
1658730762,11
1658760045,11
1658817160,20
1658846453,20
1658903439,18
1658932848,18
1658989840,16
1659019246,16
1659076365,35
1659105646,35
1659162770,16
1659192044,16
1659249159,15
1659278470,15
1659335565,18
1659364847,18
1659421963,21
1659451128,21
1659508368,15
1659537519,15
1659594767,16
1659624049,16
1659681160,13
1659710444,13
1659767561,18
1659796845,18
1659853840,23
1659883130,23
1659940369,16
1659969638,16
1660026647,14
1660056049,14
1660113163,21
1660142439,21
1660199441,18
1660228849,18
1660285970,15
1660315250,15
1660372250,26
1660401521,26
1660458761,22
1660488049,22
1660545162,36
1660574449,36
1660631564,17
1660660730,17
1660717841,19
1660747248,19
1660804362,14
1660833647,14
1660890760,25
1660920046,25
1660977162,17
1661006455,17
1661063442,14
1661092854,14
1661149842,14
1661179125,14
1661236366,14
1661265647,14
1661322641,16
1661352051,16
1661409162,15
1661438449,15
1661495561,12
1661524735,12
1661581964,20
1661611239,20
1661668363,16
1661697647,16
1661700049,16
1661754784,22
1661784048,22
1661870448,17
1661927560,14
1661956724,14
1662013964,16
1662043246,16
1662100359,14
1662129642,14
1662186760,18
1662216045,18
1662273039,15
1662302447,15
1662359559,15
1662388727,15
1662445958,21
1662475124,21
1662532358,20
1662561643,20
1662618758,16
1662647931,16
1662705164,13
1662734437,13
1662791558,16
1662820724,16
1662877847,16
1662907237,16
1662964357,19
1662993645,19
1663050638,15
1663080057,15
1663137169,17
1663166448,17
1663223564,14
1663252844,14
1663309969,17
1663339237,17
1663396358,18
1663425653,18
1663482759,12
1663512042,12
1663569159,25
1663598447,25
1663655565,17
1663684725,17
1663741840,17
1663771124,17
1663828239,13
1663857524,13
1663914640,25
1663943934,25
1664001039,13
1664030318,13
1664087438,33
1664116722,33
1664173842,17
1664203127,17
1664260251,16
1664289537,16
1664346641,14
1664375951,14
1664433041,13
1664462320,13
1664519554,20
1664548711,20
1664605833,16
1664635111,16
1668081545,18
1668350533,5
1668355972,5
1668356757,5
1668360810,5
1668474184,6
1668560577,12
1668646979,14
1671629111,15
1671630664,15
1671632450,15
1671634011,15
1673516775,12
1674367285,8
1674455475,7
1674541884,15
1674628285,12
1674714694,12
1674801082,11
1674887480,15
1674973872,11
1675060281,13
1675146682,10
1675233071,13
1675319481,20
1675405883,20
1675492281,10
1675578681,18
1675665075,14
1675751474,14
1675837863,9
1676356254,14
1676442661,12
1676529061,10
1676615450,36
1676701857,52
1676788249,20
1676874662,28
1676961061,36
1677047454,17
1677133857,25
1677220262,53
1677306660,15
1677393061,13
1677479458,14
1677565859,23
1677652257,53
1677738657,12
1677825057,7
1677911460,11
1677997847,7
1678084257,16
1678170666,10
1678257055,13
1678343445,31
1679569142,8
1679584407,8
1679589867,8
1679596494,8
1679602915,8
1679607956,8
1679639532,36
1679722309,4
1679808717,4
1679895117,15
1679981518,4
1680067912,10
1680154308,6
1680240714,7
1680327097,4
1680413504,4
1680499902,10
1680586299,6
1680672702,4
1680759104,4
1680845523,11
1680931899,6
1681018301,4
1681104713,9
1681191117,15
1681277516,14
1681363906,12
1681450306,7
1681536706,9
1681623105,8
1681709528,15
1681795909,10
1681882326,22
1681968706,20
1682055103,7
1682141505,8
1682227910,9
1682314324,15
1682400707,8
1682487105,7
