1688016640,1
1688103041,1
1688275841,1
1688362240,1
1688535044,1
1688621445,1
1688707844,1
1688794245,1
1688880644,1
1688967042,1
1689226241,1
1689312653,1
1689831044,1
1689917446,1
1690003846,1
1690522245,1
1690867847,1
1691127048,1
1691213447,2
1691645448,1
1691731846,1
1691818247,1
1691991040,1
1692077440,1
1692163831,1
1692250233,1
1692336633,1
1692423035,1
1692509432,1
1692682233,1
1692768633,1
1692855035,1
1693027839,1
1693200633,1
1693978232,1
1694323834,1
1697088641,1
1697175042,1
1697261447,1
1697347842,1
1697520642,1
1697607044,1
1697693444,1
1697866244,1
1697952644,1
1698211845,1
1698474646,2
1698561046,1
1698647445,1
1700548240,1
1700807441,2
1700893840,1
1700980240,1
