1645511492,9
1645597892,4
1645684232,4
1645770629,4
1645857150,4
1645943553,4
1646029893,4
1646116237,4
1646202760,4
1646289033,4
1646375551,4
1646461951,4
1646548229,4
1646634751,4
1646721161,4
1646807431,4
1646893952,4
1646980230,4
1647066751,4
1647153150,4
1647239550,4
1647325952,4
1647412352,4
1647498752,4
1647585151,4
1647757954,4
1647844355,4
1647930752,4
1648017150,4
1648103550,4
1648189831,4
1648276229,4
1648362752,4
1648449033,4
1648535442,4
1648621952,4
1648708231,4
1648794750,4
1648881149,4
1648967561,4
1649053832,4
1649140351,4
1649226751,4
1649313029,4
1649399549,4
1649485949,4
1649572354,4
1649658750,4
1649745150,4
1649831565,4
1649917950,4
1650004228,4
1650090628,4
1650177150,4
1650263549,4
1650349831,4
1650436229,4
1650522756,4
1650609163,4
1650695550,4
1650781953,4
1650868349,4
1650954630,4
1651041030,4
1651127552,4
1651213951,4
1651300352,4
1651386755,4
1651473034,4
1651559564,4
1651645850,4
1651732362,4
1651818753,4
1651905153,4
1651991564,4
1652077954,4
1652164360,4
1652250764,4
1652337032,4
1652423553,4
1652509832,4
1652596232,4
1652682759,4
1652769160,4
1652855561,4
1652941964,4
1653028353,4
1653114753,4
1653201159,4
1653287558,4
1653373954,4
1653460234,4
1653546755,4
1653633154,4
1653719553,4
1653805957,4
1653892236,4
1653978755,4
1654065033,4
1654151553,4
1654237831,4
1654324351,4
1654410631,4
1654497153,4
1654583555,4
1654669837,4
1654756356,4
1654842756,4
1654929156,4
1655015436,4
1655101838,4
1655188357,4
1655274636,4
1655361158,4
1655447555,4
1655533836,4
1655620256,4
1655706645,4
1655793158,4
1655879557,4
1655965955,4
1656052365,4
1656138754,4
1656225155,4
1656311556,4
1656397956,4
1656484356,4
1656570758,4
1656829841,4
1656916357,4
1657002637,4
1657089163,4
1657175559,4
1657261838,4
1657348240,4
1657434758,4
1657521164,4
1657607566,4
1657693957,4
1657780357,4
1657803090,4
1657804447,4
1657809517,4
1657866760,20
1657896040,20
1657953158,8
1657982325,8
1658039438,8
1658068726,8
1658125843,8
1658155247,8
1658212362,8
1658241661,8
1658298758,8
1658328052,8
1658385041,8
1658414447,8
1658471560,8
1658500847,8
1658557962,8
1658587247,8
1658644360,8
1658673645,8
1658730762,8
1658760045,8
1658817160,8
1658846453,8
1658903439,8
1658932848,8
1658989840,8
1659019246,8
1659076365,8
1659105646,8
1659162770,8
1659192044,8
1659249159,8
1659278470,8
1659335565,8
1659364847,8
1659421963,8
1659451128,8
1659508368,8
1659537519,8
1659594767,8
1659624049,8
1659681160,8
1659710444,8
1659767561,8
1659796845,8
1659853840,8
1659883130,8
1659940369,8
1659969638,8
1660026647,8
1660056049,8
1660113163,8
1660142439,8
1660199441,8
1660228849,8
1660285970,8
1660315250,8
1660372250,8
1660401521,8
1660458761,8
1660488049,8
1660545162,8
1660574449,8
1660631564,8
1660660730,8
1660717841,8
1660747248,8
1660804362,8
1660833647,8
1660890760,8
1660920046,8
1660977162,8
1661006455,8
1661063442,8
1661092854,8
1661149842,8
1661179125,8
1661236366,8
1661265647,8
1661322641,8
1661352051,8
1661409162,8
1661438449,8
1661495561,8
1661524735,8
1661581964,8
1661611239,8
1661668363,8
1661697647,8
1661700049,8
1661754784,12
1661784048,12
1661870448,8
1661927560,8
1661956724,8
1662013964,8
1662043246,8
1662100359,8
1662129642,8
1662186760,8
1662216045,8
1662273039,8
1662302447,8
1662359559,8
1662388727,8
1662445958,8
1662475124,8
1662532358,8
1662561643,8
1662618758,8
1662647931,8
1662705164,8
1662734437,8
1662791558,8
1662820724,8
1662877847,8
1662907237,8
1662964357,8
1662993645,8
1663050638,8
1663080057,8
1663137169,8
1663166448,8
1663223564,8
1663252844,8
1663309969,8
1663339237,8
1663396358,8
1663425653,8
1663482759,8
1663512042,8
1663569159,8
1663598447,8
1663655565,8
1663684725,8
1663741840,8
1663771124,8
1663828239,8
1663857524,8
1663914640,8
1663943934,8
1664001039,8
1664030318,8
1664087438,8
1664116722,8
1664173842,8
1664203127,8
1664260251,8
1664289537,8
1664346641,8
1664375951,8
1664433041,8
1664462320,8
1664519554,8
1664548711,8
1664605833,8
1664635111,8
1668560577,4
1668646979,4
1673516775,4
1674367285,4
1674455475,4
1674541884,4
1674628285,4
1674714694,4
1674801082,4
1674887480,4
1674973872,4
1675060281,4
1675146682,4
1675233071,4
1675319481,4
1675405883,4
1675492281,4
1675578681,4
1675665075,4
1675751474,4
1675837863,4
1676442661,4
1676529061,4
1676615450,4
1676701857,4
1676788249,4
1676874662,4
1676961061,4
1677047454,4
1677133857,4
1677220262,4
1677306660,4
1677393061,4
1677479458,4
1677565859,4
1677738657,4
1677825057,4
1677911460,4
1677997847,4
1678084257,4
1678170666,4
1678257055,4
1678343445,20
1679569142,8
1679584407,8
1679589867,8
1679596494,8
1679602915,8
1679607956,8
1679639532,36
1679722309,4
1679808717,4
1679895117,4
1679981518,4
1680067912,4
1680154308,4
1680240714,4
1680327097,4
1680413504,4
1680499902,4
1680586299,4
1680672702,4
1680759104,4
1680845523,4
1680931899,4
1681018301,4
1681104713,4
1681191117,4
1681277516,4
1681363906,4
1681450306,4
1681536706,4
1681623105,4
1681709528,4
1681795909,4
1681882326,4
1681968706,4
1682055103,4
1682141505,4
1682227910,4
1682314324,4
1682400707,4
1682487105,4
1682573524,4
1682659898,7
1682746309,4
1682832700,4
1682919107,4
1683005499,4
1683091901,4
1683178309,4
1683264713,4
1683351101,4
1683437506,4
1683523904,4
1683610328,4
1683696716,4
1683783116,4
1683869508,4
1683955918,4
1684042308,4
1685597496,4
1685683902,4
1685770303,4
1685856701,4
1685943100,4
1686029502,4
1686115904,4
1686202306,4
1686288711,4
1686375108,4
1686461512,4
1686547909,4
1686634309,4
1686720704,4
1686807105,4
1686893562,4
1686979954,4
1687066360,4
1687152774,4
1687239150,4
1687411953,4
1687498393,4
1687584774,4
1687671173,4
1687757568,4
1687843969,4
1687930377,4
1688016807,4
1688103218,4
1688189597,4
1688275996,4
1688362412,4
1688535215,4
1688621614,4
1688708029,4
1688794420,4
1688880821,4
1688967219,4
1689053626,4
1689140028,4
1689226424,4
1689312837,4
1689399195,4
1689485597,4
1689572000,4
1689658397,4
1689744807,4
1689831241,4
1689917640,4
1690004042,4
1690090404,4
1690176817,4
1690263240,4
1690349617,4
1690436012,4
1690522443,4
1690608808,4
1690695212,4
1690781617,4
1690868047,4
1690954421,4
1691040818,4
1691127250,4
1691213630,4
1691300015,4
1691386395,4
1691472821,4
1691559206,4
1691645653,4
1691732035,4
1691818443,4
1691904834,4
1691991184,4
1692077570,4
1692163972,4
1692250382,4
1692336773,4
1692423180,4
1692509573,4
1692595944,4
1692682368,4
1692768764,4
1692855167,4
1692941568,4
1693027980,4
1693114356,4
1693200777,4
1693287141,4
1693373568,4
1693459952,4
1693546364,4
1693632754,4
1693719144,4
1693805540,4
1693891949,4
1693978362,4
1694064749,4
1694151151,4
1694237547,4
1694323959,4
1694410362,4
1694496769,4
1694583178,4
1694669562,4
1694755972,4
1694842363,4
1694928766,4
1695015165,4
1695187975,4
1695274380,4
1695360784,4
1695447164,4
1695533586,4
1695619990,4
1695706406,4
1695792808,4
1695879218,4
1695965624,4
1696052011,4
1696138408,4
1696224807,4
1696311219,4
1696397621,4
1696484041,4
1696570435,4
1696656841,4
1696743237,4
1696829644,4
1696916048,4
1697002439,4
1697088838,4
1697175238,4
1697261644,4
1697348050,4
1697434425,4
1697520844,4
1697607247,4
1697693651,4
1697780021,4
1697866447,4
1697952848,4
1698039229,4
1698125641,4
1698212053,4
1698298423,6
1698384826,4
1698474862,4
1698561261,4
1698647660,4
1698734051,4
1698820440,4
1698906836,4
1698993260,4
1699079643,4
1699166057,4
1699252467,4
1699338847,4
1699425254,4
1699511642,4
1699598052,8
1699684453,4
1699770845,4
1699857241,4
1699943653,4
1700030030,4
1700116443,4
1700202865,4
1700289223,4
1700375637,4
1700462021,4
1700548451,4
1700634836,4
1700721246,4
1700807657,4
1700894058,4
1700980458,4
