1681795909,17
1681882326,22
1681968706,18
1682055103,28
1682141505,31
1682227910,25
1682314324,12
1682400707,15
1682487105,25
1682573524,19
1682659898,28
1682746309,16
1682832700,29
1682919107,22
1683005499,13
1683091901,24
1683178309,23
1683264713,28
1683351101,13
1698384826,9
1698474862,2
