1679584314,1
1679589759,1
1679596397,1
1679602819,1
1679607852,1
1679639432,1
1680240629,1
1680845434,1
1681623032,1
1687498241,1
1688016640,1
1688103041,1
1688362240,1
1688535044,1
1688621445,1
1688707844,1
1688794245,1
1688880644,1
1688967042,1
1689053441,1
1689139840,1
1689226241,1
1689312653,1
1689744640,1
1689831044,1
1689917446,1
1690003846,1
1690263047,1
1697002242,1
1697088641,1
