1675060281,6
1675751474,7
1677133857,8
1677565859,4
1677825057,8
1680067912,13
1682055103,8
1682314324,14
1682573524,2
1682659898,2
1682746309,2
1682832700,2
1682919107,2
1683005499,2
1683091901,4
1683178309,2
1683264713,2
1683351101,2
1683437506,2
1683523904,2
1683610328,2
1683696716,2
1683783116,2
1683869508,2
1683955918,2
1684042308,2
1685597496,2
1685683902,2
1685770303,2
1685856701,2
1685943100,2
1686029502,2
1686115904,2
1686202306,2
1686288711,2
1686375108,2
1686461512,2
1686547909,2
1686634309,2
1686720704,2
1686807105,2
1686893562,2
1686979954,2
1687066360,2
1687152774,2
1687239150,2
1687411953,2
1687498393,2
1687584774,2
1687671173,2
1687757568,2
1687843969,2
1687930377,4
1688016807,2
1688103218,2
1688189597,2
1688275996,2
1688362412,2
1688535215,2
1688621614,2
1688708029,2
1688794420,2
1688880821,2
1688967219,2
1689140028,2
1689226424,2
1689312837,2
1689399195,2
1689485597,2
1689572000,2
1689658397,2
1689744807,2
1689831241,2
1689917640,2
1690004042,2
1690090404,2
1690176817,2
1690263240,2
1690349617,2
1690436012,2
1690522443,2
1690608808,2
1690695212,2
1690781617,2
1690868047,2
1690954421,2
1691040818,2
1691127250,2
1691213630,2
1691300015,2
1691386395,2
1691472821,2
1691559206,2
1691645653,2
1691732035,2
1691818443,2
1691904834,2
1691991184,2
1692077570,2
1692163972,2
1692250382,2
1692336773,2
1692423180,2
1692509573,2
1692595944,2
1692768764,4
1692855167,2
1692941568,2
1693027980,2
1693114356,2
1693200777,2
1693287141,2
1693459952,2
1693546364,2
1693632754,2
1693719144,2
1693805540,2
1693891949,2
1693978362,2
1694064749,2
1694151151,2
1694237547,2
1694323959,2
1694410362,2
1694496769,2
1694583178,2
1694669562,8
1696138408,1
1696224807,1
1698212053,7
1700894058,1
