1651386755,23
1651473034,214
1651559564,140
1651645850,118
1651732362,252
1651818753,240
1651905153,265
1651991564,234
1652077954,138
1652164360,150
1652250764,155
1652337032,136
1652423553,260
1652509832,102
1652596232,134
1652682759,112
