1659421963,8
1659451128,8
1659508368,23
1659537519,23
1659594767,10
1659624049,10
1659681160,16
1659710444,16
1659767561,29
1659796845,29
1659853840,24
1659883130,24
1659940369,30
1659969638,30
1660026647,39
1660056049,39
1660113163,18
1660142439,18
1660199441,37
1660228849,37
1660285970,37
1660315250,37
1660372250,33
1660401521,33
1660458761,40
1660488049,40
1660545162,26
1660574449,26
1660631564,34
1660660730,34
1660717841,22
1660747248,22
1660804362,6
1660833647,6
