1687498241,1
1688016640,1
1688103041,1
1688275841,1
1688362240,1
1688535044,1
1688621445,1
1688707844,1
1688794245,1
1688967042,1
1689226241,1
1689312653,1
1689744640,1
1689831044,1
1689917446,1
1690003846,1
1690263047,1
1690435846,1
1690522245,1
1690781448,1
1690867847,1
1691127048,1
1691213447,11
1691645448,1
1691818247,1
1691991040,1
1692077440,1
1694151031,1
1694323834,1
1694496634,1
1694583036,1
1694755834,1
1694842234,1
1694928634,1
1695187834,1
1695274234,1
1695360634,1
1695533434,1
1695619839,1
1695965441,1
1697866244,1
1697952644,1
1698211845,1
1698474646,1
1698561046,1
1698647445,1
1698733843,1
1698993045,1
1699165843,1
1699252253,1
1699425038,1
1699597838,2
1699684239,1
1699770639,1
1699943446,1
1700116239,1
1700202637,2
1700548240,1
1700807441,2
1700893840,1
1700980240,1
