1686375108,110
1686461512,341
1686547909,110
1686634309,41
1686720704,31
1686807105,164
1686893562,77
1686979954,81
1687066360,207
1687152774,546
1687239150,119
1687411953,55
1687498393,129
1687584774,439
1687671173,116
1687757568,67
1687843969,130
1687930377,401
1688016807,59
1688103218,46
1688189597,99
1688275996,460
1688362412,135
1688535215,180
1688621614,338
1688708029,254
1688794420,206
1688880821,755
1688967219,411
1689053626,104
1689140028,111
1689226424,43
1689312837,275
1689399195,214
1689485597,54
