1645511492,6
1654151553,1
1658730762,1
1658760045,1
1660285970,1
1660315250,1
1662532358,2
1662561643,2
1663050638,1
1663080057,1
1663223564,1
1663252844,1
1674628285,2
1674973872,2
1675319481,2
1676874662,2
1677220262,2
1677479458,2
1677825057,2
1677997847,2
1678084257,2
1679895117,2
1680240714,2
1680413504,2
1680499902,2
1680845523,2
1681191117,2
1681536706,2
1681882326,2
1682227910,2
1682487105,2
1682919107,2
1683178309,2
1683351101,2
1683437506,2
1683610328,2
1683869508,2
1686807105,2
1688103218,2
1688708029,2
1688880821,2
1689140028,2
1689399195,4
1689658397,2
1689917640,2
1690090404,2
1690349617,2
1690522443,2
1690868047,2
1691040818,2
1691300015,2
1691386395,2
1691645653,2
1691904834,2
1692077570,2
1692336773,4
1692595944,4
1692768764,4
1693027980,4
1693632754,4
1693891949,4
1694151151,4
1694496769,4
1694842363,4
1695187975,4
1695360784,4
1695447164,4
1695706406,5
1695792808,2
1695965624,4
1696311219,4
1696570435,4
1696829644,4
1697088838,4
1697348050,4
1697780021,4
1698039229,4
1698384826,4
1698647660,4
1698906836,4
1699166057,4
1699425254,4
1699511642,4
1699598052,6
1699684453,4
1699770845,5
1699857241,1
1699943653,4
1700202865,4
1700289223,2
1700462021,4
1700721246,4
1700980458,4
