1693632754,183
1693719144,65
1693805540,359
1693891949,320
1693978362,115
1694064749,231
1694151151,179
1694237547,181
1694323959,214
1694410362,76
1694496769,866
1694583178,540
1694669562,141
1694755972,118
1694842363,261
1694928766,194
1695015165,471
