1699598052,2
1699684453,3
1699770845,3
1699857241,12
1699943653,5
1700030030,2
1700202865,3
1700289223,1
1700375637,3
1700462021,2
1700548451,1
1700634836,4
1700721246,3
1700807657,2
1700894058,3
1700980458,7
