1657002637,1
1657089163,8
1657175559,10
1657261838,13
1657348240,10
1657434758,8
1657521164,10
1657607566,9
1657693957,9
1657780357,15
1657803090,15
1657804447,15
1657809517,15
1657866760,10
1657896040,10
1657953158,13
1657982325,13
1658039438,5
1658068726,5
1658125843,14
1658155247,14
1658212362,9
1658241661,9
1658298758,3
1658328052,3
