1661870448,5
1661927560,5
1661956724,5
1662013964,4
1662043246,4
1662100359,2
1662129642,2
1662186760,6
1662216045,6
1662273039,4
1662302447,4
1662359559,4
1662388727,4
1662445958,5
1662475124,5
1662532358,7
1662561643,7
1662618758,9
1662647931,9
1662705164,4
1662734437,4
1662791558,8
1662820724,8
1662877847,10
1662907237,10
1662964357,8
1662993645,8
1663050638,14
1663080057,14
1663137169,4
1663166448,4
1663223564,4
1663252844,4
1663309969,2
1663339237,2
1663396358,6
1663425653,6
1663482759,4
1663512042,4
1663569159,4
1663598447,4
1663655565,3
1663684725,3
1663741840,4
1663771124,4
1663828239,1
1663857524,1
1663914640,21
1663943934,21
1664001039,7
1664030318,7
1664087438,2
1664116722,2
1664173842,3
1664203127,3
1664260251,8
1664289537,8
1664346641,15
1664375951,15
1664433041,1
1664462320,1
