1662877847,5
1662907237,5
1663050638,7
1663080057,7
1663137169,13
1663166448,13
1663223564,4
1663252844,4
1663309969,2
1663339237,2
1663396358,4
1663425653,4
1663482759,2
1663512042,2
1663569159,2
1663598447,2
1663655565,90
1663684725,90
1663741840,12
1663771124,12
1663828239,14
1663857524,14
1664173842,1
1664203127,1
1664260251,91
1664289537,91
1664433041,55
1664462320,55
1664519554,10
1664548711,10
1664605833,4
1664635111,4
