1673516775,41
1674367285,158
1674455475,34
1674541884,27
1674628285,39
1674714694,54
1674801082,45
1674887480,34
1674973872,21
1675060281,82
1675146682,47
1675233071,44
1675319481,203
1675405883,60
1675492281,80
1675578681,32
1675665075,37
1675751474,68
1675837863,42
1676356254,12
1676442661,35
1676529061,58
1676615450,79
1676701857,57
1676788249,34
1676874662,29
1676961061,42
1677047454,36
1677133857,26
1677220262,50
1677306660,28
1677393061,34
1677479458,33
1677565859,39
1677652257,44
1677738657,60
1677825057,39
1677911460,66
1677997847,24
1678084257,42
1678170666,38
1678257055,40
1678343445,75
1679569142,49
1679584407,49
1679589867,49
1679596494,49
1679602915,49
1679607956,49
1679639532,48
1679722309,68
1679808717,28
1679895117,33
1679981518,66
1680067912,27
1680154308,25
1680240714,31
1680327097,36
1680413504,30
1680499902,34
1680586299,46
1680672702,26
1680759104,158
1680845523,37
1680931899,26
1681018301,22
1681104713,92
1681191117,32
1681277516,35
1681363906,52
1681450306,68
1681536706,25
1681623105,37
1681709528,40
1681795909,74
1681882326,51
1681968706,119
1682055103,23
1682141505,37
1682227910,34
1682314324,33
1682400707,53
1682487105,37
1682573524,150
1682659898,33
1682746309,118
1682832700,42
1682919107,50
1683005499,41
1683091901,27
1683178309,55
1683264713,32
1683351101,25
1683437506,236
1683523904,94
1683610328,27
1683696716,42
1683783116,35
1683869508,58
1683955918,32
1684042308,38
1685544777,42
1685597496,44
1685683902,45
1685770303,48
1685856701,97
1685943100,42
1686029502,49
1686115904,40
1686202306,52
1686288711,52
1686375108,59
1686461512,39
1686547909,45
1686634309,52
1686720704,119
1686807105,50
1686893562,44
1686979954,36
1687066360,34
1687152774,22
1687239150,37
1687411953,17
1687498393,38
1687584774,24
1687671173,56
1687757568,20
1687843969,33
1687930377,56
1688016807,131
1688103218,116
1688189597,111
1688275996,90
1688362412,21
1688535215,1225
1688621614,34
1688708029,53
1688794420,41
1688880821,37
1688967219,51
1689053626,16
1689140028,62
1689226424,27
1689312837,49
1689399195,39
1689485597,31
1689572000,47
1689658397,28
1689744807,68
1689831241,33
1689917640,83
1690004042,37
1690090404,37
1690176817,47
1690263240,29
1690349617,40
1690436012,24
1690522443,30
1690608808,37
1690695212,27
1690781617,40
1690868047,20
1690954421,45
1691040818,111
1691127250,34
1691213630,27
1691300015,29
1691386395,31
1691472821,42
1691559206,32
1691645653,31
1691732035,28
1691818443,26
1691904834,42
1691991184,31
1692077570,53
1692163972,547
1692250382,48
1692336773,19
1692423180,50
1692509573,22
1692595944,6
1692682368,85
1692768764,28
1692855167,48
1692941568,37
1693027980,22
1693114356,20
1693200777,25
1693287141,9
1693373568,39
1693459952,32
1693546364,30
1693632754,25
1693719144,30
1693805540,34
1693891949,30
1693978362,48
1694064749,18
1694151151,55
1694237547,16
1694323959,31
1694410362,30
1694496769,41
1694583178,21
1694669562,32
1694755972,24
1694842363,24
1694928766,148
1695015165,24
1695187975,22
1695274380,36
1695360784,79
1695447164,21
1695533586,16
1695619990,21
1695706406,21
1695792808,26
1695879218,21
1695965624,18
1696052011,26
1696138408,18
1696224807,20
1696311219,51
1696397621,20
1696484041,32
1696570435,29
1696656841,25
1696743237,32
1696829644,27
1696916048,38
1697002439,25
1697088838,124
1697175238,25
1697261644,27
1697348050,43
1697434425,76
1697520844,44
1697607247,40
1697693651,53
1697780021,78
1697866447,82
1697952848,32
1698039229,28
1698125641,38
1698212053,36
1698298423,29
1698384826,36
1698474862,24
1698561261,80
1698647660,69
1698734051,42
1698820440,78
1698906836,59
1698993260,63
1699079643,47
1699166057,47
1699252467,31
1699338847,30
1699425254,35
1699511642,35
1699598052,43
1699684453,56
1699770845,25
1699857241,43
1699943653,45
1700030030,43
1700116443,33
1700202865,40
1700289223,48
1700375637,46
1700462021,32
1700548451,170
1700634836,31
1700721246,29
1700807657,28
1700894058,23
1700980458,39
