1636286412,2253
1636286488,2295
1636895594,18516
1636898490,20881
1636900709,22332
1637070326,19711
1637070818,20108
1637072812,40097
1637122028,33504
1637208446,29925
1637294806,26119
1637381227,10359
1637467621,13563
1637554087,39022
1637589848,39022
1637726914,29548
1637813369,27361
1638072517,9257
1638158887,24221
1638245235,26232
1638331638,38962
1639904549,10350
1639907950,10350
1639980923,27736
1639983233,27736
1639985995,27736
1640059226,23454
1640080313,23454
1640145685,20063
1640232083,14943
1640318424,4847
1640404823,5193
1640491284,6807
1640577691,18743
1640664024,18111
1640750484,17162
1640836884,14276
1640923223,5376
1641009626,8175
1641096084,13098
1641182484,23859
1641268824,27157
1641355224,20171
1641441684,12583
1641528084,18347
1641700884,12528
1641787224,28951
1641873686,35915
1642392088,31747
1642408942,31747
1642478484,36666
1642564885,35574
1642651226,37228
1642676514,37228
1642805851,28357
1642824026,9772
1642855125,9772
1642910490,13784
1642924655,13784
1642934565,13784
1642937864,13784
1642996892,34505
1643083292,33064
1643169628,33632
1643256090,32701
1643342487,24320
1643428827,11124
1643515288,13965
1643601634,42934
1643622207,42934
1643688028,36209
1643708607,36209
1643774489,31570
1643860889,35010
1643947288,26626
1644033629,11245
1644120088,14017
1644206493,37704
1644292831,34519
1644321030,34519
1644388289,35504
1644407490,35504
1644474692,31855
1644493888,31855
1644561030,26509
1644647492,9581
1644733834,12626
1644770508,12626
1644820292,33991
1644906689,33297
1644993090,32679
1645079499,32583
1645165829,24191
1645252290,8212
1645338629,11804
1645425030,33911
1645467113,33911
1645470826,33911
1645511492,30013
1645597892,27668
1645684232,26816
1645770629,18104
1645857150,6258
1645943553,8857
1646029893,25226
1646116237,24693
1646202760,28462
1646289033,27002
1646375551,19690
1646461951,8183
1646548229,10815
1646634751,25185
1646721161,25292
1646807431,28467
1646893952,23458
1646980230,18769
1647066751,7770
1647153150,10770
1647239550,38322
1647325952,35621
1647412352,35455
1647498752,31266
1647585151,22399
1647757954,8992
1647844355,30763
1647930752,29190
1648017150,31484
1648103550,24874
1648189831,19194
1648276229,8776
1648362752,11614
1648449033,29453
1648535442,25299
1648621952,24158
1648708231,25658
1648794750,17401
1648881149,6951
1648967561,9502
1649053832,24833
1649140351,23230
1649226751,24611
1649313029,22021
1649399549,16424
1649485949,8459
1649572354,9527
1649658750,19216
1649745150,21111
1649831565,19483
1649917950,13852
1650004228,7391
1650090628,7016
1650177150,7682
1650263549,12597
1650349831,24956
1650436229,19728
1650522756,21490
1650609163,15201
1650695550,7417
1650781953,7860
1650868349,18396
1650954630,19146
1651041030,18231
1651127552,21275
1651213951,14683
1651300352,5993
1651386755,7821
1651473034,21291
1651559564,21252
1651645850,15277
1651732362,17552
1651818753,12737
1651905153,5742
1651991564,7450
1652077954,17997
1652164360,23148
1652250764,20313
1652337032,20064
1652423553,14409
1652509832,6122
1652596232,7354
1652682759,18534
1652769160,24146
1652855561,23482
1652941964,31904
1653028353,20046
1653114753,7919
1653201159,8236
1653287558,24983
1653373954,25373
1653460234,19331
1653546755,7947
1653633154,12821
1653719553,5847
1653805957,6566
1653892236,28250
1653978755,22879
1654065033,21771
1654151553,23405
1654237831,15293
1654324351,6007
1654410631,5893
1654497153,7117
1654583555,19939
1654669837,19701
1654756356,18035
1654842756,14903
1654929156,5991
1655015436,8137
1655101838,17711
1655188357,16589
1655274636,15670
1655361158,13564
1655447555,13839
1655533836,5490
1655620256,6109
1655706645,14733
1655793158,12954
1655879557,15928
1655965955,12246
1656052365,3374
1656138754,4614
1656225155,6076
1656311556,15023
1656397956,14736
1656484356,14574
1656570758,18169
1656743558,5000
1656829841,6557
1656916357,15424
1657002637,17649
1657089163,16379
1657175559,13877
1657261838,12057
1657348240,5175
1657434758,6171
1657521164,13652
1657607566,14231
1657693957,14802
1657780357,12945
1657803090,12945
1657804447,12945
1657809517,12945
1657866760,11386
1657896040,11386
1657953158,5397
1657982325,5397
1658039438,6680
1658068726,6680
1658125843,12980
1658155247,12980
1658212362,12440
1658241661,12440
1658298758,11246
1658328052,11246
1658385041,10942
1658414447,10942
1658471560,9996
1658500847,9996
1658557962,5267
1658587247,5267
1658644360,5875
1658673645,5875
1658730762,12790
1658760045,12790
1658817160,11065
1658846453,11065
1658903439,10323
1658932848,10323
1658989840,10619
1659019246,10619
1659076365,8978
1659105646,8978
1659162770,5153
1659192044,5153
1659249159,5834
1659278470,5834
1659335565,14259
1659364847,14259
1659421963,12194
1659451128,12194
1659508368,13144
1659537519,13144
1659594767,12045
1659624049,12045
1659681160,9281
1659710444,9281
1659767561,5736
1659796845,5736
1659853840,7745
1659883130,7745
1659940369,16581
1659969638,16581
1660026647,15722
1660056049,15722
1660113163,15233
1660142439,15233
1660199441,15469
1660228849,15469
1660285970,12816
1660315250,12816
1660372250,6133
1660401521,6133
1660458761,6903
1660488049,6903
1660545162,19020
1660574449,19020
1660631564,22508
1660660730,22508
1660717841,19473
1660747248,19473
1660804362,19375
1660833647,19375
1660890760,15782
1660920046,15782
1660977162,7182
1661006455,7182
1661063442,9355
1661092854,9355
1661149842,23986
1661179125,23986
1661236366,22933
1661265647,22933
1661322641,28392
1661352051,28392
1661409162,27292
1661438449,27292
1661495561,19926
1661524735,19926
1661581964,8140
1661611239,8140
1661668363,10568
1661697647,10568
1661700049,10568
1661754784,28760
1661784048,28760
1661870448,27341
1661927560,24839
1661956724,24839
1662013964,21795
1662043246,21795
1662100359,20253
1662129642,20253
1662186760,8217
1662216045,8217
1662273039,10028
1662302447,10028
1662359559,25551
1662388727,25551
1662445958,27844
1662475124,27844
1662532358,28089
1662561643,28089
1662618758,25492
1662647931,25492
1662705164,19019
1662734437,19019
1662791558,8692
1662820724,8692
1662877847,8724
1662907237,8724
1662964357,34774
1662993645,34774
1663050638,30868
1663080057,30868
1663137169,30328
1663166448,30328
1663223564,25688
1663252844,25688
1663309969,19455
1663339237,19455
1663396358,10114
1663425653,10114
1663482759,12270
1663512042,12270
1663569159,27253
1663598447,27253
1663655565,28742
1663684725,28742
1663741840,29223
1663771124,29223
1663828239,26640
1663857524,26640
1663914640,18579
1663943934,18579
1664001039,10381
1664030318,10381
1664087438,81797
1664116722,81797
1664173842,38792
1664203127,38792
1664260251,30285
1664289537,30285
1664346641,29225
1664375951,29225
1664433041,31497
1664462320,31497
1664519554,21971
1664548711,21971
1664605833,12728
1664635111,12728
1668081545,28653
1668350533,12894
1668355972,12894
1668356757,12894
1668360810,12894
1668474184,31460
1668560577,28529
1668646979,26704
1671629111,21148
1671630664,21148
1671632450,21148
1671634011,21148
1673516775,33795
1674367285,10929
1674455475,26756
1674541884,32193
1674628285,34264
1674714694,31455
1674801082,27081
1674887480,12260
1674973872,18327
1675060281,41975
1675146682,37786
1675233071,37501
1675319481,35349
1675405883,25489
1675492281,12003
1675578681,14602
1675665075,33554
1675751474,35448
1675837863,16196
1676356254,32643
1676442661,33279
1676529061,30198
1676615450,25010
1676701857,10810
1676788249,13815
1676874662,30627
1676961061,31925
1677047454,31343
1677133857,28232
1677220262,20214
1677306660,9737
1677393061,12989
1677479458,30945
1677565859,29199
1677652257,43894
1677738657,28096
1677825057,22091
1677911460,9604
1677997847,11925
1678084257,29180
1678170666,30470
1678257055,29127
1678343445,28875
1679569142,31311
1679584407,31311
1679589867,31311
1679596494,31311
1679602915,31311
1679607956,31311
1679639532,24424
1679722309,10461
1679808717,12838
1679895117,19314
1679981518,31486
1680067912,30961
1680154308,31475
1680240714,24017
1680327097,13009
1680413504,12877
1680499902,31740
1680586299,33596
1680672702,29945
1680759104,21280
1680845523,10390
1680931899,8587
1681018301,10103
1681104713,13097
1681191117,31399
1681277516,29476
1681363906,33094
1681450306,25769
1681536706,12967
1681623105,16194
1681709528,35294
1681795909,28196
1681882326,28830
1681968706,27861
1682055103,19112
1682141505,8670
1682227910,12438
1682314324,30279
1682400707,31190
1682487105,26638
1682573524,28142
1682659898,21592
1682746309,8878
1682832700,8449
1682919107,13428
1683005499,30612
1683091901,29598
1683178309,30544
1683264713,23004
1683351101,8157
1683437506,10320
1683523904,27054
1683610328,28960
1683696716,26729
1683783116,24109
1683869508,19115
1683955918,8260
1684042308,10506
1685544777,34877
1685597496,27024
1685683902,21581
1685770303,10160
1685856701,11609
1685943100,23971
1686029502,13065
1686115904,27519
1686202306,32141
1686288711,21244
1686375108,9186
1686461512,11549
1686547909,32396
1686634309,27630
1686720704,29303
1686807105,46289
1686893562,22519
1686979954,9656
1687066360,13296
1687152774,27790
1687239150,25383
1687411953,20273
1687498393,6912
1687584774,7768
1687671173,10222
1687757568,30280
1687843969,32036
1687930377,29292
1688016807,29328
1688103218,25313
1688189597,9685
1688275996,11549
1688362412,27459
1688535215,22704
1688621614,22305
1688708029,16978
1688794420,8245
1688880821,9365
1688967219,21107
1689053626,19558
1689140028,25625
1689226424,22561
1689312837,18770
1689399195,9899
1689485597,11282
1689572000,20168
1689658397,20488
1689744807,19405
1689831241,18692
1689917640,15293
1690004042,9263
1690090404,10223
1690176817,20931
1690263240,19460
1690349617,18031
1690436012,17924
1690522443,14390
1690608808,9265
1690695212,11060
1690781617,24886
1690868047,23173
1690954421,21536
1691040818,21675
1691127250,17963
1691213630,9759
1691300015,14406
1691386395,27179
1691472821,28302
1691559206,26345
1691645653,23842
1691732035,19162
1691818443,11700
1691904834,15175
1691991184,30628
1692077570,30583
1692163972,29910
1692250382,34611
1692336773,23340
1692423180,11868
1692509573,15278
1692595944,2332
1692682368,37338
1692768764,42091
1692855167,35456
1692941568,28655
1693027980,14560
1693114356,19256
1693200777,43363
1693287141,32770
1693373568,40861
1693459952,40768
1693546364,30608
1693632754,16342
1693719144,19465
1693805540,42749
1693891949,43835
1693978362,43470
1694064749,39683
1694151151,33432
1694237547,15050
1694323959,20380
1694410362,39350
1694496769,45648
1694583178,50795
1694669562,43386
1694755972,34186
1694842363,14563
1694928766,19246
1695015165,49603
1695187975,52086
1695274380,42916
1695360784,34095
1695447164,16475
1695533586,19819
1695619990,46703
1695706406,44860
1695792808,49882
1695879218,44406
1695965624,36343
1696052011,16901
1696138408,20719
1696224807,52149
1696311219,50332
1696397621,45093
1696484041,43866
1696570435,36110
1696656841,15577
1696743237,20361
1696829644,46580
1696916048,44311
1697002439,44513
1697088838,45710
1697175238,34912
1697261644,17566
1697348050,23073
1697434425,51856
1697520844,48702
1697607247,42749
1697693651,47451
1697780021,32339
1697866447,15361
1697952848,18450
1698039229,52142
1698125641,48404
1698212053,43763
1698298423,39407
1698384826,30595
1698474862,14153
1698561261,19637
1698647660,41437
1698734051,40267
1698820440,39032
1698906836,34734
1698993260,25172
1699079643,18561
1699166057,22470
1699252467,55758
1699338847,65649
1699425254,61738
1699511642,55586
1699598052,47109
1699684453,21681
1699770845,24092
1699857241,60273
1699943653,63248
1700030030,54956
1700116443,48359
1700202865,39995
1700289223,17219
1700375637,23883
1700462021,61797
1700548451,53630
1700634836,60604
1700721246,46147
1700807657,36659
1700894058,14737
1700980458,20675
