1651386755,1
1651473034,13
1651559564,20
1651645850,20
1651732362,22
1651818753,17
1651905153,7
1651991564,4
1652077954,11
1652164360,14
1652250764,5
1652337032,7
1652423553,7
1652509832,4
1652596232,6
1652682759,11
