1695187834,1
1695274234,1
1695360634,1
1695533434,1
1695619839,1
1695965441,1
1696311044,1
1696483842,1
1696570241,1
1696656645,2
1696743043,2
1696829444,2
1697175042,1
1698993045,2
1699079441,1
1699165843,1
1699252253,6
