1676356254,6
1676442661,16
1676529061,16
1676615450,13
1676701857,4
1676788249,11
1676874662,3
1676961061,22
1677047454,17
1677133857,18
1677220262,22
1677306660,7
1677393061,6
1677479458,14
1677565859,16
1677652257,22
