1653201159,6
1653287558,27
1653373954,35
1653460234,31
1653546755,27
1653633154,26
1653719553,25
1653805957,36
1653892236,24
1653978755,27
1654065033,31
1654151553,36
1654237831,33
1654324351,36
1654410631,37
1654497153,7
