1642651226,1
1642676514,1
1642805851,1
1643083292,30
1643601634,41
1643622207,41
1643688028,48
1643708607,48
1643774489,4
1643860889,2
1643947288,2
1644120088,72
1644206493,43
1644388289,3
1644407490,3
1644474692,9
1644493888,9
1644561030,3
1644647492,92
1644820292,3
1644906689,2
1645165829,76
1645252290,2
