1642392088,15
1642408942,15
1642478484,15
1642564885,14
1642651226,15
1642676514,15
1642769502,22
1642771604,22
1642805136,22
1642805851,22
1642824026,15
1642855125,15
1642910490,13
1642924655,13
1642934565,13
1642937864,13
1642996892,13
1643083292,13
1643169628,12
1643256090,15
1643342487,11
1643428827,6
1643515288,1
1643601634,5
1643622207,5
1643688028,5
1643708607,5
1643774489,9
1643860889,5
1643947288,6
1644033629,6
1644120088,5
1644206493,10
1644292831,5
1644321030,5
1644388289,4
1644407490,4
1644474692,7
1644493888,7
1644561030,5
1644647492,4
1644733834,4
1644770508,4
1644820292,2
1644906689,7
1644993090,9
1645079499,3
1645165829,3
1645252290,2
1645425030,4
1645467113,4
1645470826,4
1645511492,4
1645597892,5
1645684232,3
1645770629,1
1645857150,6
1645943553,4
1646029893,3
1646116237,10
1646202760,5
1646289033,1
1646375551,4
1646461951,4
1646548229,1
1646634751,3
