1653978755,6
1654065033,18
1654151553,26
1654237831,13
1654324351,21
1654410631,16
1654497153,18
1654583555,24
1654669837,14
1654756356,8
1654842756,4
1654929156,3
1655015436,3
1655101838,22
1655188357,13
1655274636,6
1655361158,7
1655447555,19
1655533836,9
1655620256,24
1655706645,8
1655793158,15
1655879557,9
1655965955,16
1656052365,10
1656138754,8
1656225155,4
1656311556,11
1656397956,12
1656484356,5
1656570758,11
