1695619990,439
1695706406,439
1696397621,145
1696656841,3
1696829644,2
1697088838,3
1697261644,439
1697348050,39
1697520844,9
1697952848,2
1698298423,59
1698474862,2
1698993260,3
1699166057,76
1699425254,93
