1685544777,26
1685597496,29
1685683902,29
1685770303,23
1685856701,23
1685943100,25
1686029502,24
1686115904,30
1686202306,25
1686288711,32
1686375108,28
1686461512,23
1686547909,25
1686634309,33
1686720704,34
1686807105,41
1686893562,32
1686979954,28
1687066360,31
1687152774,35
1687239150,28
1687411953,29
1687498393,28
1687584774,27
1687671173,16
1687757568,20
1687843969,3
