1673516775,6
1674367285,18
1674455475,5
1674541884,19
1674628285,15
1674714694,15
1674801082,4
1674887480,8
1674973872,24
1675060281,8
1675146682,5
1675233071,14
1675319481,6
1675405883,4
1675492281,11
