1639904549,4
1639907950,4
1639980923,1
1639983233,1
1639985995,1
1640059226,4
1640080313,4
1640145685,9
1640232083,1
1640318424,2
1640404823,6
1640491284,4
1640577691,2
1640664024,3
1640750484,4
1640836884,2
1640923223,2
1641009626,2
