1690436012,37
1690522443,153
1690608808,362
1690695212,188
1690781617,35
1690868047,146
1690954421,266
1691040818,536
1691127250,155
1691213630,53
1691300015,109
1691386395,482
1691472821,391
1691559206,816
1691645653,222
