1691645653,36
1691732035,94
1691818443,88
1691904834,64
1691991184,61
1692077570,41
1692163972,86
1692250382,51
1692336773,31
1692423180,76
1692509573,84
1692595944,26
1692682368,78
1692768764,28
1692855167,62
1692941568,17
1693027980,21
1693114356,21
1693200777,17
1693287141,51
1693373568,42
1693459952,58
1693546364,25
1693632754,28
1693719144,88
1693805540,99
1693891949,72
1693978362,83
1694064749,2
