1645252290,17
1645338629,68
1645425030,85
1645467113,85
1645470826,85
1645511492,241
1645597892,142
1645684232,319
1645770629,160
1645857150,131
1645943553,112
1646029893,248
1646116237,268
1646202760,139
1646289033,133
1646375551,108
1646461951,276
1646548229,109
1646634751,74
1646721161,143
1646807431,112
1646893952,115
1646980230,520
1647066751,99
1647153150,411
1647239550,118
1647325952,154
1647412352,283
1647498752,521
1647585151,196
1647757954,139
1647844355,212
1647930752,144
1648017150,259
1648103550,371
1648189831,162
1648276229,250
1648362752,161
1648449033,154
1648535442,134
1648621952,162
1648708231,117
