1645597892,6
1645684232,10
1645770629,16
1645857150,9
1645943553,16
1646029893,25
1646116237,23
1646202760,7
1646289033,10
1646375551,17
1646461951,6
1646548229,19
1646634751,17
1646721161,14
1646807431,17
1646893952,11
