1698211845,1
1698474646,1
1698561046,1
1698647445,1
1698733843,2
1698993045,1
1699079441,1
1699165843,1
1699252253,6
1699338639,1
1699425038,1
1699597838,2
1699684239,1
1699770639,1
1699943446,1
1700116239,1
1700202637,2
1700289040,1
