1642392088,16
1642408942,16
1642478484,15
1642564885,12
1642651226,19
1642676514,19
1642769502,19
1642771604,19
1642805136,19
1642805851,19
1642824026,19
1642855125,19
1642910490,17
1642924655,17
1642934565,17
1642937864,17
1642996892,14
1643083292,18
1643169628,15
1643256090,20
1643342487,14
1643428827,4
1643515288,4
1643601634,6
1643622207,6
1643688028,3
1643708607,3
1643774489,6
1643860889,3
1643947288,3
1644033629,7
1644120088,6
1644206493,7
1644292831,10
1644321030,10
1644388289,6
1644407490,6
1644474692,6
1644493888,6
1644561030,8
1644647492,6
1644733834,8
1644770508,8
1644820292,1
1644906689,16
1644993090,3
1645079499,5
1645165829,1
1645252290,4
