1685544777,4
1685597496,4
1685683902,15
1685770303,8
1685856701,11
1685943100,8
1686029502,17
1686115904,8
1686202306,11
1686288711,5
1686375108,16
1686461512,16
1686547909,8
1686634309,8
1686720704,5
1686807105,10
1686893562,9
1686979954,5
1687066360,6
1687152774,5
1687239150,3
1687411953,3
1687498393,3
1687584774,1
