1646980230,2
1647153150,1
1647325952,1
1647412352,1
1647585151,1
1647844355,1
1651991564,1
1652423553,1
1652509832,2
1654842756,1
1655015436,1
1655274636,1
1655533836,1
1655620256,2
1656052365,1
1656138754,1
1656397956,2
1656484356,4
1656743558,4
1656829841,1
1658730762,1
1658760045,1
1658817160,1
1658846453,1
1658903439,2
1658932848,2
1659076365,1
1659105646,1
1659162770,1
1659192044,1
1659249159,1
1659278470,1
1659335565,1
1659364847,1
1659421963,1
1659451128,1
1659594767,1
1659624049,1
1659681160,2
1659710444,2
1659853840,1
1659883130,1
1660026647,1
1660056049,1
1662445958,1
1662475124,1
1662532358,1
1662561643,1
1662877847,1
1662907237,1
1662964357,3
1662993645,3
1663050638,7
1663080057,7
1663137169,1
1663166448,1
1663223564,2
1663252844,2
1663309969,1
1663339237,1
1663569159,1
1663598447,1
1663655565,1
1663684725,1
