1645252290,21
1645338629,72
1645425030,98
1645467113,98
1645470826,98
1645511492,159
1645597892,147
1645684232,182
1645770629,672
1645857150,132
1645943553,173
1646029893,280
1646116237,437
1646202760,136
1646289033,122
1646375551,118
1646461951,139
1646548229,249
