1679584314,1
1679589759,1
1679596397,1
1679602819,1
1679607852,1
1679639432,1
1680240629,1
1680845434,1
1681623032,1
1682573432,1
1683437432,1
1698993045,1
1699165843,1
1699252253,3
1699338639,1
1699425038,1
1699597838,1
1699684239,1
1699770639,1
1699943446,1
1700116239,1
1700202637,2
