1681795835,1
1681882234,2
1681968635,2
1682573432,3
1685544705,1
1688707844,1
1688967042,5
1689485439,1
1690435846,1
1690608645,1
1693114233,1
1694064634,1
1697002242,1
1697088641,1
1698561046,1
1698647445,2
1699943446,2
1700202637,1
1700289040,5
1700980240,1
1703140241,1
1703226640,1
1703658641,1
1706596254,1
1706682653,1
1706855451,2
1707028260,2
1707633051,2
1707719451,1
1707978650,1
1710052251,3
1711261844,3
1712295052,24
1715491864,2
1718083857,6
1718343064,4
1722835849,2
1723354248,2
1724045446,5
1726551051,2
1726810249,1
1726983051,3
1727415052,2
1730183452,2
1730615453,2
1730874652,7
1731565854,1
1732516250,1
1733293861,2
