1712468183,8
1712554571,2
1712640970,2
1712727387,2
1712813813,2
1712986589,2
1713073014,2
1713159410,2
1713245803,2
1713332196,2
1713418604,2
1713505010,2
1713591405,2
1713677807,2
1713764197,2
1713850601,2
1713937016,2
1714023425,2
1714109816,2
1714196216,2
1714282602,2
1714369033,2
1714455398,2
1714541804,2
1714714600,2
1714801009,2
1714887409,6
1714973810,2
1715060210,2
1715146632,2
1715233058,2
1715405851,2
1715492244,2
1718022496,2
1718084230,4
1718170636,2
1718257047,2
1718343427,2
1718429818,2
1718516215,2
1718602645,2
1718689022,2
1718775431,2
1718861831,3
1718948217,2
1719034629,2
1719121031,2
1719207304,2
1719293732,2
1719380130,2
1719725705,6
1720071331,2
1720157731,2
1720244127,2
1720330509,2
1720416929,2
1720503328,2
1720589730,2
1720762554,2
1721021712,2
1721108139,2
1721194539,2
1721280942,2
1721367339,2
1721453736,2
1721540139,2
1721626512,2
1721712930,2
1721799317,2
1721885729,2
1721972116,2
1722058513,2
1722144941,6
1722231340,2
1722317737,2
1722404147,2
1722490541,2
1722576933,2
1722663315,2
1722749743,2
1722836105,2
1722922512,2
1723008910,2
1723095317,2
1723268105,3
1723354509,2
1723440921,2
1723527316,2
1723613721,2
1723700119,2
1723786513,2
1723872909,2
1723959316,2
1724045707,2
1724132118,2
1724218520,2
1724391319,2
1724477730,2
1724564111,6
1724823316,2
1724909717,2
1724996108,2
1725082506,2
1725168909,2
1725255319,2
1725428109,2
1725514506,2
1725687306,2
1725773707,2
1725860113,2
1726119315,11
1726637718,3
1726724132,2
1726896925,2
1726983322,5
1727069719,2
1727328917,2
1727415326,2
1727501713,2
1727588116,2
1727674524,2
1727847333,2
1727933723,2
1728020122,2
1728106547,2
1728192945,2
1728452151,2
1728538537,2
1728624938,2
1728711328,2
1728797737,2
1728884126,2
1728970539,2
1729229724,2
1729402521,6
1729661730,2
1729748135,2
1729834546,2
1729924541,2
1730010943,2
1730183730,2
1730270141,2
1730356536,3
1730529338,2
1730615759,2
1730702128,2
1731047722,2
1731134141,2
1731220531,2
1731738930,2
1731825326,6
1732343726,8
1732430128,2
1732775733,2
1733207816,11
