1617156000,49441
1617242400,46868
1617328800,47869
1617415200,47192
1617501600,46908
1617588000,45422
1617674400,44157
1617760800,45211
1617847200,46230
1617933600,47147
1618020000,47872
1618106400,47374
1618192800,44631
1618279200,45294
1618365600,46777
1618452000,47806
1618538400,47806
1618624800,49336
1618711200,49090
1618797600,46039
1618884000,47680
1618970400,48994
1619056800,50015
1619143200,50791
1619229600,51669
1619316000,51426
1619402400,49047
1619488800,50311
1619575200,51487
1619661600,52784
1619748000,53655
1619834400,49681
1619920800,49155
1620007200,47351
1620093600,48500
1620180000,50119
1620266400,51524
1620352800,52610
1620439200,53232
1620525600,52989
1620612000,50734
1620698400,51776
1620784800,53074
1620871200,53895
1620957600,53045
1621044000,52459
1621130400,51687
1621216800,48470
1621303200,49755
1621389600,50769
1621476000,51651
1621562400,52181
1621648800,52682
1621735200,52348
1621821600,49736
1621908000,50782
1621994400,52040
1622080800,52872
1622167200,53757
1622253600,53992
1622340000,53613
1622426400,50648
1622512800,50648
1622599200,50648
1622685600,50648
1622772000,50648
1622858400,50648
1622944800,50648
1623031200,50648
1623117600,50648
1623204000,50648
1623290400,50648
1623376800,50648
1623463200,50648
1623549600,50648
1623636000,50648
1623722400,50648
1623808800,50648
1623895200,50648
1623981600,51190
1624068000,50865
1624154400,50349
1624240800,47399
1624327200,48353
1624413600,49530
1624500000,49727
1624672800,49052
1624759200,48461
1624845600,46253
1624932000,47335
1625018400,48525
1625104800,48525
1625191200,48525
1625277600,46051
1625364000,45717
1625450400,44177
1625536800,45392
1625623200,46807
1625709600,47505
1625796000,48281
1625882400,49041
1625968800,48593
1626055200,47279
1626141600,48072
1626228000,48874
1626314400,49138
1626400800,49165
1626487200,49219
1626573600,48878
1626660000,47784
1626746400,48485
1626832800,49033
1626919200,49247
1627005600,49481
1627092000,49220
1627178400,48936
1627264800,48165
1627351200,48852
1627437600,49385
1627524000,49595
1627610400,49843
1627696800,49150
1627783200,46562
1627869600,45074
1627956000,45933
1628042400,46989
1628128800,47434
1628215200,47863
1628301600,47663
1628388000,47346
1628474400,44928
1628560800,45885
1628647200,46924
1628733600,47901
1628906400,48473
1628992800,48316
1629079200,43697
1629165600,44206
1629252000,46085
1629338400,47447
1629424800,48698
1629511200,49473
1629597600,49159
1629684000,46362
1629770400,47272
1629856800,48729
1629943200,49761
1630029600,51292
1630116000,52299
1630202400,51967
1630288800,49509
1630375200,50418
1630461600,46589
1630548000,47911
1630634400,49378
1630720800,50561
1630807200,50260
1630893600,47853
1630980000,49466
1631066400,51270
1631152800,52518
1631239200,54036
1631325600,54900
1631412000,54565
1631498400,52004
1631584800,53603
1631671200,55481
1631757600,55883
1631844000,56895
1631930400,57579
1632016800,57149
1632103200,53979
1632189600,54013
1632276000,55655
1632362400,56810
1632448800,57945
1632535200,58791
1632621600,58173
1632708000,55386
1632794400,56673
1632880800,58159
1632967200,58159
1633053600,55532
1633140000,55034
1633226400,54553
1633312800,52188
1633399200,53647
1633485600,55788
1633572000,56844
1633658400,57764
1633744800,58407
1633831200,57716
1633917600,54339
1634004000,55725
1634090400,57505
1634176800,58450
1634263200,59249
1634349600,59211
1634436000,58677
1634522400,55498
1634695200,58787
1634781600,59463
1634868000,59463
1634954400,60724
1635040800,60152
1635127200,57030
1635213600,58221
1635300000,59864
1635386400,60794
1635472800,61788
1635559200,62078
1635645600,60998
1635732000,53951
1635818400,55184
1635904800,56806
1635991200,58038
1636077600,59347
1636164000,59514
1636250400,59040
1636336800,55918
1636423200,57312
1636509600,59149
1636596000,60033
1636682400,61103
1636768800,61710
1636855200,61166
1637028000,58679
1637114400,60557
1637200800,61862
1637287200,62776
1637373600,63337
1637460000,62543
1637546400,59281
1637632800,59874
1637719200,61771
1637805600,62679
1637892000,63140
1637978400,63495
1638064800,62844
1638151200,59659
1638237600,60890
1638324000,56416
1638410400,57295
1638496800,58427
1638583200,58901
1638669600,58233
1638756000,55102
1638842400,57067
1638928800,58786
1639015200,59675
1639101600,61050
1639188000,61532
1639274400,61064
1639360800,57573
1639447200,57573
1639533600,60738
1639620000,61029
1639706400,61710
1639879200,61730
1639965600,59025
1640052000,60641
1640138400,63311
1641175200,59176
1641261600,57784
1641348000,59794
1641434400,60805
1641520800,60123
1641693600,59223
1641780000,53873
1641866400,54212
1641952800,56146
1642039200,57575
1642125600,59402
1642212000,60449
1642298400,59471
1642384800,55182
1642730400,62493
1642816800,63686
1642816800,63686
1642816800,63686
1642816800,63686
1642903200,63227
1642989600,60552
1642989600,60552
1642989600,60552
1643162400,64518
1643248800,66277
1643680800,62176
1643767200,64410
1644372000,71552
1644458400,73185
1644458400,73185
1644544800,74245
1644544800,74245
1644631200,75196
1644717600,74579
1644804000,71121
1644804000,71121
1644890400,72422
1644976800,74353
1645063200,75753
1645149600,77146
1645236000,78160
1645322400,77433
1645408800,73231
1645495200,74761
1645495200,74761
1645495200,74761
1645581600,77090
1645668000,78275
1645754400,79773
1645840800,80816
1645927200,80285
1646013600,76530
1646100000,70916
1646186400,71601
1646272800,73284
1646359200,74297
1646445600,75337
1646532000,74837
1646618400,71353
1646704800,72773
1646791200,74965
1646877600,76343
1646964000,77270
1647050400,78347
1647136800,77993
1647223200,74002
1647309600,75512
1647396000,76948
1647482400,78753
1647568800,79949
1647655200,80898
1647741600,80406
1647914400,78104
1648000800,80464
1648087200,81684
1648173600,82957
1648346400,83246
1648432800,79796
1648519200,81395
1648605600,83666
1648692000,84777
1648778400,77632
1648864800,78912
1648951200,78319
1649037600,74681
1649124000,76560
1649210400,79104
1649296800,80907
1649383200,82764
1649469600,83734
1649556000,83118
1649642400,78521
1649728800,80524
1649815200,83071
1649901600,85092
1649988000,86412
1650074400,83340
1650160800,82581
1650247200,78553
1650333600,75932
1650420000,77935
1650506400,78607
1650592800,80102
1650679200,80939
1650765600,80206
1650852000,75771
1650938400,77218
1651024800,79182
1651111200,80232
1651197600,81466
1651284000,81835
1651370400,73372
1651456800,69601
1651543200,72456
1651629600,75246
1651716000,77356
1651802400,78962
1651888800,80013
1651975200,79230
1652061600,75394
1652148000,77488
1652234400,79835
1652320800,81250
1652407200,82496
1652493600,83596
1652580000,82950
1652666400,78352
1652752800,80467
1652839200,82420
1652839200,82420
1652925600,85116
1653012000,85573
1653184800,85094
1653271200,80804
1653357600,82916
1653444000,84517
1653444000,84517
1653444000,84517
1653703200,83039
1653789600,81992
1653876000,77520
1653962400,78410
1654048800,71961
1654135200,72483
1654221600,73749
1654308000,74142
1654394400,73283
1654480800,69860
1654567200,67690
1654653600,69324
1654740000,70794
1654826400,72312
1654912800,72483
1654999200,71599
1655085600,67649
1655172000,68805
1655258400,70276
1655344800,69982
1655431200,70874
1655517600,71269
1655604000,70281
1655690400,66602
1655863200,69002
1655949600,69617
1656036000,70312
1656122400,68709
1656208800,68057
1656295200,65353
1656381600,66692
1656468000,68184
1656554400,68840
1656640800,63283
1656813600,63467
1656900000,61375
1656986400,62835
1657072800,64463
1657159200,65770
1657245600,66660
1657332000,67355
1657418400,66786
1657504800,64819
1657591200,66219
1657677600,67253
1657764000,67490
1657850400,67793
1657850400,67793
1657850400,67793
1657936800,67581
1657936800,67581
1658023200,66972
1658023200,66972
1658109600,65505
1658109600,65505
1658196000,66675
1658196000,66675
1658282400,67411
1658282400,67411
1658368800,67368
1658368800,67368
1658455200,67685
1658455200,67685
1658541600,67516
1658541600,67516
1658628000,67096
1658628000,67096
1658714400,66273
1658714400,66273
1658800800,67228
1658800800,67228
1658887200,68195
1658887200,68195
1658973600,68355
1658973600,68355
1659060000,68636
1659060000,68636
1659146400,68030
1659146400,68030
1659232800,66932
1659232800,66932
1659319200,62316
1659319200,62316
1659405600,63100
1659405600,63100
1659492000,64419
1659492000,64419
1659578400,65209
1659578400,65209
1659664800,65878
1659664800,65878
1659751200,65446
1659751200,65446
1659837600,64969
1659837600,64969
1659924000,61813
1659924000,61813
1660010400,63219
1660010400,63219
1660096800,64938
1660096800,64938
1660183200,65907
1660183200,65907
1660269600,67004
1660269600,67004
1660356000,67482
1660356000,67482
1660442400,66855
1660442400,66855
1660528800,62229
1660528800,62229
1660615200,62072
1660615200,62072
1660701600,64084
1660701600,64084
1660788000,65066
1660788000,65066
1660874400,67194
1660874400,67194
1660960800,68174
1660960800,68174
1661047200,67425
1661047200,67425
1661133600,63879
1661133600,63879
1661220000,65409
1661220000,65409
1661306400,67556
1661306400,67556
1661392800,68977
1661392800,68977
1661479200,70054
1661479200,70054
1661565600,70876
1661565600,70876
1661652000,70176
1661652000,70176
1661738400,67356
1661738400,67356
1661738400,67356
1661824800,68799
1661824800,68799
1661911200,70638
1661997600,61901
1661997600,61901
1662084000,62970
1662084000,62970
1662170400,64410
1662170400,64410
1662256800,63924
1662256800,63924
1662343200,61190
1662343200,62020
1662429600,63161
1662429600,63804
1662516000,65124
1662516000,65764
1662602400,66499
1662602400,66499
1662688800,67619
1662688800,67619
1662775200,68502
1662775200,68502
1662861600,67855
1662861600,67855
1662948000,64384
1662948000,64384
1663034400,65669
1663034400,65669
1663120800,68013
1663120800,68013
1663207200,68945
1663207200,68945
1663293600,69209
1663293600,69209
1663380000,70029
1663380000,70029
1663466400,69251
1663466400,69251
1663552800,65997
1663552800,65997
1663639200,67032
1663639200,67032
1663725600,68607
1663725600,68607
1663812000,69649
1663812000,69649
1663898400,70455
1663898400,70455
1663984800,71050
1663984800,71050
1664071200,70324
1664071200,70324
1664157600,66709
1664157600,66709
1664244000,68380
1664244000,68380
1664330400,69921
1664330400,69921
1664416800,70990
1664416800,70990
1664503200,71354
1664503200,71354
1664503200,71354
1664503200,71354
1664503200,71354
1664503200,71354
1668391200,64323
1668391200,64323
1668391200,64323
1668391200,64323
1668477600,65642
1668564000,66883
1668650400,67720
1671588000,63614
1671588000,63614
1671588000,63614
1671588000,63614
1671588000,63614
1671588000,63614
1671588000,63614
1671588000,63614
1671674400,65499
1671674400,65499
1671674400,65499
1671674400,65499
1671674400,65499
1671674400,65499
1673575200,63386
1674439200,64424
1674525600,66254
1674612000,68481
1674698400,69977
1674784800,71574
1674871200,72505
1674957600,0
1675044000,69406
1675130400,70977
1675216800,66013
1675303200,67772
1675389600,69134
1675476000,70760
1675562400,70313
1675648800,67544
1675735200,0
1675821600,71846
1675908000,73522
1675994400,74966
1676080800,76110
1676167200,75725
1676253600,72502
1676340000,74218
1676426400,76017
1676512800,76773
1676599200,78114
1676685600,78878
1676772000,78329
1676858400,74744
1676944800,75960
1677031200,0
1677117600,79695
1677204000,80805
1677204000,80805
1677376800,80068
1677463200,76891
1677549600,77700
1677636000,72296
1677722400,73336
1677808800,74657
1677895200,75933
1677981600,75460
1678068000,71883
1678154400,73746
1678240800,76040
1678327200,77132
1678413600,78784
1678413600,78784
1678500000,79117
1678586400,78936
1678672800,75182
1678759200,77173
1678759200,77173
1678759200,77173
1678845600,79224
1678932000,79345
1678932000,79345
1679018400,80775
1679104800,81617
1679277600,77652
1679364000,78945
1679450400,80459
1679536800,81338
1679536800,81338
1679623200,82668
1679623200,82668
1679623200,82668
1679623200,82668
1679623200,82668
1679623200,82668
1679623200,82668
1679623200,82668
1679623200,82668
1679709600,83763
1679796000,82896
1679882400,79703
1679968800,80531
1680055200,82416
1680141600,84032
1680228000,85086
1680314400,78250
1680400800,77302
1680487200,74130
1680573600,76295
1680660000,79274
1680746400,81120
1680832800,83006
1680919200,81533
1681005600,80799
1681092000,77211
1681178400,75003
1681264800,77208
1681351200,78850
1681437600,80656
1681524000,81215
1681610400,79979
1681696800,75157
1681783200,76607
1681869600,79047
1681956000,80529
1682042400,81150
1682128800,82171
1682215200,81245
1682301600,77803
1682388000,80167
1682474400,81938
1682560800,82852
1682647200,82228
1682733600,79926
1682820000,78621
1682906400,67721
1682992800,65570
1683079200,74802
1683165600,76946
1683252000,78317
1683338400,79435
1683424800,78954
1683511200,75962
1683597600,78109
1683684000,80073
1683770400,82171
1683856800,83995
1683943200,84534
1684029600,84092
1684116000,80083
1685584800,73448
1685671200,74072
1685757600,74669
1685844000,73684
1685930400,70406
1686016800,70788
1686103200,69645
1686189600,70332
1686276000,70984
1686362400,70688
1686448800,69676
1686535200,65871
1686621600,67131
1686708000,69196
1686708000,69196
1686880800,68645
1686967200,67920
1687053600,67239
1687140000,64113
1687226400,65237
1687312800,66833
1687485600,68653
1687572000,67007
1687658400,65951
1687744800,63282
1687831200,64345
1687917600,66021
1688004000,66571
1688090400,67124
1688176800,62304
1688263200,61251
1688349600,59202
1688436000,60379
1688608800,62871
1688695200,64036
1688781600,64866
1688868000,64356
1688954400,62600
1689040800,63608
1689127200,64311
1689213600,65371
1689300000,65753
1689386400,65852
1689472800,65338
1689559200,63977
1689645600,64552
1689732000,65517
1689818400,65365
1689904800,65374
1689991200,66131
1690077600,65651
1690164000,65055
1690250400,65851
1690336800,66815
1690423200,67064
1690509600,67199
1690596000,67095
1690682400,66402
1690768800,64685
1690855200,62482
1690941600,63192
1691028000,63700
1691114400,64375
1691200800,64417
1691287200,63915
1691373600,61733
1691460000,62686
1691546400,64155
1691632800,65280
1691719200,66107
1691805600,65441
1691892000,65056
1691978400,61477
1692064800,62674
1692151200,63784
1692237600,64813
1692324000,65548
1692410400,66075
1692496800,65792
1692583200,62234
1692669600,63437
1692756000,65079
1692842400,66066
1692928800,67219
1693015200,67971
1693101600,67296
1693188000,64966
1693274400,66050
1693360800,67287
1693447200,67254
1693533600,60652
1693620000,61145
1693706400,60583
1693792800,58403
1693879200,59455
1693965600,60983
1694052000,62064
1694138400,62838
1694224800,63351
1694311200,62738
1694397600,59840
1694484000,60710
1694570400,62211
1694656800,63030
1694743200,63338
1694829600,63489
1694916000,63233
1695002400,60455
1695088800,61680
1695261600,63461
1695348000,64580
1695434400,65574
1695520800,65142
1695607200,62275
1695693600,63415
1695780000,64736
1695866400,66075
1695952800,66547
1696039200,66417
1696125600,59864
1696212000,57247
1696298400,58758
1696384800,60272
1696471200,61273
1696557600,62031
1696644000,62754
1696730400,62161
1696816800,59766
1696903200,61066
1696989600,62429
1697076000,62917
1697162400,63618
1697248800,63901
1697335200,63341
1697421600,60171
1697508000,61108
1697594400,62228
1697680800,62464
1697767200,63143
1697853600,62804
1697940000,61651
1698026400,58525
1698026400,58525
1698199200,60571
1698285600,60737
1698372000,61043
1698458400,60607
1698544800,59686
1698631200,57318
1698717600,57814
1698804000,54446
1698890400,54607
1698976800,55569
1699063200,55545
1699149600,54906
1699236000,52221
1699322400,53250
1699408800,54525
1699495200,54840
1699581600,55813
1699668000,55024
1699754400,54215
1699840800,51313
1699927200,53380
1700013600,54644
1700100000,54725
1700186400,55482
1700272800,55769
1700359200,55512
1700445600,53067
1700532000,53771
1700618400,54913
1700704800,55223
1700791200,56274
1700877600,56719
1700964000,56119
1701050400,53929
1701136800,54233
1701309600,55985
1701396000,51576
1701482400,52106
1701568800,51710
1701655200,49635
1701741600,50619
1701828000,51926
1702000800,52821
1702087200,52972
1702173600,52445
1702260000,50018
1702346400,50475
1702432800,51850
1702432800,51850
1702605600,52963
1702692000,52765
1702778400,52369
1702864800,50055
1702951200,51277
1703037600,52813
1703124000,53878
1703210400,55945
1703296800,56811
1703383200,56500
1703469600,55845
1703642400,55378
1703728800,55952
1703815200,56232
1703901600,55589
1703988000,55182
1704074400,49662
1704160800,48940
1704247200,50342
1704333600,51351
1704420000,52137
1704506400,52177
1704592800,52056
1704679200,49065
1704765600,49751
1704852000,51132
1704938400,51840
1705024800,52721
1705111200,53207
1705197600,53058
1705370400,51077
1705456800,52746
1705543200,53792
1705629600,54767
1705716000,55646
1705802400,55022
1705888800,52324
1705975200,53347
1706061600,54748
1706148000,56206
1706234400,56589
1706320800,57299
1706407200,57071
1706493600,55350
1706580000,56515
1706666400,57794
1706752800,53916
1706839200,54554
1706925600,55455
1707012000,55415
1707098400,53317
1707184800,54579
1707271200,55875
1707357600,56626
1707444000,57349
1707530400,58197
1707616800,57741
1707703200,55287
1707789600,56257
1707876000,57958
1707962400,58837
1708048800,58952
1708135200,58955
1708221600,58853
1708308000,55942
1708394400,57044
1708480800,58776
1708567200,59684
1708653600,0
1708740000,60818
1708826400,60538
1708912800,57844
1708999200,59034
1709085600,60289
1709172000,60729
1709258400,56406
1709344800,57032
1709431200,56691
1709517600,54319
1709604000,55672
1709690400,57121
1709776800,57878
1709863200,58610
1710036000,59016
1710122400,56058
1710208800,57415
1710295200,58785
1710381600,59493
1710468000,59710
1710554400,59652
1710640800,59310
1710727200,56838
1710813600,57724
1710900000,59469
1710986400,60201
1711072800,60814
1711159200,61329
1711245600,60887
1711332000,58258
1711418400,59609
1711504800,60602
1711591200,61694
1711677600,62821
1711764000,61287
1711850400,60369
1711936800,53017
1712023200,51496
1712109600,52906
1712196000,53693
1712282400,54705
1712368800,55292
1712455200,55261
1712541600,52113
1712628000,53098
1712714400,54488
1712800800,55209
1712887200,56009
1712973600,56689
1713060000,56258
1713146400,53308
1713232800,54541
1713319200,55578
1713405600,56382
1713492000,57042
1713578400,57670
1713664800,57187
1713751200,54295
1713837600,55149
1713924000,56502
1714010400,57067
1714096800,57865
1714183200,58338
1714269600,57889
1714356000,55707
1714442400,56667
1714528800,51713
1714615200,50578
1714788000,0
1714874400,0
1714960800,0
1715047200,0
1715133600,0
1715220000,0
1715306400,0
1715392800,0
1715479200,0
1715565600,0
1718071200,44998
1718157600,46329
1718244000,46868
1718330400,47053
1718416800,46722
1718503200,45978
1718589600,43338
1718676000,44238
1718762400,44353
1718848800,45291
1718935200,45802
1719021600,44711
1719108000,44266
1719194400,42493
1719280800,43324
1719367200,44238
1719453600,44681
1719540000,45082
1719626400,44988
1719712800,44564
1719799200,39884
1719885600,40694
1719972000,41612
1720058400,42557
1720144800,43236
1720231200,45565
1720317600,45466
1720404000,44356
1720490400,44888
1720576800,45208
1720663200,44270
1720749600,44237
1720836000,43966
1721008800,42714
1721095200,43182
1721181600,43589
1721268000,43660
1721354400,43771
1721440800,43985
1721527200,43571
1721613600,43017
1721700000,43411
1721786400,43841
1721872800,43764
1721959200,43763
1722045600,43590
1722132000,43309
1722218400,42584
1722304800,43410
1722391200,43758
1722477600,41338
1722564000,41484
1722650400,41616
1722736800,41234
1722823200,39320
1722909600,40234
1722996000,41213
1723082400,41769
1723168800,42480
1723255200,42900
1723341600,42492
1723428000,39508
1723514400,40912
1723600800,42483
1723687200,43219
1723773600,43445
1723860000,43770
1723946400,43501
1724032800,40733
1724119200,41335
1724205600,42484
1724292000,43302
1724378400,44545
1724464800,44929
1724551200,44781
1724637600,42626
1724724000,43101
1724810400,43784
1724896800,45280
1724983200,46258
1725069600,46070
1725156000,41054
1725242400,38934
1725328800,40101
1725415200,41548
1725501600,42666
1725588000,43512
1725674400,44128
1725760800,43923
1725847200,42338
1725933600,43714
1726020000,45054
1726106400,45436
1726192800,46141
1726279200,46786
1726365600,46462
1726452000,43811
1726538400,44603
1726624800,45644
1726711200,46263
1726797600,44602
1726884000,44473
1726970400,44040
1727056800,42074
1727143200,42821
1727229600,43866
1727316000,44395
1727402400,45180
1727488800,45428
1727575200,44965
1727661600,42878
1727748000,39841
1727834400,40856
1727920800,41513
1728007200,42210
1728093600,42716
1728180000,42286
1728266400,40328
1728352800,41462
1728439200,42537
1728525600,42952
1728612000,43320
1728698400,43995
1728784800,43383
1728871200,41145
1728957600,42063
1729044000,42666
1729130400,42795
1729216800,43063
1729303200,43863
1729389600,43543
1729476000,41309
1729562400,42276
1729648800,43205
1729735200,43896
1729821600,44352
1729908000,44677
1729994400,44410
1730080800,42554
1730167200,43300
1730253600,44254
1730340000,44517
1730426400,41432
1730512800,41539
1730599200,41312
1730685600,39313
1730772000,39893
1730858400,41060
1730944800,41550
1731031200,42072
1731117600,42421
1731204000,42275
1731290400,40074
1731376800,40840
1731463200,41770
1731549600,42085
1731636000,42483
1731722400,42553
1731808800,42273
1731895200,40029
1731981600,40729
1732068000,41784
1732154400,41444
1732240800,42039
1732327200,42639
1732413600,42266
1732500000,40301
1732586400,40677
1732672800,41755
1732759200,42088
1732845600,42289
1732932000,42591
1733018400,39116
1733104800,37164
1733191200,37848
1733277600,38687
1733364000,39269
