1687498241,1
1688535044,1
1688621445,1
1688707844,1
1688794245,1
1688880644,1
1688967042,1
1689053441,1
1689139840,1
1689226241,1
1689312653,1
1689831044,2
1689917446,2
1690003846,2
1690263047,2
1690522245,2
1694755834,1
1694842234,1
1694928634,1
1695965441,1
1697261447,1
1697347842,1
1698474646,1
1698561046,1
1698647445,1
1699597838,2
1699684239,1
1699770639,1
1700202637,2
1700375440,1
1700807441,2
1700893840,1
1700980240,1
1704436239,1
1708410644,2
1731565854,1
