1656743558,26
1656829841,29
1656916357,17
1657002637,30
1657089163,20
1657175559,24
1657261838,30
1657348240,30
1657434758,41
1657521164,35
1657607566,40
1657693957,35
1657780357,31
1657803090,31
1657804447,31
1657809517,31
1657866760,32
1657896040,32
1657953158,7
1657982325,7
