1687498241,6
1688016640,8
1688103041,8
1688275841,2
1688362240,8
1688535044,6
1688621445,5
1688707844,5
1688794245,5
1688880644,5
1688967042,5
1689053441,5
1689139840,5
1689226241,5
1689312653,5
1689831044,4
1689917446,4
1690003846,4
1690263047,2
1690522245,5
1690867847,5
1691127048,4
1691645448,3
1691818247,3
1691904646,2
1691991040,3
1692077440,3
1692163831,3
1692250233,3
1692336633,3
1692423035,4
1692509432,4
1692682233,3
1692768633,3
1692855035,3
1692941433,3
1693027839,3
1693114233,1
1693200633,3
1693978232,3
1694323834,2
1694410234,1
1694496634,2
1694583036,3
1694669436,3
1694755834,4
1694842234,4
1694928634,4
1695187834,1
1695274234,4
1695360634,4
1695533434,3
1695619839,6
1695965441,3
1696051841,1
1696656645,1
1696743043,1
1696829444,1
1696915841,1
1697002242,1
1697088641,1
1697175042,1
1697261447,1
1697347842,1
1697520642,1
1697607044,1
1697693444,1
1700721041,2
1700807441,4
1700893840,2
1700980240,2
1701066641,2
1701239442,2
1701412240,4
1702017040,3
1702621850,2
1703226640,2
1703831442,2
1704436239,1
1705645846,1
1707633051,1
1712813449,1
1715146260,1
1715319121,1
1726551051,1
1727415052,1
1729575053,2
1730874652,1
