1688016807,88
1688103218,240
1688189597,164
1688275996,337
1688362412,572
1688535215,232
1688621614,116
1688708029,562
1688794420,277
1688880821,142
1688967219,528
1689053626,163
1689140028,611
1689226424,149
1689312837,183
1689399195,204
1689485597,182
1689572000,202
1689658397,372
1689744807,177
1689831241,196
1689917640,134
1690004042,175
1690090404,153
1690176817,298
1690263240,145
1690349617,1052
1690436012,120
