1651300352,11
1651386755,28
1651473034,29
1651559564,26
1651645850,42
1651732362,26
1651818753,15
1651905153,20
1651991564,11
1652077954,19
1652164360,13
1652250764,16
1652337032,15
1652423553,15
1652509832,13
1652596232,11
1652682759,10
1652769160,29
1652855561,25
1652941964,34
1653028353,23
1653114753,33
1653201159,23
1653287558,31
1653373954,32
1653460234,31
1653546755,28
1653633154,21
1653719553,32
1653805957,35
1653892236,29
1653978755,16
