1677133857,6
1677220262,21
1677306660,13
1677393061,10
1677479458,16
1677565859,19
1677652257,21
1677738657,8
1677825057,21
1677911460,23
1677997847,17
1678084257,28
1678170666,21
1678257055,18
1678343445,22
