1647066751,5
1647153150,4
1647239550,11
1647325952,14
1647412352,28
1647498752,25
1647585151,12
1647757954,25
1647844355,15
1647930752,14
1648017150,16
1648103550,14
1648189831,14
1648276229,8
1648362752,9
1648449033,14
1648535442,13
1648621952,14
1648708231,20
1730788525,2
