1676529061,76
1676615450,130
1676701857,339
1676788249,125
1676874662,108
1676961061,88
1677047454,102
1677133857,105
1677220262,102
1677306660,55
1677393061,65
1677479458,902
1677565859,48
1677652257,88
1677738657,445
1677825057,358
