1656484356,8
1656570758,25
1656743558,24
1656829841,30
1656916357,23
1657002637,26
1657089163,21
1657175559,26
1657261838,31
1657348240,29
1657434758,40
1657521164,36
1657607566,34
1657693957,38
1657780357,10
1657803090,10
1657804447,10
1657809517,10
