1722576933,52
1722663315,134
1722749743,175
1722836105,231
1722922512,113
1723008910,405
1723095317,248
1723181712,370
1723268105,112
1723354509,224
1723440921,1104
1723527316,157
1723613721,214
1723700119,399
1723786513,366
1723872909,167
1723959316,2029
1724045707,719
1724132118,137
1724218520,509
1724304925,220
1724391319,39
