1644820292,5
1644906689,1
1644993090,1
1645079499,1
1645165829,1
1645252290,1
1645338629,1
1645425030,1
1645467113,1
1645470826,1
1645511492,3
1645597892,1
1645684232,1
1645770629,1
1645857150,1
1645943553,1
1646029893,1
1646116237,1
1646202760,1
1646289033,1
1646375551,1
1646461951,1
1646548229,1
1646634751,1
1646721161,1
1646807431,1
1646893952,1
1646980230,1
1647066751,1
1647153150,1
1647239550,1
1647325952,1
1647412352,1
1647498752,1
1647585151,1
1647757954,1
1647844355,1
1647930752,1
1648017150,1
1648103550,1
1648189831,1
1648276229,1
1648362752,1
1648449033,1
1648535442,1
1648621952,1
1648708231,1
1648794750,1
1648881149,1
1648967561,1
1649053832,1
1649140351,1
1649226751,1
1649313029,1
1649399549,1
1649485949,1
1649572354,1
1649658750,1
1649745150,1
1649831565,1
1649917950,1
1650004228,1
1650090628,1
1650177150,1
1650263549,1
1650349831,1
1650436229,1
1650522756,1
1650609163,1
1650695550,1
1650781953,1
1650868349,1
1650954630,1
1651041030,1
1651127552,1
1651213951,1
1651300352,1
1651386755,1
1651473034,1
1651559564,1
1651645850,1
1651732362,1
1651818753,1
1651905153,1
1651991564,1
1652077954,1
1652164360,1
1652250764,1
1652337032,1
1652423553,1
1652509832,1
1652596232,1
1652682759,1
1652769160,1
1652855561,1
1652941964,1
1653028353,1
1653114753,1
1653201159,1
1653287558,1
1653373954,1
1653460234,1
1653546755,1
1653633154,1
1653719553,1
1653805957,1
1653892236,1
1653978755,1
1654065033,1
1654151553,1
1654237831,1
1654324351,1
1654410631,1
1654497153,1
1654583555,1
1654669837,1
1654756356,1
1654842756,1
1654929156,1
1655015436,1
1655101838,1
1655188357,1
1655274636,1
1655361158,1
1655447555,1
1655533836,1
1655620256,1
1655706645,1
1655793158,1
1655879557,1
1655965955,1
1656052365,1
1656138754,1
1656225155,1
1656311556,1
1656397956,1
1656484356,1
1656570758,1
1656829841,1
1656916357,1
1657002637,1
1657089163,1
1657175559,1
1657261838,1
1657348240,1
1657434758,1
1657521164,1
1657607566,1
1657693957,1
1657780357,1
1657803090,1
1657804447,1
1657809517,1
1657866760,5
1657896040,5
1657953158,2
1657982325,2
1658039438,2
1658068726,2
1658125843,2
1658155247,2
1658212362,2
1658241661,2
1658298758,2
1658328052,2
1658385041,2
1658414447,2
1658471560,2
1658500847,2
1658557962,2
1658587247,2
1658644360,2
1658673645,2
1658730762,2
1658760045,2
1658817160,2
1658846453,2
1658903439,2
1658932848,2
1658989840,2
1659019246,2
1659076365,2
1659105646,2
1659162770,2
1659192044,2
1659249159,2
1659278470,2
1659335565,2
1659364847,2
1659421963,2
1659451128,2
1659508368,2
1659537519,2
1659594767,2
1659624049,2
1659681160,2
1659710444,2
1659767561,2
1659796845,2
1659853840,2
1659883130,2
1659940369,2
1659969638,2
1660026647,2
1660056049,2
1660113163,2
1660142439,2
1660199441,2
1660228849,2
1660285970,2
1660315250,2
1660372250,2
1660401521,2
1660458761,2
1660488049,2
1660545162,2
1660574449,2
1660631564,2
1660660730,2
1660717841,2
1660747248,2
1660804362,2
1660833647,2
1660890760,2
1660920046,2
1660977162,2
1661006455,2
1661063442,2
1661092854,2
1661149842,2
1661179125,2
1661236366,2
1661265647,2
1661322641,2
1661352051,2
1661409162,2
1661438449,2
1661495561,2
1661524735,2
1661581964,2
1661611239,2
1661668363,2
1661697647,2
1661700049,2
1661754784,3
1661784048,3
1661870448,2
1661927560,2
1661956724,2
1662013964,2
1662043246,2
1662100359,2
1662129642,2
1662186760,2
1662216045,2
1662273039,2
1662302447,2
1662359559,2
1662388727,2
1662445958,2
1662475124,2
1662532358,2
1662561643,2
1662618758,3
1662647931,3
1662705164,4
1662734437,4
1662791558,4
1662820724,4
1662877847,4
1662907237,4
1662964357,4
1662993645,4
1663050638,4
1663080057,4
1663137169,4
1663166448,4
1663223564,4
1663252844,4
1663309969,4
1663339237,4
1663396358,4
1663425653,4
1663482759,4
1663512042,4
1663569159,4
1663598447,4
1663655565,4
1663684725,4
1663741840,4
1663771124,4
1663828239,4
1663857524,4
1663914640,4
1663943934,4
1664001039,4
1664030318,4
1664087438,4
1664116722,4
1664173842,4
1664203127,4
1664260251,4
1664289537,4
1664346641,4
1664375951,4
1664433041,4
1664462320,4
1664519554,4
1664548711,4
1664605833,4
1664635111,4
1668560577,2
1668646979,2
1675751474,4
1682573524,2
1682659898,2
1682746309,2
1682832700,2
1682919107,2
1683005499,2
1683091901,2
1683178309,2
1683264713,2
1683351101,2
1683437506,2
1683523904,2
1683610328,2
1683696716,2
1683783116,2
1683869508,2
1683955918,2
1684042308,2
1685597496,2
1685683902,2
1685770303,2
1685856701,2
1685943100,2
1686029502,2
1686115904,2
1686202306,2
1686288711,2
1686375108,2
1686461512,2
1686547909,2
1686634309,2
1686720704,2
1686807105,2
1686893562,2
1686979954,2
1687066360,2
1687152774,2
1687239150,2
1687411953,2
1687498393,2
1687584774,2
1687671173,2
1687757568,2
1687843969,2
1687930377,2
1688016807,2
1688103218,2
1688189597,2
1688275996,2
1688362412,2
1688535215,2
1688621614,2
1688708029,2
1688794420,2
1688880821,2
1688967219,2
1689053626,2
1689140028,2
1689226424,2
1689312837,2
1689399195,2
1689485597,2
1689572000,2
1689658397,2
1689744807,2
1689831241,2
1689917640,2
1690004042,2
1690090404,2
1690176817,2
1690263240,2
1690349617,2
1690436012,2
1690522443,2
1690608808,2
1690695212,2
1690781617,2
1690868047,2
1690954421,2
1691040818,2
1691127250,2
1691213630,2
1691300015,2
1691386395,2
1691472821,2
1691559206,2
1691645653,2
1691732035,2
1691818443,2
1691904834,2
1691991184,2
1692077570,2
1692163972,2
1692250382,2
1692336773,2
1692423180,2
1692509573,2
1692595944,2
1692682368,2
1692768764,2
1692855167,2
1692941568,2
1693027980,2
1693114356,2
1693200777,2
1693287141,2
1693373568,2
1693459952,2
1693546364,2
1693632754,2
1693719144,2
1693805540,2
1693891949,2
1693978362,2
1694064749,2
1694151151,2
1694237547,2
1694323959,2
1694410362,2
1694496769,2
1694583178,2
1694669562,2
1694755972,2
1694842363,2
1694928766,2
1695015165,2
1695187975,2
1695274380,2
1695360784,2
1695447164,2
1695533586,2
1695619990,2
1695706406,2
1695792808,2
1695879218,2
1695965624,2
1696052011,2
1696138408,2
1696224807,2
1696311219,2
1696397621,2
1696484041,2
1696570435,2
1696656841,2
1696743237,2
1696829644,2
1696916048,2
1697088838,2
1697175238,2
1697348050,2
1697434425,2
1697520844,2
1697607247,2
1697693651,2
1697780021,2
1697866447,2
1697952848,2
1698039229,2
1698125641,2
1698212053,2
1698298423,3
1698384826,2
1698474862,2
1698561261,2
1698647660,2
1698734051,2
1698820440,2
1698906836,2
1698993260,2
1699079643,2
1699166057,2
1699252467,2
1699338847,2
1699425254,2
1699511642,2
1699598052,4
1699684453,2
1699770845,2
1699857241,2
1699943653,2
1700030030,2
1700116443,2
1700202865,2
1700289223,2
1700375637,2
1700462021,2
1700548451,2
1700634836,2
1700721246,2
1700807657,2
1700894058,2
1700980458,2
1701066868,2
1701239661,2
1701326039,2
1701412459,2
1701498834,2
1701585234,2
1701671642,2
1701758036,2
1701930831,2
1702017289,2
1702103633,2
1702190033,2
1702276447,2
1702362833,2
1702449238,2
1702535641,2
1702622071,2
1702708433,2
1702794843,2
1702881239,2
1702967665,2
1703054037,2
1703140439,2
1703226865,2
1703313245,2
1703399641,2
1703572441,2
1703658841,2
1703745239,2
1703831661,2
1703918046,2
1704004443,2
1704090847,2
1704263638,2
1704350037,2
1704436450,2
1704522832,2
1704954878,2
1705041294,2
1705127674,2
1705300477,2
1705386877,2
1705473291,2
1705559692,2
1705646097,2
1705732479,2
1705818877,2
1705905294,2
1705991686,2
1706078101,2
1706164491,2
1706250972,2
1706337342,2
1706423747,2
1706510148,2
1706596552,2
1706682956,2
1706769366,2
1706855781,2
1706942169,2
1707028569,2
1707114964,2
1707201363,2
1707287760,2
1707374158,2
1707460602,2
1707546967,2
1707633370,2
1707719770,2
1707806171,2
1707892577,2
1707978960,2
1708065403,2
1708151763,2
1708238171,2
1708324568,2
1708410859,2
1708497318,2
1708583778,2
1708670174,2
1708756568,2
1708842965,2
1708929366,2
1709015768,2
1709102173,2
1709188566,2
1709275007,2
1709361374,2
1709447776,2
1709534155,2
1709620564,2
1709706962,2
1709793367,2
1709966169,2
1710052561,2
1710138969,2
1710225362,2
1710398159,2
1710484595,2
1710570954,2
1710657364,2
1710743767,2
1710830176,2
1710916554,2
1711002952,2
1711089395,2
1711175767,2
1711262153,2
1711348567,2
1711434966,2
1711521368,2
1711607758,2
1711694155,2
1711776969,2
1711863379,2
1711949767,2
1712036181,2
1712209001,2
1712295387,2
1712381761,2
1712468183,2
1712554571,2
1712640970,2
1712727387,2
1712813813,2
1712986589,2
1713073014,2
1713159410,2
1713245803,2
1713332196,2
1713418604,2
1713505010,2
1713591405,2
1713677807,2
1713764197,2
1713850601,2
1713937016,2
1714023425,2
1714109816,2
1714196216,2
1714282602,2
1714369033,2
1714455398,2
1714541804,2
1714714600,2
1714801009,2
1714887409,2
1714973810,2
1715060210,2
1715146632,2
1715233058,2
1715405851,2
1715492244,2
1718022496,2
1718084230,4
1718170636,2
1718257047,2
1718343427,2
1718429818,2
1718516215,2
1718602645,2
1718689022,2
1718775431,2
1718861831,2
1718948217,2
1719034629,2
1719121031,2
1719207304,2
1719293732,2
1719380130,2
1719466523,2
1719725705,2
1719812104,2
1720071331,2
1720157731,2
1720244127,2
1720330509,2
1720416929,2
1720503328,2
1720589730,2
1720676127,2
1720762554,2
1721021712,2
1721108139,2
1721194539,2
1721280942,2
1721367339,2
1721453736,2
1721540139,2
1721626512,2
1721712930,2
1721799317,2
1721885729,2
1721972116,2
1722058513,2
1722144941,2
1722231340,2
1722317737,2
1722404147,2
1722490541,2
1722576933,2
1722663315,2
1722749743,2
1722836105,2
1722922512,2
1723008910,2
1723095317,2
1723181712,2
1723268105,2
1723354509,2
1723440921,2
1723527316,2
1723613721,2
1723700119,2
1723786513,2
1723872909,2
1723959316,2
1724045707,2
1724132118,2
1724218520,2
1724391319,2
1724477730,2
1724564111,2
1724650531,2
1724736906,2
1724823316,2
1724909717,2
1724996108,2
1725082506,2
1725168909,2
1725255319,2
1725428109,2
1725514506,2
1725687306,2
1725773707,2
1725860113,2
1726724132,2
1726810515,2
1726896925,2
1726983322,2
1727069719,2
1727156114,2
1727328917,2
1727415326,2
1727501713,2
1727588116,2
1727674524,2
1727847333,2
1727933723,2
1728020122,2
1728106547,2
1728192945,2
1728452151,2
1728538537,2
1728624938,2
1728711328,2
1728797737,2
1728884126,2
1728970539,2
1729229724,2
1729402521,2
1729488952,2
1729575323,2
1729661730,2
1729748135,2
1729834546,2
1729924541,2
1730010943,2
1730097332,2
1730183730,2
1730270141,2
1730356536,2
1730442925,2
1730529338,2
1730615759,2
1730702128,2
1731047722,2
1731134141,2
1731220531,2
1731306938,2
1731393338,2
1731479747,2
1731738930,2
1731825326,2
1732170946,2
1732343726,2
1732430128,2
1732775733,2
1733207816,2
1733294214,2
