1695360634,13
1695533434,13
1695619839,13
1695965441,12
1696483842,11
1696570241,11
1696656645,10
1696743043,11
1696829444,11
1696915841,10
1697002242,10
1697088641,10
1697175042,10
1697261447,10
1697347842,10
1697520642,9
1697607044,9
1697693444,9
1697866244,9
1697952644,9
1698211845,8
1698474646,11
1698561046,8
1698647445,8
1698733843,8
1698993045,12
1699079441,7
1699165843,7
1699252253,42
1699338639,1
1699425038,6
1699597838,10
1699684239,6
1699770639,6
1699857040,6
1699943446,5
1700116239,5
1700202637,10
1700548240,4
1700634640,1
1700721041,4
1700807441,9
1700893840,4
1700980240,4
1701066641,3
1701239442,3
1701412240,6
1702017040,3
1702621850,3
1703226640,3
1703831442,3
1704349840,4
1704436239,12
1705041045,8
1705645846,3
1706250646,6
1708151451,1
1708410644,12
1708583454,6
1729056653,4
1731047452,1
