1658471560,3
1658500847,3
1658557962,4
1658587247,4
1658644360,8
1658673645,8
1658730762,10
1658760045,10
1658817160,13
1658846453,13
1658903439,6
1658932848,6
1658989840,4
1659019246,4
1659076365,4
1659105646,4
1659162770,10
1659192044,10
1659249159,5
1659278470,5
1659335565,12
1659364847,12
1659421963,6
1659451128,6
1659508368,6
1659537519,6
1659594767,3
1659624049,3
1659681160,10
1659710444,10
1659767561,3
1659796845,3
