1646116237,11
1646202760,194
1646289033,133
1646375551,261
1646461951,286
1646548229,254
1646634751,13
1646721161,182
1646807431,348
1646893952,237
1646980230,101
1647066751,367
1647153150,109
1647239550,152
1647325952,200
1647412352,273
1647498752,265
1647585151,299
1647757954,251
1647844355,330
1647930752,135
1648017150,134
1648103550,257
1648189831,239
1648276229,119
1648362752,139
1648449033,144
1648535442,249
1648621952,157
1648708231,287
1648794750,27
