1687498241,1
1688016640,1
1688103041,1
1688362240,1
1694323834,1
1694496634,1
1694583036,1
1694755834,1
1694842234,1
1694928634,1
1695187834,1
1695274234,1
1695360634,1
1695533434,1
1695619839,1
1695965441,1
1696051841,1
1696483842,1
1696570241,1
1696656645,1
1696743043,1
1696829444,1
1696915841,1
1697002242,1
1697088641,1
1697175042,1
1697261447,1
1697347842,1
1697520642,1
1697607044,1
1697693444,1
1697866244,1
1697952644,1
1698211845,1
1698474646,1
1698561046,1
1698647445,1
1698733843,1
1698993045,3
1699079441,1
1699165843,1
1699252253,4
1699338639,1
1699425038,1
1699597838,2
1699684239,1
1699770639,1
1699943446,1
1700116239,1
1700202637,2
1700548240,1
1700634640,1
1700721041,1
1700807441,2
1700893840,1
1700980240,1
1701066641,1
1701239442,1
1701325840,1
1701412240,2
1702017040,1
1702621850,1
1703226640,1
1703831442,1
1704436239,1
1705645846,1
1712813449,2
1725255050,2
1726291851,1
1730874652,1
1731220250,1
1731393053,1
