1655274636,6
1679981518,19
1689312837,19
1695360784,17
1707978960,3
1708065403,25
1721367339,3
1724045707,42
1724650531,125
1727069719,83
1727328917,37
1727674524,24
1727760922,2
1727847333,13
1728279336,47
1728538537,22
