1642392088,73
1642408942,73
1642478484,90
1642564885,60
1642651226,79
1642676514,79
1642769502,83
1642771604,83
1642805136,83
1642805851,83
1642824026,86
1642855125,86
1642910490,82
1642924655,82
1642934565,82
1642937864,82
1642996892,83
1643083292,66
1643169628,84
1643256090,82
1643342487,79
1643428827,60
1643515288,60
1643601634,79
1643622207,79
1643688028,79
1643708607,79
1643774489,76
1643860889,57
1643947288,79
1644033629,85
1644120088,74
1644206493,76
1644292831,69
1644321030,69
1644388289,73
1644407490,73
1644474692,74
1644493888,74
1644561030,78
1644647492,94
1644733834,76
1644770508,76
1644820292,74
1644906689,72
1644993090,57
1645079499,56
