1643428818,1
1643601623,1
1643622136,3
1643688017,1
1643708536,1
1644561017,2
1644733822,1
1644770413,1
1644993017,7
1645252217,1
1645467072,1
1645470791,1
1645511417,1
1645597817,1
1645684217,2
1645770616,1
1645857016,8
1646029817,1
1648967418,1
1649485817,6
1650004217,1
1650349817,1
1650436217,1
1650522617,1
1650609029,1
1650695416,8
1650781820,1
1650868217,1
1650954617,2
1651041017,7
1651127418,1
1651213817,1
1651300219,1
1651386622,1
1651473017,1
1651559421,2
1651645827,1
1651818617,1
1651905018,1
1651991417,1
1652077818,1
1652164218,1
1652250621,1
1652423417,1
1652509817,1
1652596217,1
1652769018,1
1652855418,1
1653028217,1
1653201018,1
1653546617,1
1653633018,1
1653719418,1
1653805821,1
1653892219,2
1653978618,1
1654065018,2
1654151419,1
1654237818,1
1654324218,2
1654410618,1
1654497019,1
1654669819,6
1654756220,1
1654842619,1
1654929020,1
1655015420,1
1655101820,1
1655188220,1
1655361020,1
1655533820,1
1655620219,1
1655706620,1
1655879419,1
1657089026,1
1661236224,1
1661265501,1
1661870301,1
1662359420,3
1662388701,3
1663166301,1
1664173822,1
1664203101,1
1668560425,1
1683523832,1
1683696632,1
1683955833,1
1688707844,1
1692941433,1
1696483842,1
1697002242,1
1700807441,1
1705127446,1
1712813449,1
1718602257,1
