1718170259,1
1719379849,2
1719725446,2
1719984647,1
1720589449,1
1720762249,14
1724304649,5
1726032651,1
1727587850,1
1727847052,1
1727933451,1
1728279054,5
1728365452,3
1729229452,1
1729924251,1
1730961053,1
1731047452,1
1731220250,1
