1650263549,264
1650349831,122
1650436229,169
1650522756,163
1650609163,155
1650695550,137
1650781953,137
1650868349,150
1650954630,139
1651041030,276
1651127552,258
1651213951,361
1651300352,139
1651386755,249
1651473034,234
1651559564,98
