1658039438,25
1658068726,25
1658125843,116
1658155247,116
1658212362,130
1658241661,130
1658298758,150
1658328052,150
1658385041,115
1658414447,115
1658471560,535
1658500847,535
1658557962,108
1658587247,108
1658644360,229
1658673645,229
1658730762,123
1658760045,123
1658817160,306
1658846453,306
1658903439,122
1658932848,122
1658989840,189
1659019246,189
1659076365,294
1659105646,294
1659162770,195
1659192044,195
1659249159,143
1659278470,143
1659335565,113
1659364847,113
1659421963,156
1659451128,156
1659508368,244
1659537519,244
1659594767,504
1659624049,504
1659681160,223
1659710444,223
1659767561,243
1659796845,243
1659853840,470
1659883130,470
1659940369,131
1659969638,131
1660026647,269
1660056049,269
1660113163,258
1660142439,258
1660199441,1110
1660228849,1110
1660285970,367
1660315250,367
1660372250,192
1660401521,192
1660458761,304
1660488049,304
1660545162,237
1660574449,237
1660631564,108
1660660730,108
1660717841,177
1660747248,177
1660804362,114
1660833647,114
1660890760,262
1660920046,262
1660977162,163
1661006455,163
1661063442,300
1661092854,300
1661149842,208
1661179125,208
1661236366,116
1661265647,116
1661322641,124
1661352051,124
1661409162,160
1661438449,160
1661495561,160
1661524735,160
1661581964,103
1661611239,103
