1654583555,1
1654669837,20
1654756356,20
1654842756,23
1654929156,19
1655015436,25
1655101838,27
1655188357,15
1655274636,29
1655361158,23
1655447555,20
1655533836,20
1655620256,23
1655706645,27
1655793158,31
1655879557,27
1655965955,27
1656052365,25
1656138754,26
1656225155,28
1656311556,26
1656397956,17
1656484356,28
1656570758,25
1656743558,27
1656829841,25
1656916357,20
1657002637,24
1657089163,20
1657175559,21
1657261838,4
