1659335565,1
1659364847,1
1659421963,1
1659451128,1
1659594767,1
1659624049,1
1659681160,1
1659710444,1
1659940369,1
1659969638,1
1660026647,1
1660056049,1
1660199441,1
1660228849,1
1660285970,1
1660315250,1
1711694155,4
1711776969,3
1711863379,3
