1679584314,2
1679589759,2
1679596397,2
1679602819,2
1679607852,2
1679639432,4
1679981431,3
1680240629,4
1680499830,1
1680845434,4
1683437432,4
1683610233,4
1687066239,1
1687239039,1
1687498241,1
1691645448,2
1691731846,2
1691818247,1
1691991040,1
1692077440,1
1692163831,1
1692250233,1
1693978232,1
1694151031,1
