1664519554,1
1664548711,1
1668560577,1
1685770303,1
1687671173,4
1689572000,1
1689658397,2
1692509573,1
1692855167,4
1693719144,2
1694237547,2
1694583178,2
1694842363,1
1695187975,3
1702794843,2
1703658841,2
1703831661,2
1703918046,2
1704004443,2
1704090847,1
1704263638,1
1704609231,5
1704695681,3
1704782089,5
1704868474,6
1704954878,7
1705041294,5
1709188566,1
