1695533586,1
1695619990,4
1695706406,13
1695792808,12
1695879218,3
1695965624,8
1696052011,3
1696138408,5
1696224807,4
1696311219,7
1696397621,13
1696484041,11
1696570435,6
1696656841,3
1696743237,6
1696829644,9
1696916048,2
1697002439,6
1697088838,11
1697175238,4
1697261644,21
1697348050,11
1697434425,5
1697520844,4
1697607247,10
