1651473034,4
1651559564,24
1651645850,32
1651732362,27
1651818753,21
1651905153,22
1651991564,15
1652077954,22
1652164360,13
1652250764,15
1652337032,22
1652423553,12
1652509832,11
1652596232,10
1652682759,12
1652769160,26
1685597496,18
1685683902,2
