1679639432,3
1679722230,4
1679808631,4
1680067829,4
1680154230,3
1680240629,2
1680327029,5
1680413427,5
1680499830,4
1680586231,5
1680672631,4
1680759032,4
1680845434,4
1680931831,4
1681018231,2
1681104631,2
1681191033,4
1681277433,4
1681363834,2
1681450235,4
1681536635,4
1681623032,4
1681709434,4
1681795835,3
1681882234,4
1681968635,3
1682055034,4
1682141433,2
1682227834,4
1682314235,4
1682400635,3
1682487032,4
1682573432,2
1682659832,4
1682746233,4
1682832633,4
1682919034,4
1683005434,3
1683091833,4
1683264631,4
1683351031,4
1683437432,4
1683523832,3
1683610233,5
1683696632,2
1712727049,1
1724563847,6
1726810249,1
1728538253,1
