1639904549,6
1639907950,6
1639980923,23
1639983233,23
1639985995,23
1640059226,8
1640080313,8
1640145685,11
1640232083,12
1640318424,21
1640404823,13
1640491284,6
1640577691,7
1640664024,11
1640750484,11
1640836884,9
1640923223,9
1641009626,12
