1653978755,146
1654065033,367
1654151553,173
1654237831,306
1654324351,354
1654410631,232
1654497153,201
1654583555,162
1654669837,284
1654756356,159
1654842756,199
1654929156,196
1655015436,370
1655101838,371
1655188357,185
1655274636,173
1655361158,134
1655447555,128
1655533836,624
1655620256,181
1655706645,158
1655793158,185
1655879557,574
1655965955,258
1656052365,195
1656138754,251
1656225155,348
1656311556,128
1656397956,150
1656484356,159
1656570758,99
