1640059226,4
1640080313,4
1640145685,6
1640232083,2
1640318424,2
1640404823,2
1640491284,2
1640577691,2
1640664024,2
1640750484,2
1640836884,2
1640923223,2
1641009626,2
1641096084,2
1641182484,2
1641268824,2
1641355224,2
1641441684,2
1641528084,2
1641700884,2
1641787224,6
1641873686,2
1642392088,8
1642408942,8
1642478484,4
1642564885,2
1642651226,2
1642676514,2
1642805851,4
1642824026,6
1642855125,6
1642910490,8
1642924655,8
1642934565,8
1642937864,8
1642996892,16
1643083292,2
1643169628,2
1643256090,2
1643342487,2
1643428827,6
1643515288,2
1643601634,2
1643622207,2
1643688028,4
1643708607,4
1643774489,4
1643860889,4
1643947288,2
1644033629,2
1644120088,2
1644206493,2
1644292831,2
1644321030,2
1644388289,4
1644407490,4
1644474692,4
1644493888,4
1644561030,4
1644647492,2
1644733834,2
1644770508,2
1644820292,14
1644906689,2
1644993090,6
1645079499,2
1645165829,6
1645252290,2
1645338629,2
1645425030,2
1645467113,2
1645470826,2
1645511492,6
1645597892,2
1645684232,2
1645770629,2
1645857150,2
1645943553,2
1646029893,2
1646116237,2
1646202760,2
1646289033,2
1646375551,2
1646461951,2
1646548229,2
1646634751,2
1646721161,2
1646807431,2
1646893952,2
1646980230,2
1647066751,2
1647153150,2
1647239550,2
1647325952,2
1647412352,2
1647498752,2
1647585151,2
1647757954,2
1647844355,2
1647930752,2
1648017150,3
1648103550,2
1648189831,3
1648276229,2
1648362752,2
1648449033,2
1648535442,3
1648621952,2
1648708231,2
1648794750,2
1648881149,3
1648967561,2
1649053832,2
1649140351,3
1649226751,2
1649313029,2
1649399549,3
1649485949,2
1649572354,2
1649658750,2
1649745150,3
1649831565,6
1649917950,2
1650004228,3
1650090628,2
1650177150,2
1650263549,2
1650349831,2
1650436229,2
1650522756,2
1650609163,2
1650695550,2
1650781953,2
1650868349,2
1650954630,2
1651041030,2
1651127552,7
1651213951,2
1651300352,2
1651386755,2
1651473034,3
1651559564,2
1651645850,2
1651732362,2
1651818753,2
1651905153,2
1651991564,3
1652077954,2
1652164360,2
1652250764,2
1652337032,2
1652423553,3
1652509832,3
1652596232,2
1652682759,2
1652769160,2
1652855561,2
1652941964,2
1653028353,2
1653114753,2
1653201159,2
1653287558,2
1653373954,2
1653460234,2
1653546755,2
1653633154,2
1653719553,2
1653805957,2
1653892236,6
1653978755,2
1654065033,2
1654151553,3
1654237831,2
1654324351,2
1654410631,2
1654497153,2
1654583555,2
1654669837,3
1654756356,2
1654842756,2
1654929156,2
1655015436,2
1655101838,2
1655188357,2
1655274636,2
1655361158,3
1655447555,2
1655533836,2
1655620256,2
1655706645,2
1655793158,3
1655879557,2
1655965955,2
1656052365,2
1656138754,2
1656225155,3
1656311556,2
1656397956,2
1656484356,2
1656570758,2
1656743558,1
1656829841,2
1656916357,2
1657002637,2
1657089163,2
1657175559,3
1657261838,2
1657348240,2
1657434758,2
1657521164,2
1657607566,2
1657693957,3
1657780357,2
1657803090,2
1657804447,2
1657809517,2
1657866760,10
1657896040,10
1657953158,4
1657982325,4
1658039438,4
1658068726,4
1658125843,5
1658155247,5
1658212362,4
1658241661,4
1658298758,4
1658328052,4
1658385041,4
1658414447,4
1658471560,4
1658500847,4
1658557962,5
1658587247,5
1658644360,4
1658673645,4
1658730762,4
1658760045,4
1658817160,4
1658846453,4
1658903439,4
1658932848,4
1658989840,4
1659019246,4
1659076365,5
1659105646,5
1659162770,4
1659192044,4
1659249159,4
1659278470,4
1659335565,4
1659364847,4
1659421963,4
1659451128,4
1659508368,5
1659537519,5
1659594767,4
1659624049,4
1659681160,4
1659710444,4
1659767561,8
1659796845,8
1659853840,8
1659883130,8
1659940369,4
1659969638,4
1660026647,5
1660056049,5
1660113163,4
1660142439,4
1660199441,4
1660228849,4
1660285970,4
1660315250,4
1660372250,4
1660401521,4
1660458761,4
1660488049,4
1660545162,4
1660574449,4
1660631564,4
1660660730,4
1660717841,4
1660747248,4
1660804362,4
1660833647,4
1660890760,4
1660920046,4
1660977162,4
1661006455,4
1661063442,4
1661092854,4
1661149842,4
1661179125,4
1661236366,4
1661265647,4
1661322641,5
1661352051,5
1661409162,4
1661438449,4
1661495561,4
1661524735,4
1661581964,5
1661611239,5
1661668363,4
1661697647,4
1661700049,4
1661754784,7
1661784048,7
1661870448,8
1661927560,4
1661956724,4
1662013964,4
1662043246,4
1662100359,4
1662129642,4
1662186760,4
1662216045,4
1662273039,4
1662302447,4
1662359559,4
1662388727,4
1662445958,4
1662475124,4
1662532358,4
1662561643,4
1662618758,4
1662647931,4
1662705164,4
1662734437,4
1662791558,4
1662820724,4
1662877847,4
1662907237,4
1662964357,4
1662993645,4
1663050638,4
1663080057,4
1663137169,4
1663166448,4
1663223564,4
1663252844,4
1663309969,4
1663339237,4
1663396358,4
1663425653,4
1663482759,4
1663512042,4
1663569159,4
1663598447,4
1663655565,4
1663684725,4
1663741840,4
1663771124,4
1663828239,4
1663857524,4
1663914640,4
1663943934,4
1664001039,4
1664030318,4
1664087438,4
1664116722,4
1664173842,4
1664203127,4
1664260251,4
1664289537,4
1664346641,4
1664375951,4
1664433041,4
1664462320,4
1664519554,4
1664548711,4
1664605833,4
1664635111,4
1668350533,4
1668355972,4
1668356757,4
1668360810,4
1668560577,2
1668646979,2
1673516775,2
1674367285,2
1674455475,2
1674541884,2
1674628285,2
1674714694,2
1674801082,2
1674887480,2
1674973872,6
1675060281,2
1675146682,2
1675233071,2
1675319481,2
1675405883,2
1675492281,2
1675578681,4
1675837863,2
1676442661,2
1676615450,2
1676701857,2
1676788249,13
1676874662,21
1676961061,2
1677047454,2
1677133857,2
1677220262,2
1677306660,2
1677393061,2
1677479458,2
1677565859,2
1677738657,2
1677825057,2
1677911460,2
1677997847,2
1678084257,2
1678170666,2
1678257055,2
1678343445,10
1679569142,4
1679584407,4
1679589867,4
1679596494,4
1679602915,4
1679607956,4
1679639532,18
1679722309,2
1679808717,2
1679895117,2
1679981518,2
1680067912,2
1680154308,7
1680240714,5
1680327097,5
1680413504,5
1680499902,5
1680586299,2
1680672702,2
1680759104,2
1680845523,2
1680931899,2
1681018301,2
1681104713,2
1681191117,2
1681277516,2
1681363906,2
1681450306,2
1681536706,2
1681623105,2
1681709528,2
1681795909,2
1681882326,2
1681968706,2
1682055103,2
1682141505,2
1682227910,2
1682314324,2
1682400707,2
1682487105,2
