1658385041,99
1658414447,99
1658471560,59
1658500847,59
1658557962,46
1658587247,46
1658644360,116
1658673645,116
1658730762,127
1658760045,127
1658817160,115
1658846453,115
1658903439,47
1658932848,47
1658989840,49
1659019246,49
