1651300352,27
1651386755,28
1651473034,30
1651559564,34
1651645850,33
1651732362,28
1651818753,31
1651905153,17
1651991564,12
1652077954,10
1652164360,15
1652250764,16
1652337032,15
1652423553,18
1652509832,18
1652596232,2
