1681882234,1
1682314235,20
1682400635,1
1682573432,3
1690176650,1
1690608645,2
1694064634,1
1696138241,1
1696311044,1
1698561046,1
1698993045,1
1699597838,18
1700289040,2
1703658641,3
1706596254,4
1706855451,1
1706941851,1
1707114652,3
1707460251,1
1711261844,1
1712295052,1
1712727049,2
1714541454,1
1714714252,2
1715059856,1
1715491864,3
1718083857,9
1718343064,1
1719552647,1
1719811846,3
1721280649,3
1721712651,1
1722576648,1
1722922247,1
1723354248,1
1724045446,3
1726551051,5
1726810249,2
1727415052,3
1728192652,2
1728624654,1
1729575053,1
1729661454,5
1730183452,1
1730874652,7
1731047452,1
1731911451,2
1732516250,2
1732602651,1
