1708756568,1
1708842965,2
1708929366,7
1709102173,3
1709188566,6
1709275007,7
1709361374,3
1709447776,18
1709534155,11
1709620564,7
1709706962,1
1709793367,10
1709966169,9
1710052561,4
1710138969,7
1710225362,10
1710311773,6
1710398159,2
