1659508368,19
1659537519,19
1659594767,8
1659624049,8
1659681160,24
1659710444,24
1659767561,27
1659796845,27
1659853840,37
1659883130,37
1659940369,29
1659969638,29
1660026647,43
1660056049,43
1660113163,10
1660142439,10
1660199441,32
1660228849,32
1660285970,37
1660315250,37
1660372250,34
1660401521,34
1660458761,41
1660488049,41
1660545162,25
1660574449,25
1660631564,34
1660660730,34
1660717841,15
1660747248,15
1660804362,12
1660833647,12
1660890760,14
1660920046,14
1660977162,20
1661006455,20
1661063442,16
1661092854,16
1661149842,13
1661179125,13
1661236366,22
1661265647,22
1661322641,17
1661352051,17
1661409162,14
1661438449,14
1661495561,12
1661524735,12
1661581964,14
1661611239,14
1661668363,14
1661697647,14
1661700049,14
1661754784,24
1661784048,24
1661870448,30
1661927560,23
1661956724,23
1662013964,7
1662043246,7
1662100359,5
1662129642,5
