1656829841,2
1656916357,2
1657002637,2
1657089163,2
1657175559,2
1657261838,2
1657348240,2
1657434758,2
1657521164,2
1657607566,2
1657693957,2
1657780357,2
1657803090,2
1657804447,2
1657809517,2
1657866760,10
1657896040,10
1657953158,4
1657982325,4
1658039438,4
1658068726,4
1658125843,4
1658155247,4
1658212362,4
1658241661,4
1658298758,4
1658328052,4
1658385041,4
1658414447,4
1658471560,4
1658500847,4
1658557962,4
1658587247,4
1658644360,4
1658673645,4
1658730762,4
1658760045,4
1658817160,4
1658846453,4
1658903439,4
1658932848,4
1658989840,4
1659019246,4
1659076365,4
1659105646,4
1659162770,4
1659192044,4
1659249159,4
1659278470,4
1659335565,4
1659364847,4
1659421963,4
1659451128,4
1659508368,4
1659537519,4
1659594767,4
1659624049,4
1659681160,4
1659710444,4
1659767561,4
1659796845,4
1659853840,4
1659883130,4
1659940369,4
1659969638,4
1660026647,4
1660056049,4
1660113163,4
1660142439,4
1660199441,4
1660228849,4
1660285970,4
1660315250,4
1660372250,4
1660401521,4
1660458761,4
1660488049,4
1660545162,4
1660574449,4
1660631564,4
1660660730,4
1660717841,4
1660747248,4
1660804362,4
1660833647,4
1660890760,4
1660920046,4
1660977162,4
1661006455,4
1661063442,4
1661092854,4
1661149842,4
1661179125,4
1661236366,4
1661265647,4
1661322641,4
1661352051,4
1661409162,4
1661438449,4
1661495561,4
1661524735,4
1661581964,4
1661611239,4
1661668363,4
1661697647,4
1661700049,4
1661754784,6
1661784048,6
1661870448,4
1661927560,4
1661956724,4
1662013964,4
1662043246,4
1662100359,4
1662129642,4
1662186760,4
1662216045,4
1662273039,4
1662302447,4
1662359559,4
1662388727,4
1662445958,4
1662475124,4
1662532358,4
1662561643,4
1662618758,4
1662647931,4
1662705164,4
1662734437,4
1662791558,4
1662820724,4
1662877847,4
1662907237,4
1662964357,4
1662993645,4
1663050638,4
1663080057,4
1663137169,4
1663166448,4
1663223564,4
1663252844,4
1663309969,4
1663339237,4
1663396358,4
1663425653,4
1663482759,4
1663512042,4
1663569159,4
1663598447,4
1663655565,4
1663684725,4
1663741840,4
1663771124,4
1663828239,4
1663857524,4
1663914640,4
1663943934,4
1664001039,4
1664030318,4
1664087438,4
1664116722,4
1664173842,4
1664203127,4
1664260251,4
1664289537,4
1664346641,4
1664375951,4
1664433041,4
1664462320,4
1664519554,4
1664548711,4
1664605833,4
1664635111,4
1668560577,2
1668646979,2
1673516775,2
1674367285,2
1674455475,2
1674541884,2
1674628285,2
1674714694,2
1674801082,2
1674887480,2
1674973872,2
1675060281,2
1675146682,2
1675233071,2
1675319481,2
1675405883,2
1675492281,2
1675578681,2
1675837863,2
1676442661,2
1676615450,2
1676701857,2
1676788249,2
1676874662,2
1676961061,2
1677047454,2
1677133857,2
1677220262,2
1677306660,2
1677393061,2
1677479458,2
1677565859,2
1677652257,4
1677738657,2
1677825057,2
1677911460,2
1677997847,2
1678084257,2
1678170666,2
1678257055,2
1678343445,10
1679569142,4
1679584407,4
1679589867,4
1679596494,4
1679602915,4
1679607956,4
1679639532,18
1679722309,2
1679808717,2
1679895117,2
1679981518,2
1680067912,2
1680154308,2
1680240714,2
1680327097,2
1680413504,2
1680499902,2
1680586299,2
1680672702,2
1680759104,2
1680845523,2
1680931899,2
1681018301,2
1681104713,2
1681191117,2
1681277516,2
1681363906,2
1681450306,2
1681536706,2
1681623105,2
1681709528,2
1681795909,2
1681882326,2
1681968706,2
1682055103,2
1682141505,2
1682227910,2
1682314324,2
1682400707,2
1682487105,2
