1688016640,1
1688103041,1
1688362240,1
1688535044,1
1688621445,1
1688707844,1
1688794245,1
1688967042,1
1689226241,1
1692768633,1
1692855035,1
1692941433,1
1693027839,1
1693114233,1
1693200633,1
1693978232,1
1697261447,1
1697347842,1
1697520642,1
1697607044,1
1697693444,1
1697866244,1
1697952644,1
1698211845,1
1698474646,1
1698561046,1
1698647445,1
1698733843,1
1704436239,1
1705041045,1
1730356254,1
1730874652,1
