1693200777,8
1693287141,17
1693373568,20
1693459952,23
1693546364,26
1693632754,20
1693719144,16
1693805540,16
1693891949,25
1693978362,26
1694064749,10
1694151151,12
1694237547,8
1694323959,9
1694410362,3
1694496769,6
1694583178,14
1694669562,21
1694755972,36
1694842363,22
1694928766,17
1695015165,7
