1650349831,1
1650522756,4
1650868349,13
1650954630,104
1651041030,36
1651213951,12
1651473034,75
1651645850,12
1651991564,114
1652077954,2
1652769160,1
1652941964,7
1653114753,4
1653201159,2
1653287558,85
1653373954,1
1653460234,3
1653633154,2
1653719553,1
