1652682759,1
1652769160,18
1652855561,16
1652941964,22
1653028353,13
1653114753,14
1653201159,5
1653287558,17
1653373954,15
1653460234,21
1653546755,17
1653633154,19
1653719553,18
1653805957,16
1653892236,17
1653978755,27
1654065033,2
