1693114356,12
1693200777,2
1693287141,5
1693373568,3
1693459952,4
1693546364,1
1693632754,19
1693719144,3
1693805540,7
1693891949,1
1693978362,8
1694151151,11
1694237547,5
1694410362,1
1694496769,2
1694583178,6
1694669562,3
1694755972,31
1694842363,5
1694928766,3
1695015165,2
1695187975,3
1695274380,3
1695360784,6
1695447164,1
1695533586,4
1695619990,1
1695706406,5
1695792808,2
1695879218,5
1695965624,19
1696052011,3
1696138408,18
1696224807,1
1696311219,2
1696397621,3
