1679584314,1
1679589759,1
1679596397,1
1679602819,1
1679607852,1
1679639432,1
1679981431,1
1680845434,1
1681623032,1
1692250233,1
1692336633,1
1692423035,1
1692509432,1
1698474646,1
1698561046,1
1698647445,1
