1679584314,1
1679589759,1
1679596397,1
1679602819,1
1679607852,1
1679639432,1
1679808631,1
1679981431,1
1680240629,1
1680845434,1
1683610233,1
1683955833,1
1687498241,2
1688016640,2
1688103041,3
1688362240,2
1688535044,1
1688621445,2
1688707844,2
1688794245,2
1688880644,2
1688967042,2
1689053441,2
1689139840,2
1689226241,2
1689312653,2
1689831044,2
1689917446,2
1690003846,2
1690522245,1
1690867847,2
1691127048,2
1691645448,2
1691904646,1
1691991040,1
1692077440,2
1692163831,2
1692250233,2
1692336633,2
1692423035,2
1692509432,2
1692682233,1
1692768633,1
1692855035,1
1692941433,1
1693027839,1
1693200633,1
1697693444,1
1697866244,1
1697952644,1
1698211845,1
1698474646,2
1698561046,1
1698647445,1
1698733843,1
1698820251,1
1698993045,2
1699079441,1
1699165843,1
1699252253,6
1699338639,1
1699425038,1
1699597838,2
1699684239,1
1699770639,1
1699857040,1
1699943446,1
1700116239,1
1700202637,2
1700548240,1
1700721041,1
1700807441,2
1700893840,1
1700980240,1
1701066641,1
1701239442,1
1701412240,2
1701757841,1
1702017040,2
1702621850,1
1703226640,1
1703831442,1
1704436239,4
1707114652,1
1708410644,6
1708583454,3
1722231051,1
1722317451,1
1728883856,1
1730356254,1
