1702535641,2
1702622071,3
1702708433,4
1702794843,20
1702881239,3
1702967665,4
1703054037,4
1703140439,2
1703226865,20
1703313245,1
1703399641,2
1703572441,36
1703658841,4
1703745239,6
1703831661,2
1703918046,1
1704004443,2
1704090847,21
1704177241,2
