1680845523,133
1680931899,97
1681018301,241
1681104713,201
1681191117,123
1681277516,382
1681363906,256
1681450306,193
1681536706,176
1681623105,33
1681709528,92
1681795909,174
1681882326,159
1681968706,144
1682055103,149
1682141505,127
1682227910,153
1682314324,42
1682400707,123
1682487105,290
1682573524,124
1682659898,126
1682746309,116
1682832700,142
1682919107,159
1683005499,28
1683091901,216
1683178309,152
1683264713,215
1683351101,115
