1677133857,12
1677220262,16
1677306660,3
1677393061,11
1677479458,26
1677565859,28
1677652257,11
1677738657,23
1677825057,26
1677911460,30
1677997847,24
1678084257,26
1678170666,32
1678257055,26
1678343445,21
