1646980230,1
1647066751,5
1647153150,14
1647239550,8
1647325952,4
1647412352,25
1647498752,14
1647585151,19
1647757954,5
1647844355,11
1647930752,10
1648017150,14
1648103550,12
1648189831,11
1648276229,7
1648362752,9
1648449033,11
1648535442,11
1648621952,11
1648708231,9
1648794750,6
1648881149,10
1648967561,7
1649053832,3
1649140351,12
1649226751,11
1649313029,6
1649399549,5
1649485949,8
1649572354,10
1649658750,8
1649745150,6
1649831565,7
1649917950,3
1650004228,9
1650090628,9
1650177150,7
1650263549,9
1650349831,1
