1660545162,2
1660574449,2
1660631564,9
1660660730,9
1660717841,3
1660747248,3
1660804362,4
1660833647,4
1660890760,3
1660920046,3
1660977162,5
1661006455,5
1661063442,7
1661092854,7
1661149842,5
1661179125,5
1661236366,9
1661265647,9
1661322641,18
1661352051,18
1661409162,8
1661438449,8
1661495561,12
1661524735,12
1661581964,14
1661611239,14
1661668363,4
1661697647,4
1661700049,4
1661754784,7
1661784048,7
1661870448,2
