1697693651,6
1697780021,3
1697866447,1
1697952848,4
1698039229,5
1698125641,4
1698212053,4
1698298423,3
1698384826,5
1698474862,2
1698561261,3
1698647660,6
1698734051,9
1698820440,21
1698906836,4
1698993260,2
1699079643,3
1699166057,5
1699252467,5
1699425254,4
1721885729,45
1721972116,1
