1721367339,10
1721453736,10
1721540139,16
1721626512,12
1721712930,16
1721799317,12
1721885729,22
1721972116,10
1722058513,16
1722144941,16
1722231340,18
1722317737,12
1722404147,14
1722490541,12
1722576933,2
1722663315,14
1722749743,10
1722836105,2
1722922512,6
1723008910,12
1723095317,6
1723181712,8
1723268105,10
1723354509,18
1723440921,2
1723527316,4
1723613721,18
1723700119,1
1723786513,12
1723872909,6
1723959316,14
1724045707,6
1724132118,10
1724218520,11
1724304925,8
1724391319,4
