1657866760,8
1657896040,8
1657953158,12
1657982325,12
1658039438,14
1658068726,14
1658125843,10
1658155247,10
1658212362,35
1658241661,35
1658298758,41
1658328052,41
1658385041,36
1658414447,36
1658471560,20
1658500847,20
1658557962,4
1658587247,4
1658644360,17
1658673645,17
1658730762,26
1658760045,26
1658817160,24
1658846453,24
1658903439,5
1658932848,5
1658989840,9
1659019246,9
