1651905153,64
1651991564,78
1652077954,88
1652164360,79
1652250764,81
1652337032,78
1652423553,79
1652509832,77
1652596232,81
1652682759,56
1652769160,71
1652855561,79
1652941964,117
1653028353,49
1653114753,143
1653201159,23
