1655361158,2
1655706645,3
1655965955,6
1656138754,1
1656225155,11
1656397956,13
1656743558,1
1656829841,15
1656916357,76
1657002637,28
1657175559,12
1657261838,2
1657348240,1
1657434758,84
1657521164,19
1657607566,20
1657693957,238
1657780357,25
1657803090,25
1657804447,25
1657809517,25
1657866760,119
1657896040,119
