1659249159,91
1659278470,91
1659421963,4
1659451128,4
1659508368,2
1659537519,2
1659594767,17
1659624049,17
1659681160,6
1659710444,6
1659767561,14
1659796845,14
1659853840,60
1659883130,60
1659940369,80
1659969638,80
1660113163,28
1660142439,28
1660199441,471
1660228849,471
1660285970,4
1660315250,4
1660372250,93
1660401521,93
1660458761,91
1660488049,91
