1663914640,3
1663943934,3
1664001039,5
1664030318,5
1664087438,2
1664116722,2
1664173842,4
1664203127,4
1664260251,16
1664289537,16
1664346641,8
1664375951,8
1664433041,4
1664462320,4
1664519554,4
1664548711,4
1664605833,3
1664635111,3
