1724736906,2
1724823316,5
1724909717,3
1724996108,3
1725082506,2
1725168909,3
1725255319,2
1725341717,2
1725428109,2
1725514506,3
1725600914,3
1725687306,3
1725773707,3
1725860113,24
1725946519,6
1726032920,22
1726119315,3
1726378512,3
1726724132,2
1726810515,22
1726896925,2
1726983322,22
1727069719,2
1727156114,5
1727242538,2
1727328917,2
1727415326,3
1727501713,4
1727588116,3
1727674524,3
1727760922,2
1727847333,10
1727933723,3
1728020122,2
1728106547,22
1728192945,4
1728279336,4
1728365743,7
1728452151,3
1728538537,2
1728624938,3
1728711328,3
1728797737,2
1728884126,2
1728970539,3
1729056925,2
1729143336,4
1729229724,4
1729316123,24
1729402521,2
1729488952,3
1729575323,4
1729661730,2
1729748135,2
1729834546,22
1729924541,2
1730010943,2
1730097332,5
1730183730,7
1730270141,2
1730356536,3
1730442925,4
1730529338,5
1730615759,2
1730702128,2
1730788525,4
1730874965,12
1730961326,6
1731047722,2
1731134141,2
1731220531,2
1731306938,2015
1731393338,3
1731479747,9
1731566125,41
1731652532,4
1731738930,5
1731825326,7
1731911726,67
1731998131,7
1732084532,62
1732170946,10
1732257343,2
1732343726,4
1732430128,5
1732516530,3
1732602931,3
1732689332,5
1732775733,5
1732862185,25
1732948585,3
1733034986,6
1733121412,7
1733207816,10
1733294214,4
