1648621952,4
1648708231,12
1648794750,11
1648881149,9
1648967561,5
1649053832,6
1649140351,10
1649226751,6
1649313029,3
1649399549,9
1649485949,2
1649572354,18
1649658750,8
1649745150,12
1649831565,7
1649917950,4
