1660113163,6
1660142439,6
1660199441,5
1660228849,5
1660285970,9
1660315250,9
1660372250,10
1660401521,10
1660458761,6
1660488049,6
1660545162,5
1660574449,5
1660717841,9
1660747248,9
1660804362,4
1660833647,4
1660890760,13
1660920046,13
1660977162,6
1661006455,6
1661063442,5
1661092854,5
1661149842,7
1661179125,7
1661236366,9
1661265647,9
1661322641,6
1661352051,6
1661409162,19
1661438449,19
1661495561,10
1661524735,10
1661581964,25
1661611239,25
1661668363,5
1661697647,5
1661700049,5
1661754784,9
1661784048,9
1661870448,5
1661927560,6
1661956724,6
1662013964,4
1662043246,4
