1698298423,113
1698384826,220
1698474862,372
1698561261,143
1698647660,196
1698734051,265
1698820440,159
1698906836,167
1698993260,138
1699079643,149
1699166057,115
1699252467,110
1699338847,585
1699425254,120
1699511642,241
1699598052,312
1699684453,232
1699770845,229
1699857241,310
1699943653,791
1700030030,347
1700116443,15
