1680931899,3
1681018301,2
1681104713,3
1681277516,5
1681363906,5
1681450306,2
1681536706,2
1681709528,2
1681795909,13
1681882326,3
1681968706,4
1682055103,3
1682141505,3
1682227910,3
1682400707,7
1682487105,20
1682573524,4
1682659898,3
1682746309,2
1682832700,10
1682919107,10
1683005499,3
1683091901,2
1683178309,2
1683264713,2
1683351101,7
