1636895594,3
1636898490,3
1636900709,3
1637070326,4
1637070818,4
1637072812,1
1637122028,6
1637208446,4
1637294806,1
1637381227,2
1637467621,3
1637554087,2
1637589848,2
1637640464,1
1637726914,3
1637813369,1
1637899638,1
1637986004,3
1638158887,3
1638331638,2
1639904549,1
1639907950,1
1639980923,5
1639983233,5
1639985995,5
1640318424,4
1640404823,5
1640491284,5
1640664024,1
1640750484,1
1641009626,5
1641096084,2
1641182484,1
1641268824,2
1641441684,2
1641528084,1
1641700884,1
1641873686,6
1642305627,1
1642319122,1
1642392088,4
1642408942,4
1642478484,5
1642564885,1
1642651226,3
1642676514,3
1642769502,4
1642771604,4
1642805136,4
1642805851,4
1642824026,5
1642855125,5
1642910490,6
1642924655,6
1642934565,6
1642937864,6
1642996892,9
1643083292,7
1643169628,4
1643256090,3
1643342487,2
1643428827,4
1643515288,2
1643601634,4
1643622207,4
1643688028,2
1643708607,2
1643774489,7
1643860889,5
1643947288,8
1644033629,2
1644120088,3
1644206493,1
1644292831,4
1644321030,4
1644388289,2
1644407490,2
1644474692,5
1644493888,5
1644561030,4
1644647492,15
1644733834,4
1644770508,4
1644820292,7
1644906689,7
1644993090,6
1645079499,3
1645165829,7
1645252290,4
1645338629,5
1645425030,5
1645467113,5
1645470826,5
1645511492,8
1645597892,3
1645684232,4
1645770629,2
1645857150,2
1645943553,2
1646029893,4
1646116237,1
1646202760,1
1646289033,4
1646375551,2
1646461951,7
1646548229,9
1646634751,7
1646721161,2
1646807431,3
1646893952,2
1646980230,1
1647066751,7
1647153150,8
1647239550,3
1647325952,10
1647412352,7
1647498752,1
1647585151,5
1647757954,2
1647844355,4
1647930752,8
1648017150,9
1648103550,6
1648189831,7
1648276229,3
1648362752,4
1648449033,2
1648535442,4
1648621952,5
1648708231,5
1648794750,9
1648881149,5
1648967561,4
1649053832,5
1649140351,3
1649226751,5
1649313029,2
1649399549,2
1649485949,5
1649572354,2
1649658750,2
1649745150,8
1649831565,7
1649917950,7
1650004228,1
1650090628,1
1650177150,3
1650263549,3
1650349831,8
1650436229,4
1650522756,7
1650609163,2
1650695550,5
1650781953,3
1650868349,5
1650954630,6
1651041030,4
1651127552,4
1651213951,1
1651300352,4
1651386755,3
1651473034,3
1651559564,4
1651645850,2
1651732362,8
1651818753,7
1651905153,6
1651991564,5
1652077954,2
1652164360,2
1652250764,3
1652337032,9
1652423553,3
1652509832,3
1652596232,10
1652682759,4
1652769160,2
1652855561,5
1652941964,6
1653028353,5
1653114753,6
1653201159,8
1653287558,5
1653373954,4
1653460234,2
1653546755,1
1653633154,4
1653719553,1
1653805957,5
1653892236,6
1653978755,2
1654065033,7
1654151553,5
1654237831,5
1654324351,3
1654410631,3
1654497153,2
1654583555,5
1654669837,3
1654756356,5
1654842756,4
1654929156,4
1655015436,7
1655101838,4
1655188357,1
1655274636,5
1655361158,1
1655447555,4
1655533836,2
1655620256,2
1655706645,2
1655793158,9
1655879557,7
1655965955,6
1656052365,12
1656138754,2
1656225155,4
1656397956,5
1656484356,4
1656570758,5
1656743558,5
1656829841,6
1656916357,3
1657002637,8
1657089163,4
1657175559,7
1657261838,6
1657348240,5
1657434758,8
1657521164,5
1657607566,6
1657693957,4
1657780357,3
1657803090,3
1657804447,3
1657809517,3
1657866760,4
1657896040,4
1657953158,2
1657982325,2
1658039438,5
1658068726,5
1658125843,3
1658155247,3
1658212362,2
1658241661,2
1658298758,8
1658328052,8
1658385041,10
1658414447,10
1658471560,1
1658500847,1
1658557962,8
1658587247,8
1658644360,12
1658673645,12
1658730762,6
1658760045,6
1658817160,5
1658846453,5
1658903439,3
1658932848,3
1658989840,4
1659019246,4
1659076365,3
1659105646,3
1659162770,4
1659192044,4
1659249159,5
1659278470,5
1659335565,3
1659364847,3
1659421963,4
1659451128,4
1659508368,2
1659537519,2
1659594767,6
1659624049,6
1659681160,1
1659710444,1
1659767561,5
1659796845,5
1659853840,6
1659883130,6
1659940369,4
1659969638,4
1660026647,1
1660056049,1
1660113163,2
1660142439,2
1660199441,8
1660228849,8
1660285970,4
1660315250,4
1660372250,4
1660401521,4
1660458761,12
1660488049,12
1660545162,5
1660574449,5
1660631564,2
1660660730,2
1660717841,6
1660747248,6
1660804362,6
1660833647,6
1660890760,8
1660920046,8
1660977162,7
1661006455,7
1661063442,3
1661092854,3
1661149842,6
1661179125,6
1661236366,3
1661265647,3
1661322641,4
1661352051,4
1661409162,4
1661438449,4
1661495561,7
1661524735,7
1661581964,3
1661611239,3
1661668363,4
1661697647,4
1661700049,4
1661754784,2
1661784048,2
1661870448,4
1661927560,10
1661956724,10
1662013964,6
1662043246,6
1662100359,5
1662129642,5
1662186760,4
1662216045,4
1662273039,1
1662302447,1
1662359559,3
1662388727,3
1662445958,2
1662475124,2
1662532358,2
1662561643,2
1662705164,1
1662734437,1
1662791558,2
1662820724,2
1662877847,2
1662907237,2
1663050638,4
1663080057,4
1663137169,1
1663166448,1
1663223564,1
1663252844,1
1663309969,2
1663339237,2
1663396358,3
1663425653,3
1663569159,2
1663598447,2
1663655565,5
1663684725,5
1663741840,2
1663771124,2
1663828239,3
1663857524,3
1663914640,5
1663943934,5
1664001039,1
1664030318,1
1664087438,5
1664116722,5
1664173842,2
1664203127,2
1664260251,3
1664289537,3
1664346641,5
1664375951,5
1664433041,2
1664462320,2
1664519554,5
1664548711,5
1664605833,1
1664635111,1
1668350533,4
1668355972,4
1668356757,4
1668360810,4
1668474184,6
1668560577,3
1668646979,1
1673516775,3
1674455475,2
1674541884,2
1675233071,3
1675578681,2
1729229724,7
1729402521,3
