1679584314,1
1679589759,1
1679596397,1
1679602819,1
1679607852,1
1679639432,1
1679981431,1
1680845434,1
1681623032,1
1683610233,1
1686288634,1
1688016640,1
1688103041,1
1688362240,1
1688535044,1
1688621445,1
1688707844,1
1688794245,1
1688880644,1
1688967042,1
1689226241,1
1689831044,1
1689917446,1
1690003846,1
1690263047,1
1690522245,1
1690781448,1
1690867847,1
1691127048,1
1691213447,11
1692768633,1
1692855035,1
1692941433,1
1693027839,1
1693114233,1
1693200633,1
1693978232,1
1695360634,1
1695533434,1
1695619839,1
1697261447,1
1697347842,1
1697520642,1
1697607044,1
1697693444,1
1697866244,1
1697952644,1
1698211845,1
1698474646,1
1698561046,1
1698647445,1
1698733843,1
1700116239,1
1700807441,2
1700893840,1
1700980240,1
1701066641,1
1701239442,1
1701412240,2
1702017040,2
1702621850,1
1703226640,1
1703831442,1
1704436239,1
1705041045,1
1708410644,2
1721885449,1
1730874652,1
