1632865297,843
1632865737,843
1632895269,843
1632895525,843
1632896545,843
1632896839,843
1632899476,843
1632899836,843
1632900579,843
1632901424,843
1632905822,843
1632906006,843
1632906183,843
1632908761,843
1632910378,843
1632911513,843
1633002253,0
1633002659,843
1633003106,843
1633003821,843
1633003952,843
1633004066,843
1633004178,843
1633004487,843
1633004662,843
1633011625,843
1633012202,843
1633424928,843
1633425470,843
1633426463,843
1633438619,843
1633446987,843
1633447575,843
1633450015,843
1633450289,843
1633451292,843
1633453642,843
1633457311,843
1633465522,843
1633469825,843
1633493002,843
1633579518,843
1633586359,843
1633665826,843
1633752257,843
1633838619,843
1633924996,843
1634011484,843
1634097915,843
1634184183,843
1634270693,843
1634357088,843
1634443417,843
1634529842,843
1634616186,843
1634789451,843
1634875465,843
1634961793,919
1635048207,933
1635134591,936
1635221025,944
1635307422,746
1635393792,753
