1706250646,1
1706855451,1
1707460251,1
1708065054,1
1708669850,1
1709274654,1
1710484249,1
1711089048,1
1712640649,1
1720503049,1
1720675849,1
1720762249,2
1723786250,1
1724218249,1
1725255050,1
1725341448,1
1727933451,1
