1679639432,1
1680845434,1
1683437432,1
1683610233,1
1687498241,1
1688016640,1
1688103041,1
1688275841,1
1688362240,1
1693978232,3
1694151031,2
1694323834,1
1694410234,2
1694496634,3
1694583036,3
1694669436,3
1694755834,3
1694842234,3
1694928634,3
1695274234,1
1695360634,1
1695533434,1
1695619839,1
1695965441,1
1696483842,1
1696570241,1
1696656645,1
1696743043,1
1696829444,1
