1687757568,18507
1687843969,34626
1687930377,34557
1688016807,34548
1688103218,34552
1688189597,34570
1688275996,34551
1688362412,34547
1688535215,34558
1688621614,34576
1688708029,34582
1688794420,34520
1688880821,34549
1688967219,34588
1689053626,25342
1689140028,34644
1689226424,34566
1689312837,34585
1689399195,34536
1689485597,34537
1689572000,34576
1689658397,34574
1689744807,34574
1689831241,34531
1689917640,34569
1690004042,34507
1690090404,34552
1690176817,34586
1690263240,33866
1690349617,34560
1690436012,34576
1690522443,34591
1690608808,34525
1690695212,34526
1690781617,34576
1690868047,34580
1690954421,34564
1691040818,34572
1691127250,34583
1691213630,34550
1691300015,34550
1691386395,33499
1691472821,27045
1691559206,34575
1691645653,34579
1691732035,34595
1691818443,34517
1691904834,34555
1691991184,34585
1692077570,34574
1692163972,34550
1692250382,34571
1692336773,34566
1692423180,34541
1692509573,34539
1692595944,10323
1692682368,25964
1692768764,34547
1692855167,35108
1692941568,47002
1693027980,38946
1693114356,34540
1693200777,34551
1693287141,22042
1693373568,22950
1693459952,34509
1693546364,34533
1693632754,34481
1693719144,34527
1693805540,34482
1693891949,34497
1693978362,34553
1694064749,34509
1694151151,34557
1694237547,34513
1694323959,34474
1694410362,29920
1694496769,34549
1694583178,34542
1694669562,34561
1694755972,34540
1694842363,34561
1694928766,34539
1695015165,34554
1695187975,35337
1695274380,40813
1695360784,34496
1695447164,34530
1695533586,34542
1695619990,34488
1695706406,34540
1695792808,34531
1695879218,34549
1695965624,34269
1696052011,34510
1696138408,34533
1696224807,34546
1696311219,34506
1696397621,34489
1696484041,34562
1696570435,34515
1696656841,34472
1696743237,34523
1696829644,34550
1696916048,34539
1697002439,34538
1697088838,34445
1697175238,34542
1697261644,34532
1697348050,34541
1697434425,34525
1697520844,34514
1697607247,34516
1697693651,34529
1697780021,34547
1697866447,34534
1697952848,34535
1698039229,34513
1698125641,34522
1698212053,34542
1698298423,34374
1698384826,34502
1698474862,34402
1698561261,34477
1698647660,34381
1698734051,34519
1698820440,34487
1698906836,34478
1698993260,34464
1699079643,34390
1699166057,34431
1699252467,33633
1699338847,34494
1699425254,34565
1699511642,34461
1699598052,34530
1699684453,34536
1699770845,34541
1699857241,34535
1699943653,34502
1700030030,34419
1700116443,33957
1700202865,17867
1700289223,25
1700375637,7
1700462021,23
1700548451,19
1700634836,25
1700721246,103
1700807657,6
1700894058,7
1700980458,9
1701066868,2
1701239661,17
