1657780357,52
1657803090,52
1657804447,52
1657809517,52
1657866760,118
1657896040,118
1657953158,201
1657982325,201
1658039438,231
1658068726,231
1658125843,173
1658155247,173
1658212362,134
1658241661,134
1658298758,137
1658328052,137
1658385041,295
1658414447,295
1658471560,574
1658500847,574
1658557962,466
1658587247,466
1658644360,430
1658673645,430
1658730762,107
1658760045,107
1658817160,125
1658846453,125
1658903439,163
1658932848,163
1658989840,174
1659019246,174
1659076365,102
1659105646,102
