1649485949,3
1649572354,2
1649658750,10
1649745150,4
1649831565,6
1649917950,5
1650004228,5
1650090628,7
1650177150,4
1650263549,6
1650349831,7
1650436229,11
1650522756,4
1650609163,7
1650695550,8
1650781953,2
