1691127048,1
1691213447,11
1691645448,1
1691991040,1
1692077440,1
1692163831,1
1692250233,1
1692336633,1
1692423035,1
1692509432,1
1693978232,1
1694151031,1
1694323834,1
1694410234,1
1694496634,1
1694583036,1
1694669436,1
1694755834,1
1694842234,1
1694928634,1
1695965441,1
1696915841,1
1697002242,1
1697088641,1
1697175042,1
1697261447,1
1697347842,1
1699597838,2
1699684239,1
1699770639,1
1701239442,1
1701412240,2
1702017040,2
1702621850,1
1703226640,1
1703831442,1
1704436239,1
1712813449,3
