1720071331,58
1720157731,135
1720244127,127
1720330509,123
1720416929,13622
1720503328,117
1720589730,149
1720676127,137
1720762554,214
1720935328,176
1721021712,99
1721108139,328
1721194539,124
1721280942,179
1721367339,67
