1679639432,4
1679981431,3
1680240629,4
1680845434,4
1682227834,3
1683437432,3
1683610233,4
1685856632,1
1687066239,2
1687152641,2
1687498241,23
1688016640,21
1688103041,21
1688275841,1
1688362240,20
1688535044,18
1688621445,19
1688707844,19
1688794245,19
1688880644,17
1688967042,17
1689053441,17
1689139840,17
1689226241,17
1689312653,17
1689744640,4
1689831044,15
1689917446,15
1690003846,15
1690263047,8
1690522245,11
1690781448,2
1690867847,13
1691127048,12
1691645448,9
1691731846,7
1691818247,6
1691904646,5
1691991040,9
1692077440,8
1692163831,7
1692250233,7
1692336633,7
1692423035,7
1692509432,7
1692682233,5
1692768633,5
1692855035,10
1692941433,10
1693027839,10
1693114233,2
1693200633,10
1693978232,5
1694151031,2
1694323834,3
1694583036,4
1694669436,4
1694755834,4
1694842234,4
1694928634,4
1695187834,5
1695274234,8
1695360634,28
1695533434,26
1695619839,26
1695965441,22
1696829444,1
1709965850,1
1713504653,1
1713936654,1
1725255050,1
1727933451,1
