1636286412,1
1636286488,1
1636895594,15
1636898490,16
1636900709,17
1637070326,16
1637070818,16
1637072812,25
1637122028,19
1637208446,33
1637294806,31
1637381227,35
1637467621,24
1637554087,43
1637589848,43
1637640464,34
1637726914,25
1637813369,26
1637899638,29
1637986004,29
1638072517,26
1638158887,19
1638245235,21
1638331638,25
1639904549,17
1639907950,17
1639980923,22
1639983233,22
1639985995,22
1640059226,23
1640080313,23
1640145685,16
1640232083,10
1640318424,21
1640404823,22
1640491284,15
1640577691,19
1640664024,18
1640750484,7
1640836884,18
1640923223,12
