1710743767,1
1710830176,115
1710916554,167
1711002952,164
1711089395,154
1711175767,93
1711262153,84
1711348567,472
1711434966,120
1711521368,185
1711607758,154
1711694155,118
1711776969,849
1711863379,91
1711949767,269
1712036181,158
1712122595,185
1712209001,635
1712295387,623
1712381761,4570
1712468183,115
1712554571,398
1712640970,226
1712727387,251
1712813813,623
1712900232,541
1712986589,107
1713073014,108
1713159410,203
1713245803,24
