1657866760,3
1657896040,3
1657953158,10
1657982325,10
1658039438,10
1658068726,10
1658125843,11
1658155247,11
1658212362,9
1658241661,9
1658298758,22
1658328052,22
1658385041,17
1658414447,17
1658471560,10
1658500847,10
1658557962,6
1658587247,6
1658644360,8
1658673645,8
1658730762,17
1658760045,17
1658817160,17
1658846453,17
1658903439,7
1658932848,7
1658989840,22
1659019246,22
1659076365,4
1659105646,4
1659162770,9
1659192044,9
