1681536706,51
1681623105,87
1681709528,63
1681795909,107
1681882326,46
1681968706,99
1682055103,61
1682141505,100
1682227910,70
1682314324,107
1682400707,72
1682487105,86
1682573524,93
1682659898,46
1682746309,74
1682832700,22
