1647153150,5
1647412352,12
1647585151,12
1647844355,5
1648017150,2
1648103550,1
1648189831,314
1648362752,6
1648449033,3
1648535442,77
1648621952,12
1648708231,51
1648794750,2
1648881149,67
1648967561,2
1649053832,2
