1697175238,14
1697261644,4
1697348050,3
1697434425,10
1697520844,22
1697693651,6
1697780021,3
1697866447,19
1697952848,38
1698039229,31
1698125641,21
1698212053,2
1698298423,22
1698384826,2
1698474862,3
1698561261,7
1698647660,7
1698734051,9
1698820440,9
1698906836,7
1698993260,3
1699079643,5
1699166057,6
1699252467,4
1699338847,1
1699425254,2
1699511642,3
1699598052,20
1699684453,4
1699770845,2
1699857241,3
1699943653,22
1700030030,6
1700116443,1
1700202865,5
1700289223,28
1700375637,7
1700462021,2
1700548451,17
1700634836,4
1700721246,2
1700807657,2
1700894058,4
1700980458,7
1701066868,30
1701239661,8
1701326039,2
