1687066360,117
1687152774,858
1687239150,275
1687411953,168
1687498393,218
1687584774,195
1687671173,206
1687757568,159
1687843969,539
1687930377,164
1688016807,171
1688103218,515
1688189597,32
1688275996,109
