1642392088,30942
1642408942,30942
1642478484,44617
1642564885,44583
1642651226,44613
1642676514,44613
1642805851,44617
1642824026,44622
1642855125,44622
1642910490,44615
1642924655,44615
1642934565,44615
1642937864,44615
1642996892,44624
1643083292,44610
1643169628,44586
1643256090,44438
1643342487,44616
1643428827,44611
1643515288,44617
1643601634,44614
1643622207,44614
1643688028,44613
1643708607,44613
1643774489,44496
1643860889,44559
1643947288,44617
1644033629,44616
1644120088,44619
1644206493,44561
1644292831,44610
1644321030,44610
1644388289,44562
1644407490,44562
1644474692,44622
1644493888,44622
1644561030,44621
1644647492,44624
1644733834,44619
1644770508,44619
1644820292,44640
1644906689,44622
1644993090,44624
1645079499,44621
1645165829,44623
1645252290,44623
1645338629,44618
1645425030,44623
1645467113,44623
1645470826,44623
1645511492,44623
1645597892,44620
1645684232,44624
1645770629,44626
1645857150,44632
1645943553,44624
1646029893,44601
1646116237,44623
1646202760,44622
1646289033,44593
1646375551,44619
1646461951,44615
1646548229,44623
1646634751,44624
1646721161,44626
1646807431,44623
1646893952,44624
1646980230,44624
1647066751,44622
1647153150,44640
1647239550,44630
1647325952,44622
1647412352,44587
1647498752,44616
1647585151,44620
1647757954,44621
1647844355,44617
1647930752,44617
1648017150,44577
1648103550,44583
1648189831,44616
1648276229,44615
1648362752,44611
1648449033,44546
1648535442,44617
1648621952,44614
1648708231,44625
1648794750,44584
1648881149,44614
1648967561,44614
1649053832,44583
1649140351,44590
1649226751,44523
1649313029,44496
1649399549,44392
1649485949,44568
1649572354,44627
1649658750,44450
1649745150,44464
1649831565,44525
1649917950,44594
1650004228,44620
1650090628,44620
1650177150,44621
1650263549,44625
1650349831,44619
1650436229,44625
1650522756,44625
1650609163,44622
1650695550,44621
1650781953,44622
1650868349,44621
1650954630,44620
1651041030,44629
1651127552,44595
1651213951,44585
1651300352,44629
1651386755,44622
1651473034,44622
1651559564,44626
1651645850,44565
1651732362,44557
1651818753,44623
1651905153,44625
1651991564,44622
1652077954,44614
1652164360,44612
1652250764,44621
1652337032,44622
1652423553,44620
1652509832,44642
1652596232,44628
1652682759,44624
1652769160,44590
1652855561,44518
1652941964,44327
1653028353,44489
1653114753,44634
1653201159,44650
1653287558,44618
1653373954,44550
1653460234,44525
1653546755,44492
1653633154,44526
1653719553,44623
1653805957,44622
1653892236,44621
1653978755,44589
1654065033,44521
1654151553,44298
1654237831,44410
1654324351,44444
1654410631,44624
1654497153,44378
1654583555,42526
1654669837,44628
1654756356,44623
1654842756,44628
1654929156,44624
1655015436,44622
1655101838,21600
1655274636,44626
1655361158,44616
1655447555,44668
1655533836,44616
1655620256,44616
1655706645,44615
1655793158,44627
1655879557,44609
1655965955,44619
1656052365,44625
1656138754,44629
1656225155,44619
1656311556,44623
1656397956,44615
1656484356,44587
1656570758,44624
1656743558,44620
1656829841,44619
1656916357,44580
1657002637,44406
1657089163,44326
1657175559,44587
1657261838,44627
1657348240,44620
1657434758,44628
1657521164,44622
1657607566,44623
1657693957,44589
1657780357,44622
1657803090,44622
1657804447,44622
1657809517,44622
1657866760,44632
1657896040,44632
1657953158,44628
1657982325,44628
1658039438,44624
1658068726,44624
1658125843,44627
1658155247,44627
1658212362,44630
1658241661,44630
1658298758,44628
1658328052,44628
1658385041,44630
1658414447,44630
1658471560,44626
1658500847,44626
1658557962,44629
1658587247,44629
1658644360,44624
1658673645,44624
1658730762,44621
1658760045,44621
1658817160,44626
1658846453,44626
1658903439,44441
1658932848,44441
1658989840,44626
1659019246,44626
1659076365,44626
1659105646,44626
1659162770,44623
1659192044,44623
1659249159,44625
1659278470,44625
1659335565,44626
1659364847,44626
1659421963,44214
1659451128,44214
1659508368,44257
1659537519,44257
1659594767,44632
1659624049,44632
1659681160,44634
1659710444,44634
1659767561,44611
1659796845,44611
1659853840,44634
1659883130,44634
1659940369,44630
1659969638,44630
1660026647,44637
1660056049,44637
1660113163,44627
1660142439,44627
1660199441,44625
1660228849,44625
1660285970,44629
1660315250,44629
1660372250,44635
1660401521,44635
1660458761,44628
1660488049,44628
1660545162,44633
1660574449,44633
1660631564,44633
1660660730,44633
1660717841,44629
1660747248,44629
1660804362,44629
1660833647,44629
1660890760,44632
1660920046,44632
1660977162,44635
1661006455,44635
1661063442,44627
1661092854,44627
1661149842,44631
1661179125,44631
1661236366,44630
1661265647,44630
1661322641,44632
1661352051,44632
1661409162,44629
1661438449,44629
1661495561,44628
1661524735,44628
1661581964,44642
1661611239,44642
1661668363,44627
1661697647,44627
1661700049,44627
1661754784,44584
1661784048,44584
1661870448,44568
1661927560,44459
1661956724,44459
1662013964,44425
1662043246,44425
1662100359,21578
1662129642,21578
