1695533434,1
1695619839,1
1695965441,1
1696483842,1
1696570241,1
1696656645,1
1696743043,1
1696829444,1
1696915841,1
1697002242,1
1697088641,1
1697175042,1
1697261447,1
1697347842,1
1697520642,1
1697607044,1
1697693444,1
1697866244,1
1697952644,1
