1699511642,9
1699598052,5
1699770845,5
1699857241,5
1699943653,2
1700030030,1
1700116443,4
1700202865,4
1700289223,3
1700462021,8
1700548451,19
1700634836,2
1700721246,2
1700807657,10
1700894058,46
1700980458,63
1701066868,25
