1673516775,22
1674367285,34
1674455475,22
1674541884,18
1674628285,26
1674714694,20
1674801082,31
1674887480,17
1674973872,18
1675060281,25
1675146682,21
1675233071,10
1675319481,12
1675405883,9
1675492281,3
