1674367285,144
1674455475,142
1674541884,143
1674628285,2605
1674714694,4278
1674801082,4398
1674887480,4433
1674973872,4440
1675060281,2314
1675146682,376
1675233071,143
1675319481,333
1675405883,143
1675492281,144
1675578681,144
1675665075,150
1675751474,142
1675837863,76
1676356254,62
1676442661,144
1676529061,142
1676615450,145
1676701857,144
1676788249,144
1676874662,142
1676961061,157
1677047454,139
1677133857,140
1677220262,143
1677306660,144
1677393061,144
1677479458,144
1677565859,145
1677652257,211
1677738657,144
1677825057,144
1677911460,153
1677997847,1584
1678084257,670
1678170666,144
1678257055,144
1678343445,386
1679569142,144
1679584407,144
1679589867,144
1679596494,144
1679602915,144
1679607956,144
1679639532,145
1679722309,144
1679808717,144
1679895117,109
1679981518,143
1680067912,144
1680154308,145
1680240714,144
1680327097,144
1680413504,261
1680499902,216
1680586299,216
1680672702,216
1680759104,212
1680845523,213
1680931899,215
1681018301,216
1681104713,215
1681191117,818
1681277516,632
1681363906,632
1681450306,630
1681536706,632
1681623105,632
1681709528,406
1681795909,216
1681882326,215
1681968706,225
1682055103,217
1682141505,216
1682227910,216
1682314324,216
1682400707,215
1682487105,216
1682573524,217
1682659898,224
1682746309,216
1682832700,216
1682919107,216
1683005499,216
1683091901,366
1683178309,216
1683264713,216
1683351101,215
1683437506,216
1683523904,232
1683610328,216
1683696716,244
1683783116,238
1683869508,217
1683955918,216
1684042308,216
1685544777,216
1685597496,216
1685683902,215
1685770303,214
1685856701,216
1685943100,215
1686029502,214
1686115904,216
1686202306,215
1686288711,215
1686375108,212
1686461512,215
1686547909,212
1686634309,213
1686720704,199
1686807105,215
1686893562,216
1686979954,216
1687066360,215
1687152774,216
1687239150,213
1687411953,211
1687498393,215
1687584774,206
1687671173,187
1687757568,216
1687843969,216
1687930377,216
1688016807,222
1688103218,216
1688189597,216
1688275996,197
1688362412,216
1688535215,216
1688621614,214
1688708029,216
1688794420,216
1688880821,216
1688967219,216
1689053626,163
1689140028,216
1689226424,216
1689312837,216
1689399195,216
1689485597,216
1689572000,216
1689658397,216
1689744807,216
1689831241,215
1689917640,216
1690004042,216
1690090404,216
1690176817,216
1690263240,216
1690349617,216
1690436012,216
1690522443,216
1690608808,216
1690695212,216
1690781617,216
1690868047,222
1690954421,86
