1712900232,3
1712986589,11
1713073014,2
1713159410,7
1713245803,7
1713332196,1
1713418604,9
1713505010,15
1713591405,6
1713677807,8
1713764197,10
1713850601,10
1713937016,8
1714023425,17
1714109816,5
