1637899638,6
1637986004,77
1638072517,905
1638158887,435
1638245235,303
1638331638,192
1639904549,159
1639907950,159
1639980923,141
1639983233,141
1639985995,141
1640059226,183
1640080313,183
1640145685,240
1640232083,151
1640318424,122
1640404823,179
1640491284,105
1640577691,147
1640664024,147
1640750484,120
1640836884,1171
1640923223,159
1641009626,222
1641096084,117
1641182484,229
1641268824,185
1641355224,304
1641441684,145
1641528084,172
1641700884,321
1641787224,149
1641873686,159
1642305627,126
1642319122,126
1642392088,83
1642408942,83
1642478484,159
1642564885,118
1642651226,161
1642676514,161
1642769502,244
1642771604,244
1642805136,244
1642805851,244
1642824026,109
1642855125,109
1642910490,94
1642924655,94
1642934565,94
1642937864,94
1642996892,177
1643083292,355
1643169628,273
1643256090,116
1643342487,174
1643428827,246
1643515288,175
1643601634,183
1643622207,183
1643688028,190
1643708607,190
1643774489,1052
1643860889,195
1643947288,121
1644033629,118
1644120088,148
1644206493,154
1644292831,143
1644321030,143
1644388289,171
1644407490,171
1644474692,202
1644493888,202
1644561030,164
1644647492,213
1644733834,103
1644770508,103
1644820292,202
1644906689,161
1644993090,166
1645079499,228
1645165829,115
1645252290,229
1645338629,172
1645425030,103
1645467113,103
1645470826,103
1645511492,157
1645597892,158
1645684232,187
1645770629,56
