1726292115,8
1726378512,6
1726464916,3
1726551329,51
1726637718,14
1726724132,52
1726810515,49
1726896925,92
1726983322,30
1727069719,143
1727156114,16
1727242538,106
1727328917,56
1727415326,60
1727501713,3
