1640923223,37
1641009626,100
1641096084,104
1641182484,251
1641268824,246
1641355224,258
1641441684,181
1641528084,165
1641700884,265
1641787224,172
1641873686,140
1642305627,215
1642319122,215
1642392088,83
1642408942,83
1642478484,125
