1690349617,45
1690436012,115
1690522443,39
1690608808,378
1690695212,136
1690781617,204
1690868047,320
1690954421,126
1691040818,1168
1691127250,164
1691213630,64
1691300015,48
1691386395,158
1691472821,122
