1668560577,1
1674973872,3
1676874662,3
1682659898,1
1683955918,1
1687671173,2
1687757568,2
1688275996,2
1692855167,1
1693978362,2
1694064749,4
1694842363,2
1702794843,3
1703831661,4
1704004443,1
1704350037,3
1704436450,4
1704522832,3
1704609231,4
1704695681,5
1704782089,5
1704868474,3
1704954878,4
1705041294,2
1709015768,2
