1660113163,5
1660142439,5
1660199441,11
1660228849,11
1660285970,7
1660315250,7
1660372250,8
1660401521,8
1660458761,9
1660488049,9
1660545162,7
1660574449,7
1660717841,2
1660747248,2
1660804362,17
1660833647,17
1660890760,7
1660920046,7
1660977162,13
1661006455,13
1661063442,3
1661092854,3
1661149842,8
1661179125,8
1661236366,7
1661265647,7
1661322641,12
1661352051,12
1661409162,14
1661438449,14
1661495561,17
1661524735,17
1661581964,14
1661611239,14
1661668363,5
1661697647,5
1661700049,5
1661754784,7
1661784048,7
1661870448,1
1661927560,4
1661956724,4
1662013964,5
1662043246,5
