1658903439,2
1658932848,2
1658989840,10
1659019246,10
1659076365,8
1659105646,8
1659162770,8
1659192044,8
1659249159,8
1659278470,8
1659335565,1
1659364847,1
1659767561,1
1659796845,1
1659853840,6
1659883130,6
1659940369,10
1659969638,10
