1652941964,13
1653028353,24
1653114753,27
1653201159,26
1653287558,25
1653373954,34
1653460234,31
1653546755,33
1653633154,16
1653719553,26
1653805957,29
1653892236,25
1653978755,27
1654065033,26
1654151553,25
1654237831,23
