1680931899,8
1681018301,8
1681104713,7
1681191117,6
1681277516,6
1681363906,5
1681450306,7
1681536706,8
1681709528,5
1681795909,5
1681968706,3
1682055103,3
1682141505,5
1682400707,6
1682487105,18
1682573524,4
1682659898,2
1682746309,3
1682832700,6
1682919107,13
1683091901,4
1683178309,2
1683264713,3
1683351101,9
