1713245803,15
1713332196,14
1713418604,18
1713505010,17
1713591405,15
1713677807,20
1713764197,22
1713850601,19
1713937016,19
1714023425,19
1714109816,24
1714196216,13
1714282602,13
1714369033,18
1714455398,17
1714541804,19
1714714600,15
1714801009,17
1714887409,12
1714973810,19
1715060210,26
1715146632,14
1715233058,18
1715319563,24
1715405851,16
1715492244,22
