1649572354,4
1649658750,4
1650004228,6
1650263549,4
1650436229,2
1651300352,1
1652855561,1
1653028353,4
1653114753,4
1654583555,4
1655533836,4
1655879557,32
1656916357,1
1658557962,4
1658587247,4
1658989840,6
1659019246,6
1659162770,2
1659192044,2
1659508368,2
1659537519,2
1659681160,2
1659710444,2
1659767561,3
1659796845,3
1660545162,4
1660574449,4
1660717841,12
1660747248,12
1660890760,1
1660920046,1
1660977162,2
1661006455,2
1661063442,2
1661092854,2
1661236366,10
1661265647,10
1661322641,2
1661352051,2
1661409162,2
1661438449,2
1661495561,2
1661524735,2
1661581964,2
1661611239,2
1661668363,6
1661697647,6
1661700049,6
1661927560,4
1661956724,4
1662013964,6
1662043246,6
1662359559,2
1662388727,2
1662445958,2
1662475124,2
1662618758,6
1662647931,6
1662705164,4
1662734437,4
1662877847,4
1662907237,4
1662964357,2
1662993645,2
1663050638,2
1663080057,2
1663137169,2
1663166448,2
1663223564,4
1663252844,4
1663309969,4
1663339237,4
1663396358,8
1663425653,8
1663482759,2
1663512042,2
1663569159,6
1663598447,6
1663655565,4
1663684725,4
1663741840,6
1663771124,6
1663828239,1
1663857524,1
1663914640,6
1663943934,6
1664001039,6
1664030318,6
1664087438,36
1664116722,36
1664173842,2
1664203127,2
1664260251,4
1664289537,4
1664519554,2
1664548711,2
1668350533,2
1668355972,2
1668356757,2
1668360810,2
1674541884,4
1674628285,28
1674973872,28
1675146682,28
1675751474,4
1676356254,42
1676442661,25
1676529061,25
1676615450,48
1676701857,28
1676788249,3
1676874662,24
1676961061,19
1677047454,21
1677133857,6
1677306660,6
1677393061,24
1677565859,28
1677738657,63
1677911460,29
1677997847,23
1678084257,5
1678170666,20
1678257055,44
1679569142,6
1679584407,6
1679589867,6
1679596494,6
1679602915,6
1679607956,6
1679722309,7
1680067912,7
1680240714,4
1680327097,6
1680413504,6
1680845523,5
1680931899,3
1681018301,28
1681104713,5
1681191117,41
1681363906,5
1681450306,21
1681536706,44
1682227910,9
1682314324,4
1682659898,7
1682746309,23
1682832700,1
1683091901,4
1683178309,2
1683264713,5
1683351101,4
1683437506,1
1683610328,1
1683783116,1
1683869508,2
1683955918,50
1684042308,54
1685544777,6
1685597496,1
1685770303,3
1685856701,2
1686029502,3
1686202306,1
1686288711,5
1686807105,41
1687066360,3
1687152774,2
1687498393,6
1687584774,1
1688275996,4
1688621614,1
1688794420,2
1689312837,1
1689572000,45
1689831241,1
1690004042,1
1690090404,1
1690176817,45
1690695212,10
1690781617,2
1691213630,3
1691300015,1
1691472821,4
1691732035,883
1691904834,2
1691991184,2
1692077570,882
1692336773,1
1692423180,1
1692768764,6
1692941568,1
1693027980,1
1693200777,5
1693287141,1
1693459952,3
1694064749,6
1694151151,2
1694237547,1
1694323959,19
1694410362,4
1694496769,402
1694583178,17
1694928766,3
1695015165,68
1695360784,6
1696397621,49
1696484041,1
1696570435,3
1696656841,3
1697607247,883
1697866447,71
1698125641,878
1698474862,884
1698561261,877
1698734051,876
1698906836,4
1699079643,5
1699511642,2
1699684453,639
1699770845,7
1700289223,1
1700634836,3
1700721246,2
1700894058,6
1701239661,2
1701585234,1
1701671642,4
1702103633,1
1702362833,3
1703140439,2
1703226865,1
1703313245,1
1704004443,1
1704436450,8
1704522832,2
1704782089,2
1705041294,2
1705646097,2
1705818877,8
1705991686,2
1706596552,4
1706682956,2
1706855781,2
1706942169,6
1707374158,3
1707633370,3
1707719770,2
1708065403,2
1708151763,2
1708324568,4
1708670174,2
1708842965,1
1708929366,5
1709102173,8
1709275007,3
1709361374,1
1709447776,1
1710570954,1
1711089395,17
1711175767,8
1711262153,2
1711607758,3
1711694155,3
1711863379,2
1712209001,4
1712295387,1
1712554571,1
1713073014,1
1713677807,20
1713937016,1
1714282602,4
1714714600,5
1714801009,2
1714887409,1
1715146632,3
1718170636,31
1718257047,104
1718429818,53
1718516215,22
1718948217,5
1719207304,8
1719984907,103
1720416929,103
1720503328,99
1720935328,6
1721367339,2
1721885729,4
1721972116,52
1722576933,2
1722663315,99
1722922512,2
1723354509,5
1723440921,99
1723872909,4
1724823316,4
1725082506,1
1725341717,906
1725687306,4
1725773707,2
1725946519,3
1726032920,3
1726119315,8
1726205705,3
1726464916,3
1726637718,3
1726896925,4
1727069719,2
1727156114,106
1727242538,9
1727328917,3
1727415326,3
1727933723,2
1728020122,3
1728106547,2
1728624938,2
1728797737,4
1729056925,4
1729575323,4
1729748135,2
1730442925,2
1732084532,2
1732343726,439
1732775733,2
