1645165829,14
1645252290,96
1645338629,92
1645425030,117
1645467113,117
1645470826,117
1645511492,144
1645597892,210
1645684232,193
1645770629,140
1645857150,143
1645943553,229
1646029893,248
1646116237,435
1646202760,129
1646289033,161
1646375551,150
1646461951,268
1646548229,4
