1679584314,2
1679589759,2
1679596397,2
1679602819,2
1679607852,2
1679639432,2
1679981431,1
1680240629,2
1680845434,2
1682400635,2
1683437432,1
1683610233,2
1686288634,1
1686807032,1
1687498241,1
1688016640,2
1688103041,2
1688275841,1
1688535044,1
1688621445,1
1688707844,1
1688794245,1
1688880644,1
1689053441,1
1689139840,1
1689226241,1
1689312653,1
1689831044,2
1689917446,2
1690003846,2
1690263047,1
1691818247,1
1691991040,1
1692077440,1
1692163831,1
1692250233,1
1692336633,1
1692423035,1
1692509432,1
1692768633,1
1692855035,1
1692941433,1
1693027839,1
1693200633,1
1693978232,1
1694323834,1
1694410234,1
1696483842,2
1696656645,2
1696743043,2
1696829444,2
1696915841,1
1697002242,1
1697088641,1
1697261447,1
1697347842,1
1698993045,1
1699079441,1
1699165843,1
1699252253,4
1699338639,1
1699425038,1
1699597838,1
1699684239,1
1699770639,1
1700202637,2
1700548240,1
1700721041,1
1700807441,2
1700893840,1
1700980240,1
1701239442,1
1701412240,2
1702017040,1
1702621850,1
1703053840,1
1703226640,1
1703831442,1
1704436239,1
1705041045,2
1708410644,1
1711089048,1
