1658039438,1
1658068726,1
1658125843,12
1658155247,12
1658212362,7
1658241661,7
1658298758,10
1658328052,10
1658385041,9
1658414447,9
1658471560,11
1658500847,11
1658557962,8
1658587247,8
1658644360,12
1658673645,12
1658730762,10
1658760045,10
1658817160,16
1658846453,16
1658903439,12
1658932848,12
1658989840,5
1659019246,5
1659076365,8
1659105646,8
1659162770,8
1659192044,8
1659249159,5
1659278470,5
1659335565,4
1659364847,4
1659421963,6
1659451128,6
1659508368,7
1659537519,7
1659594767,8
1659624049,8
1659681160,10
1659710444,10
1659767561,9
1659796845,9
1659853840,6
1659883130,6
1659940369,7
1659969638,7
1660026647,3
1660056049,3
1660113163,7
1660142439,7
1660199441,6
1660228849,6
1660285970,6
1660315250,6
1660372250,11
1660401521,11
1660458761,5
1660488049,5
1660545162,6
1660574449,6
1660631564,5
1660660730,5
