1645943553,32
1646029893,13
1646289033,96
1646375551,40
1646461951,10
1646980230,166
1647066751,5
1647153150,1
1647239550,2
1647412352,12
1647498752,12
1647844355,7
1647930752,1
1648362752,1
1648535442,77
1648621952,160
