1729575323,57
1729661730,12
1729748135,9
1729834546,9
1729924541,47
1730010943,109
1730097332,67
1730183730,53
1730270141,22
1730356536,54
1730442925,191
1730529338,10
1730615759,47
1730702128,226
1730788525,151
1730874965,46
1730961326,55
1731047722,151
1731134141,150
1731220531,47
