1657866760,10
1657896040,10
1657953158,173
1657982325,173
1658039438,115
1658068726,115
1658125843,181
1658155247,181
1658212362,126
1658241661,126
1658298758,315
1658328052,315
1658385041,241
1658414447,241
1658471560,430
1658500847,430
1658557962,107
1658587247,107
1658644360,366
1658673645,366
1658730762,213
1658760045,213
1658817160,150
1658846453,150
1658903439,161
1658932848,161
1658989840,132
1659019246,132
1659076365,276
1659105646,276
1659162770,120
1659192044,120
1659249159,21
1659278470,21
