1646634751,5
1646721161,2
1646807431,3
1646893952,14
1646980230,5
1647066751,5
1647153150,8
1647239550,4
1647325952,5
1647412352,3
1647498752,7
1647585151,5
1647757954,3
1647844355,4
1647930752,5
1648017150,11
1648103550,6
1648189831,3
1648276229,7
1648362752,3
1648449033,4
1648535442,5
1648621952,3
1648708231,3
1648794750,5
1648881149,7
1648967561,2
1649053832,5
1649140351,1
