1690867847,1
1691127048,1
1691645448,1
1691731846,1
1691818247,2
1691904646,1
1691991040,2
1692077440,1
1692163831,1
1692250233,1
1692336633,1
1692423035,1
1692509432,1
1692682233,1
1692768633,1
1692855035,1
1692941433,1
1693027839,1
1693200633,1
1694151031,1
1694323834,1
