1718256669,1
1718343064,1
1719120657,2
1719293448,26
1720071049,1
1722403851,1
1723095049,1
1725859849,1
1726119049,3
1726378249,1
1728106253,1
1728192652,1
1728365452,2
1728711053,2
1730874652,5
1732516250,1
1733121060,1
