1663050638,19
1663080057,19
1663137169,122
1663166448,122
1663223564,78
1663252844,78
1663309969,655
1663339237,655
1663396358,229
1663425653,229
1663482759,77
1663512042,77
1663569159,15
1663598447,15
1663655565,7
1663684725,7
1663741840,32
1663771124,32
1663828239,67
1663857524,67
1663914640,15
1663943934,15
