1711261844,1
1711776649,1
1712122273,1
1712208660,2
1712295052,1
1712381450,2
1712467850,2
1712554251,2
1712640649,2
1712727049,2
1712813449,2
1712899850,3
1712986252,2
1713072653,3
1713159052,1
1713245451,4
1713331852,2
1713418260,3
1713504653,2
1713591051,2
1713677452,1
1713763854,1
1713850252,2
1713936654,3
1714023055,3
1714109453,2
1714195863,2
1714282254,2
1714368659,3
1714455052,2
1714541454,1
1714714252,1
1714800655,3
1714887055,2
1714973453,2
1715059856,3
1715146260,3
1715232665,2
1715319121,1
1715405462,2
1715491864,1
1718022118,2
1718083857,2
1718170259,1
1718256669,2
1718343064,2
1718429457,2
1718515859,2
1718602257,2
1718688659,2
1718775058,2
1718861458,2
1718947860,1
1719034258,2
1719120657,2
1719207047,1
1719293448,4
1719379849,3
1719466247,2
1719552647,1
1719639047,2
1719725446,3
1719811846,3
1719898247,1
1719984647,1
1720071049,1
1720157449,2
1720243849,2
1720330245,1
1720416649,1
1720503049,3
1720589449,2
1720675849,3
1720762249,2
1720935048,1
1721021447,2
1721107850,3
1721194248,2
1721280649,1
1721367051,1
1721453448,2
1721539849,2
1721626248,1
1721712651,4
1721799049,1
1721885449,1
1721971847,1
1722058248,2
1722144650,2
1722231051,1
1722317451,1
1722403851,1
1722490250,1
1722576648,2
1722663050,1
1722749450,1
1722835849,1
1722922247,1
1723008649,1
1723095049,1
1723181449,1
1723267849,1
1723354248,1
1723440651,2
1723613452,1
1723699847,1
1723786250,1
1723872647,1
1723959048,1
1724045446,1
1724131846,1
1724218249,1
1724304649,1
1724391048,1
1724477449,1
1724563847,1
1724650249,1
1724736648,1
1724823048,1
1724995846,1
1725082248,1
1725168647,1
1725255050,2
1725341448,1
1725427848,1
1725514248,1
1725600651,1
1725687049,1
1725773450,1
1725859849,1
1725946251,1
1726032651,2
1726119049,1
1726205448,1
1726291851,1
1726378249,1
1726464648,1
1726551051,1
1726637450,2
1726723852,1
1726810249,1
1726896651,1
1726983051,1
1727069449,2
1727242251,1
1727328651,1
1727501449,1
1727587850,1
1727674250,2
1727760651,1
1727847052,1
1727933451,1
1728019853,1
1728106253,1
1728192652,1
1728279054,1
1728365452,1
1728451854,1
1728538253,3
1728624654,1
1728711053,1
1728883856,1
1728970254,1
1729056653,1
1729143053,2
1729229452,1
1729315851,1
1729402253,1
1729488653,1
1729575053,2
1729661454,1
1729747853,1
1729834253,1
1730010649,1
1730097050,1
1730183452,1
1730269853,1
1730356254,1
1730442652,1
1730529053,8
1730615453,5
1730701851,1
1730788251,1
1730874652,1
1730961053,1
1731047452,1
1731133849,1
1731220250,1
1731306649,1
1731393053,1
1731479453,1
1731652254,1
1731738652,1
1731825055,1
1731997855,1
1732257053,1
1732343452,1
1732429852,1
1732516250,1
1732602651,1
1732775454,1
1732861859,1
1732948260,1
1733034659,1
1733293861,1
