1645252290,8
1645338629,11
1645425030,18
1645467113,18
1645470826,18
1645511492,16
1645597892,9
1645684232,12
1645770629,12
1645857150,13
1645943553,18
1646029893,13
1646116237,17
1646202760,22
1646289033,20
1646375551,15
1646461951,14
1646548229,10
