1688016807,108
1688103218,625
1688189597,290
1688275996,305
1688362412,102
1688535215,303
1688621614,260
1688708029,574
1688794420,763
1688880821,155
1688967219,518
1689053626,202
1689140028,212
1689226424,546
