1720935328,107
1721021712,92
1721108139,340
1721194539,112
1721280942,107
1721367339,117
1721453736,170
1721540139,116
1721626512,117
1721712930,212
1721799317,113
1721885729,127
1721972116,110
1722058513,126
1722144941,311
1722231340,36
