1660545162,12
1660574449,12
1660631564,29
1660660730,29
1660717841,14
1660747248,14
1660804362,12
1660833647,12
1660890760,12
1660920046,12
1660977162,18
1661006455,18
1661063442,13
1661092854,13
1661149842,22
1661179125,22
1661236366,14
1661265647,14
1661322641,24
1661352051,24
1661409162,23
1661438449,23
1661495561,15
1661524735,15
1661581964,19
1661611239,19
1661668363,13
1661697647,13
1661700049,13
1661754784,15
1661784048,15
1661870448,8
