1708670174,11
1708756568,364
1708842965,234
1708929366,110
1709015768,120
1709102173,244
1709188566,441
1709275007,179
1709361374,99
1709447776,103
1709534155,124
1709620564,138
1709706962,118
1709793367,141
