1660890760,6
1660920046,6
1660977162,20
1661006455,20
1661063442,3
1661092854,3
1661236366,74
1661265647,74
1661322641,19
1661352051,19
1661409162,832
1661438449,832
1661495561,2
1661524735,2
1661581964,94
1661611239,94
1661668363,93
1661697647,93
1661700049,93
1661870448,2
1661927560,16
1661956724,16
1662013964,25
1662043246,25
1662100359,4
1662129642,4
