1657607566,4
1657693957,6
1657780357,4
1657803090,4
1657804447,4
1657809517,4
1657866760,8
1657896040,8
1657953158,5
1657982325,5
1658039438,11
1658068726,11
1658125843,19
1658155247,19
1658212362,10
1658241661,10
1658298758,14
1658328052,14
1658385041,7
1658414447,7
1658471560,9
1658500847,9
1658557962,8
1658587247,8
1658644360,11
1658673645,11
1658730762,21
1658760045,21
1658817160,12
1658846453,12
1658903439,2
1658932848,2
1658989840,4
1659019246,4
