1688707844,1
1688794245,1
1688880644,1
1688967042,2
1689053441,2
1689139840,2
1689226241,2
1689312653,2
1689744640,1
1689831044,2
1689917446,2
1690003846,2
1690263047,2
1690522245,2
1690867847,2
1729229452,1
