1680413504,55
1680499902,247
1680586299,115
1680672702,248
1680759104,258
1680845523,251
1680931899,308
1681018301,249
1681104713,256
1681191117,132
1681277516,568
1681363906,130
1681450306,194
1681536706,125
1681623105,307
1681709528,75
