1688016807,17
1688103218,19
1688189597,22
1688275996,24
1688362412,8
1688535215,7
1688621614,8
1688708029,8
1688794420,4
1688880821,6
1688967219,6
1689053626,6
1689140028,14
1689226424,7
1689312837,6
1689399195,7
1689485597,3
1689572000,12
1689658397,20
1689744807,2
1689831241,4
1689917640,12
1690004042,8
1690090404,3
1690176817,11
1690263240,9
1690349617,10
1690436012,7
