1685544777,204
1685597496,113
1685683902,215
1685770303,887
1685856701,122
1685943100,198
1686029502,325
1686115904,262
1686202306,149
1686288711,494
1686375108,212
1686461512,825
1686547909,244
1686634309,255
1686720704,98
1686807105,281
1686893562,220
1686979954,138
1687066360,693
1687152774,139
1687239150,512
1687411953,492
1687498393,177
1687584774,523
1687671173,86
1687757568,48
1687843969,13
