1663223564,4
1663252844,4
1663309969,2
1663339237,2
1663396358,54
1663425653,54
1663482759,2
1663512042,2
1663569159,2
1663598447,2
1663655565,36
1663684725,36
1663741840,85
1663771124,85
1663828239,2
1663857524,2
1663914640,18
1663943934,18
1664001039,4
1664030318,4
1664087438,2
1664116722,2
1664173842,1
1664203127,1
1664346641,1
1664375951,1
1664519554,12
1664548711,12
