1681191117,285
1681277516,190
1681363906,318
1681450306,134
1681536706,156
1681623105,243
1681709528,283
1681795909,155
1681882326,158
1681968706,153
1682055103,109
1682141505,151
1682227910,248
1682314324,261
1682400707,137
1682487105,149
