1679584314,1
1679589759,1
1679596397,1
1679602819,1
1679607852,1
1679639432,1
1679981431,1
1680845434,1
1682573432,1
1683437432,1
1683610233,1
1687498241,1
1688016640,1
1688103041,1
1688362240,1
1688535044,1
1688621445,1
1688707844,1
1688794245,1
1688880644,1
1688967042,1
1689053441,1
1689139840,1
1689226241,1
1689312653,1
1689831044,1
1689917446,1
1690003846,1
1690263047,1
1690522245,1
1690867847,1
1691127048,1
1691645448,1
1691731846,1
1691991040,1
1692077440,1
1692163831,1
1692250233,1
1692336633,1
1692423035,1
1692509432,1
1692682233,1
1692768633,1
1692855035,1
1692941433,1
1693027839,1
1693114233,1
1693200633,1
1693978232,6
1694323834,3
1694496634,3
1694583036,5
1694669436,4
1694755834,5
1694842234,5
1694928634,5
1695187834,2
1695274234,5
1695360634,4
1695533434,4
1695619839,4
1695965441,3
1696483842,3
1696656645,3
1696743043,3
1696829444,3
1696915841,3
1697002242,3
1697088641,3
1697261447,2
1697347842,2
1697520642,2
1697607044,2
1697693444,2
1697866244,2
1697952644,2
1698211845,2
1698474646,1
1698561046,1
1698647445,1
1698733843,1
1698993045,3
1699079441,1
1699165843,1
1699252253,5
1699338639,1
1699425038,1
1699684239,1
1699770639,1
1699943446,1
1700029845,1
1700116239,1
1700202637,2
1700461838,1
1700548240,1
1700634640,2
1700721041,1
1700807441,2
1700893840,1
1700980240,1
1701066641,1
1701239442,1
1701412240,2
1702017040,1
1702621850,1
1703226640,1
1703831442,1
1704436239,3
1704954645,1
1705645846,2
1708410644,2
1708583454,2
1711089048,1
1728970254,1
1730442652,1
