1706250646,1
1706855451,1
1707460251,1
1708065054,1
1708669850,1
1709274654,1
1710484249,1
1711089048,1
1714368659,1
1719811846,1
1720762249,1
1721280649,1
1724304649,1
1727933451,1
1730529053,1
1732689052,1
