1697607044,4
1697693444,4
1697866244,4
1697952644,4
1698211845,4
1698474646,4
1698561046,4
1698647445,5
1698733843,5
1698993045,7
1699079441,4
1699165843,4
1699252253,21
1699338639,2
1699425038,3
1699597838,3
1699684239,3
1699770639,4
1699943446,3
1700116239,3
1700202637,6
1700548240,2
1700721041,2
1700807441,4
1700893840,2
1700980240,2
1701066641,2
1701239442,3
1701412240,4
1701930638,2
1702017040,3
1702621850,2
1703226640,2
1703831442,2
1704436239,6
1705041045,2
1705645846,2
1706250646,5
1708583454,5
1711521045,1
1711607445,1
1729229452,1
1731997855,3
1732516250,1
