1679584314,1
1679589759,1
1679596397,1
1679602819,1
1679607852,1
1679639432,1
1679981431,1
1680240629,1
1680845434,1
1681623032,1
1682573432,1
1690522245,1
1692250233,1
1692336633,1
1692423035,1
1692509432,1
1692682233,1
1692768633,1
1694842234,1
1694928634,1
1695187834,1
1695274234,1
1695360634,1
1695533434,1
1695619839,1
1696483842,1
1696656645,1
1696743043,1
1696829444,1
1697002242,1
1697088641,1
1697175042,1
1697261447,1
1697347842,1
1697866244,1
1697952644,1
1698993045,1
1699079441,1
1699165843,1
1699252253,6
1700721041,1
1700807441,2
1700893840,1
1700980240,1
1704436239,1
1705041045,1
