1637726914,1
1637813369,1
1639980923,1
1639983233,1
1639985995,1
1640059226,11
1640080313,11
1642651226,17
1642676514,17
1642769502,7
1642771604,7
1642805136,7
1642805851,7
1643256090,17
1643342487,7
1643860889,19
1643947288,5
1644474692,19
1644493888,19
1644561030,5
1645079499,18
1645165829,5
1645425030,2
1645467113,2
1645470826,2
1647412352,24
1651300352,3
1652596232,112
1652682759,15
1652855561,1
1653892236,57
1653978755,57
1654324351,66
1654756356,23
1655533836,3
1655793158,3
1655879557,7
1655965955,10
1656052365,2
1656225155,3
1656311556,18
1656397956,5
1657002637,24
1660631564,40
1660660730,40
1661236366,39
1661265647,39
1661495561,6
1661524735,6
1668081545,4
1668560577,2
1671629111,4
1671630664,4
1671632450,4
1671634011,4
1676788249,2
1679981518,5
1680845523,9
1681191117,2
1694151151,1
1694237547,1
1694323959,2
1694410362,2
1695792808,2
1696052011,1
1696311219,3
1696397621,2
1696570435,1
1696656841,2
1696916048,2
1697434425,4
1699338847,1
1699425254,1
1700030030,2
1700634836,1
1700894058,1
1703745239,1
1714714600,1
1720676127,4
1720762554,44
1720935328,55
1721021712,56
1721108139,43
1721194539,33
1721280942,24
1721367339,33
1721453736,18
1721540139,10
1721626512,9
1721712930,10
1721799317,14
1721885729,3
1721972116,14
1722058513,6
1722144941,7
1722231340,7
1722317737,9
1722404147,3
1722490541,5
1722576933,3
1722663315,3
1722749743,6
1722836105,8
1722922512,7
1723008910,7
1723095317,5
1723181712,8
1723268105,5
1723354509,6
1723440921,7
1723527316,3
1723613721,7
1723700119,3
1723786513,4
1723872909,3
1723959316,3
1724045707,4
1724132118,2
1724218520,5
1724304925,3
1724391319,4
1724477730,2
1724564111,2
1724736906,16
1724823316,1
1724909717,3
1724996108,2
1725082506,2
1725168909,2
1725255319,14
1725341717,3
1725428109,2
1725514506,14
1725600914,3
1725687306,3
1725773707,1
1726119315,3
1726292115,15
1726378512,2
1726464916,5
1726551329,15
1726637718,2
1726724132,15
1726810515,5
1726896925,8
1726983322,2
1727069719,2
1727156114,6
1727242538,2
1727415326,1
1727588116,1
1727674524,1
1727760922,4
1727847333,3
1727933723,29
1728020122,27
1728106547,32
1728192945,24
1728279336,5
1728452151,41
1728538537,54
1728624938,25
1728711328,34
1728797737,43
1728884126,34
1728970539,307
1729056925,351
1729143336,237
1729229724,177
1729316123,202
1729402521,146
1729488952,321
1729575323,183
1729661730,225
1729748135,270
1729834546,154
1729924541,145
1730010943,306
1730097332,304
1730183730,124
1730270141,272
1730356536,232
1730442925,111
1730529338,89
1730615759,123
1730702128,230
1730788525,206
1730874965,266
1730961326,224
1731047722,186
1731134141,150
1731220531,154
1731306938,153
1731393338,146
1731479747,117
1731566125,116
1731652532,126
1731738930,132
1731825326,106
1731911726,132
1731998131,104
1732084532,108
1732170946,103
1732257343,96
1732343726,91
1732430128,108
1732516530,117
1732602931,98
1732689332,106
1732775733,75
1732862185,86
1732948585,93
1733034986,70
1733121412,90
1733207816,103
1733294214,90
