1640923223,9
1641009626,24
1641096084,20
1641182484,27
1641268824,32
1641355224,30
1641441684,36
1641528084,27
1641700884,146
1641787224,32
1641873686,21
1642305627,38
1642319122,38
1642392088,40
1642408942,40
1642478484,31
