1696484041,197
1696570435,288
1696656841,200
1696743237,866
1696829644,330
1696916048,114
1697002439,142
1697088838,202
1697175238,744
1697261644,296
1697348050,112
1697434425,236
1697520844,518
1697607247,193
1697693651,140
1697780021,90
1697866447,189
1697952848,510
1698039229,297
1698125641,99
1698212053,335
1698298423,437
1698384826,154
1698474862,157
1698561261,139
1698647660,131
1698734051,213
1698820440,113
1698906836,115
1698993260,99
1699079643,191
1699166057,93
1699252467,1061
1699338847,275
1699425254,199
1699511642,154
1699598052,480
1699684453,210
1699770845,252
1699857241,220
1699943653,832
1700030030,100
1700116443,105
1700202865,105
1700289223,449
1700375637,114
1700462021,19
1700548451,88
1700634836,157
1700721246,121
1700807657,94
1700894058,296
1700980458,87
1701066868,206
1701239661,13
