1659508368,9
1659537519,9
1659594767,15
1659624049,15
1659681160,24
1659710444,24
1659767561,35
1659796845,35
1659853840,31
1659883130,31
1659940369,25
1659969638,25
1660026647,35
1660056049,35
1660113163,12
1660142439,12
1660199441,28
1660228849,28
1660285970,37
1660315250,37
1660372250,33
1660401521,33
1660458761,36
1660488049,36
1660545162,26
1660574449,26
1660631564,39
1660660730,39
1660717841,15
1660747248,15
1660804362,11
1660833647,11
