1657607566,20
1657693957,29
1657780357,9
1657803090,9
1657804447,9
1657809517,9
1657866760,38
1657896040,38
1657953158,13
1657982325,13
1658039438,22
1658068726,22
1658125843,32
1658155247,32
1658212362,44
1658241661,44
1658298758,43
1658328052,43
1658385041,23
1658414447,23
1658471560,11
1658500847,11
1658557962,9
1658587247,9
