1679584314,1
1679589759,1
1679596397,1
1679602819,1
1679607852,1
1679639432,1
1679981431,1
1680845434,1
1681623032,1
1682573432,1
1685544705,1
1685770233,2
1686288634,1
1687239039,1
1687498241,1
1688016640,1
1688103041,1
1698211845,1
1698474646,1
1698561046,1
1698647445,1
1698733843,1
1698993045,1
1699165843,1
1699252253,1
1699425038,1
1699597838,2
1699684239,1
1699770639,1
1699943446,1
1700116239,1
1700202637,2
1700548240,1
1700807441,2
1700893840,1
1700980240,2
1701066641,1
1701239442,1
1701412240,2
1702017040,1
1702621850,1
1703226640,1
1703831442,1
1712813449,4
