1695533586,1
1695619990,2
1695706406,2
1695792808,5
1695879218,2
1695965624,13
1696052011,2
1696138408,19
1696224807,3
1696311219,5
1696397621,5
1696484041,4
1696570435,3
1696656841,7
1696743237,17
1696829644,11
1696916048,3
1697002439,6
1697088838,12
1697175238,2
1697348050,5
1697434425,19
1697520844,2
1697607247,4
