1692250233,24
1692336633,24
1692423035,24
1692509432,24
1692682233,22
1692768633,24
1692855035,24
1692941433,24
1693027839,24
1693114233,1
1693200633,24
1693978232,25
1694151031,9
1694323834,7
1694410234,6
1694496634,7
1694583036,28
1694669436,25
1694755834,25
1694842234,25
1694928634,25
1695187834,19
1695274234,26
1695360634,29
1695533434,25
1695619839,25
1695879053,3
1695965441,24
1696483842,22
1696570241,22
1696656645,22
1696743043,21
1696829444,22
1696915841,20
1697002242,20
1697088641,20
1697175042,19
1697261447,24
1697347842,20
1697520642,18
1697607044,18
1697693444,18
1697866244,18
1697952644,18
1698039045,1
1698211845,16
1698474646,20
1698561046,17
1698647445,16
1698733843,16
1698906644,1
1698993045,26
1699079441,14
1699165843,14
1699252253,84
1699338639,3
1699425038,12
1699597838,24
1699684239,12
1699770639,13
1699857040,12
1699943446,10
1700116239,10
1700202637,20
1700548240,8
1700721041,8
1700807441,16
1700893840,8
1700980240,8
1701066641,6
1701239442,6
1701412240,12
1701671441,2
1702017040,6
1702621850,6
1703226640,6
1703831442,6
1704349840,5
1704436239,19
1704522640,6
1705041045,11
1708410644,22
1708583454,11
1711261844,1
1713591051,1
1730356254,1
1730961053,2
1731479453,1
1732516250,1
