1720071331,53
1720157731,107
1720244127,63
1720330509,62
1720416929,10
1720503328,11
1720589730,18
1720676127,17
1720762554,147
1720935328,15
1721021712,56
1721108139,21
1721194539,16
1721280942,14
1721367339,9
