1662100359,6
1662129642,6
1662186760,9
1662216045,9
1662273039,4
1662302447,4
1662359559,7
1662388727,7
1662445958,8
1662475124,8
1662532358,4
1662561643,4
1662618758,4
1662647931,4
1662705164,3
1662734437,3
1662791558,5
1662820724,5
1662877847,2
1662907237,2
1662964357,2
1662993645,2
1663050638,5
1663080057,5
1663137169,19
1663166448,19
1663223564,2
1663252844,2
1663309969,8
1663339237,8
1663396358,5
1663425653,5
1663482759,3
1663512042,3
1663569159,3
1663598447,3
