1687757568,18447
1687843969,34460
1687930377,34469
1688016807,34437
1688103218,34520
1688189597,34414
1688275996,13
1688362412,16400
1688535215,34499
1688621614,34492
1688708029,34481
1688794420,34320
1688880821,34430
1688967219,34460
1689053626,24730
1689140028,34404
1689226424,34409
1689312837,34478
1689399195,34424
1689485597,34426
1689572000,34408
1689658397,34438
1689744807,34470
1689831241,34434
1689917640,34519
1690004042,34386
1690090404,34427
1690176817,34429
1690263240,33717
1690349617,34482
1690436012,34460
1690522443,34471
1690608808,34392
1690695212,34423
1690781617,34426
1690868047,34438
1690954421,34481
1691040818,34462
1691127250,34524
1691213630,34390
1691300015,34482
1691386395,33365
1691472821,26890
1691559206,34410
1691645653,34466
1691732035,34444
1691818443,34366
1691904834,34426
1691991184,34396
1692077570,34409
1692163972,33611
1692250382,34435
1692336773,33061
1692423180,6
1692509573,7
1692595944,4
1692682368,25862
1692768764,34483
1692855167,34483
1692941568,34483
1693027980,34332
1693114356,34444
1693200777,34475
1693287141,22020
1693373568,22826
1693459952,34307
1693546364,34391
1693632754,34095
1693719144,34295
1693805540,34063
1693891949,34190
1693978362,34379
1694064749,34294
1694151151,34430
1694237547,33970
1694323959,34188
1694410362,28041
1694496769,34468
1694583178,34341
1694669562,34419
1694755972,34291
1694842363,34465
1694928766,34489
1695015165,34408
1695187975,17770
1695274380,34505
1695360784,34504
1695447164,34518
1695533586,34516
1695619990,34485
1695706406,34550
1695792808,34524
1695879218,34540
1695965624,34270
1696052011,34493
1696138408,34528
1696224807,34497
1696311219,34517
1696397621,34491
1696484041,34555
1696570435,34519
1696656841,34474
1696743237,34524
1696829644,34534
1696916048,34516
1697002439,34534
1697088838,34454
1697175238,34415
1697261644,34408
1697348050,34411
1697434425,34343
1697520844,34335
1697607247,34294
1697693651,34371
1697780021,33792
1697866447,34230
1697952848,34324
1698039229,34097
1698125641,34252
1698212053,34277
1698298423,34233
1698384826,33956
1698474862,33663
1698561261,33341
1698647660,33957
1698734051,33921
1698820440,33801
1698906836,33994
1698993260,34027
1699079643,33451
1699166057,33547
1699252467,27899
1699338847,33234
1699425254,32803
1699511642,32140
1699598052,33326
1699684453,34393
1699770845,34502
1699857241,34310
1699943653,34236
1700030030,34385
1700116443,34408
1700202865,18289
1700289223,18
1700375637,12
1700462021,16
1700548451,24
1700634836,15
1700721246,11
1700807657,6
1700894058,5
1700980458,2
1701066868,2
1701239661,51
1701326039,26
1701412459,3
