1679584314,2
1679589759,2
1679596397,2
1679602819,2
1679607852,2
1679639432,3
1679722230,1
1679981431,2
1680240629,1
1680845434,2
1682314235,2
1682573432,1
1683264631,1
1683610233,2
1688016640,2
1688103041,2
1688362240,1
1688535044,1
1688621445,1
1688707844,1
1688794245,1
1688880644,1
1688967042,1
1689053441,1
1689139840,1
1689226241,1
1689312653,1
1689744640,1
1689831044,1
1689917446,1
1690003846,1
1690263047,1
1690522245,1
1690867847,1
1691127048,1
1691645448,1
1691731846,1
1691904646,1
1691991040,1
1692682233,4
1692768633,4
1692855035,4
1692941433,4
1693027839,4
1693114233,2
1693200633,4
1693978232,3
1694323834,1
1694410234,2
1694583036,3
1694669436,2
1694755834,3
1694842234,3
1694928634,3
1695187834,3
1695274234,3
1695360634,3
1695533434,3
1695619839,3
1695965441,2
1696483842,2
1696656645,2
1696743043,2
1696829444,2
1696915841,2
1697002242,2
1697088641,2
1697261447,2
1697347842,2
1697520642,1
1697607044,1
1697693444,1
1697866244,1
1697952644,1
1698211845,1
1698474646,1
1698561046,1
1698647445,1
1698733843,1
1698993045,6
1699079441,3
1699165843,3
1699252253,15
1699338639,2
1699425038,2
1699597838,4
1699684239,2
1699770639,2
1699943446,1
1700116239,1
1700202637,2
1700548240,1
1700721041,4
1700807441,8
1700893840,4
1700980240,4
1701066641,3
1701239442,3
1701412240,6
1702017040,3
1702621850,3
1702881040,1
1703140241,1
1703226640,3
1703831442,3
1704349840,1
1704436239,1
1707373846,1
1707633051,4
1713504653,1
1725168647,1
1726551051,2
1730874652,1
