1632865288,33
1632865728,33
1632895259,33
1632895514,33
1632896536,33
1632896830,33
1632899465,33
1632899826,33
1632900569,33
1632901370,33
1632905420,33
1632905809,33
1632905992,33
1632906169,33
1632908748,33
1632910297,33
1632911500,33
1633002207,33
1633002642,33
1633003092,33
1633003807,33
1633003939,33
1633004043,33
1633004145,33
1633004450,33
1633004629,33
1633011592,33
1633012170,33
1633424853,33
1633425260,33
1633426381,33
1633438298,33
1633447113,33
1633447579,33
1633450019,33
1633450294,33
1633451411,33
1633453768,33
1633455974,33
1633465406,33
1633470048,33
1633493137,33
1633579792,33
1633586493,33
1633665955,31
1633752572,31
1633838749,31
1633925120,31
1634011669,31
1634098043,31
1634184301,31
1634270811,31
1634357266,31
1634443543,31
1634529985,31
1634616315,31
1634789575,31
1634875595,31
1634961923,31
1635048347,31
1635134716,31
1635221173,31
1635307557,31
1635393938,31
1635501074,31
1635501252,31
1635502617,31
1635504735,31
1635505573,31
1635506054,31
1636369291,31
1636370487,31
1636372858,31
1636981187,31
1636981767,31
1636984849,31
1637156695,31
1637157188,31
1639148197,33
1639149608,33
1639236008,32
1639322407,32
1639408807,32
1639495207,32
1639581607,32
1639664847,32
1639667437,32
1639990926,33
1639994288,33
1640067308,33
1640069354,33
1640072175,33
1640145609,33
1640166554,33
1640232009,33
1640318408,33
1640404809,33
1640491209,33
1640577609,33
1640664009,33
1640750408,33
1640836809,33
1640923208,33
1641009608,33
1641096012,33
1641182409,33
1641268808,33
1641355208,33
1641441609,33
1641528008,33
1641614409,33
1641700811,33
1641787209,33
1641873609,33
1641960009,33
1642046409,34
1642087677,34
1642090275,34
1642132876,34
1642146375,34
1642219209,34
1642232707,34
1642305610,34
1642319107,34
1642392011,34
1642405508,34
1642408874,34
1642478411,34
1642495208,34
1642564809,34
1642651209,34
1642737609,34
1642762757,34
1642855747,34
1642857795,34
1642891507,34
1642892226,34
1642910408,34
1642941374,34
1642996809,34
1643011027,34
1643020815,34
1643024114,34
1643083211,34
1643169612,34
1643256009,34
1643342410,34
1643428809,34
1643515210,34
1643601608,34
1643688008,34
1643708527,34
1643774409,34
1643794928,34
1643860809,34
1643947209,34
1644033607,34
1644120010,34
1644206409,33
1644292809,33
1644379211,33
1644407408,33
1644474608,33
1644493810,33
1644561010,33
1644580208,33
1644647408,33
1644733810,33
1644820213,33
1644856695,33
1644906609,33
1644993007,33
1645079409,33
1645165808,34
1645252208,34
1645338608,34
1645425008,34
1645511408,34
1645553356,34
1645557074,34
1645597808,34
1645684208,34
1645770608,34
1645857008,34
1645943408,34
1646029812,34
1646116209,34
1646202608,34
1646289018,34
1646375412,34
1646461809,34
1646548209,34
1646634609,34
1646721009,34
1646807409,34
1646893809,34
1646980209,34
1647066608,34
1647153011,34
1647239409,34
1647325808,34
1647412210,34
1647498611,34
1647585009,34
1647671408,35
1647844208,35
1647930608,35
1648017008,35
1648103408,35
1648189808,35
1648276209,35
1648362608,35
1648449010,35
1648535412,35
1648621808,35
1648708209,36
1648794608,35
1648881008,35
1648967407,35
1649053809,35
1649140210,35
1649226608,35
1649313009,36
1649399408,35
1649485808,35
1649572208,35
1649658612,35
1649745007,35
1649831408,35
1649917822,35
1650004208,35
1650090608,35
1650177008,35
1650263410,35
1650349809,35
1650436208,35
1650522608,35
1650609008,35
1650695409,35
1650781808,35
1650868211,35
1650954608,35
1651041008,35
1651127408,35
1651213809,35
1651300208,35
1651386609,35
1651473008,35
1651559408,35
1651645812,35
1651732213,35
1651818611,35
1651905008,35
1651991409,35
1652077808,35
1652164208,35
1652250608,35
1652337012,35
1652423407,35
1652509808,35
1652596208,35
1652682608,35
1652769009,35
1652855408,35
1652941809,35
1653028209,35
1653114608,35
1653201009,35
1653287409,35
1653373808,35
1653460209,35
1653546608,35
1653633008,35
1653719409,35
1653805808,35
1653892212,35
1653978610,35
1654065009,35
1654151409,35
1654237810,35
1654324208,35
1654410609,35
1654497009,35
1654583409,35
1654669809,35
1654756209,37
1654842610,35
1654929009,35
1655015410,35
1655101810,35
1655188209,36
1655274609,36
1655361009,36
1655447410,36
1655533809,36
1655620210,36
1655706608,36
1655793008,36
1655879409,36
1655965808,36
1656052208,36
1656138608,36
1656225008,36
1656311409,36
1656397808,36
1656484208,36
1656570608,38
1656657008,36
1656829808,36
1656916213,36
1657002609,36
1657089008,36
1657175409,36
1657261809,36
1657348209,36
1657434608,36
1657521008,36
1657607408,36
1657693808,36
1657780208,36
1657866608,36
1657888929,36
1657890625,36
1657895888,36
1657953008,36
1657982288,36
1658039408,36
1658068687,36
1658125808,36
1658155087,36
1658212209,36
1658241487,36
1658298609,36
1658327888,36
1658385008,36
1658414288,36
1658471408,36
1658500687,36
1658557808,36
1658587088,36
1658644208,36
1658673488,36
1658730609,36
1658759888,36
1658817008,36
1658846288,36
1658903408,36
1658932688,36
1658989809,36
1659019088,36
1659076209,36
1659105487,36
1659162609,36
1659191888,36
1659249009,36
1659278288,36
1659335408,36
1659364690,36
1659421808,36
1659451088,36
1659508210,36
1659537488,36
1659594610,36
1659623888,36
1659681010,36
1659710291,36
1659767408,36
1659796687,36
1659853809,36
1659883088,36
1659940209,36
1659969488,36
1660026609,36
1660055888,36
1660113009,36
1660142295,36
1660199410,36
1660228688,36
1660285809,36
1660315088,36
1660372214,36
1660401488,36
1660458609,36
1660487888,36
1660545009,36
1660574288,36
1660631409,36
1660660689,36
1660717810,36
1660747089,36
1660804209,36
1660833489,36
1660890609,36
1660919889,36
1660977009,36
1661006288,36
1661063412,36
1661092690,36
1661149809,36
1661179089,36
1661236210,36
1661265488,36
1661322610,36
1661351888,36
1661409009,36
1661438289,36
1661495410,36
1661524688,37
1661581809,37
1661611089,37
1661668210,37
1661697489,37
1661754609,37
1661783816,37
1661786024,37
1661841029,37
1661870287,38
1661956688,38
1662013807,38
1662043087,37
1662100208,37
1662129487,30
1662186607,30
1662215887,30
1662273008,30
1662302288,30
1662359407,30
1662388688,30
1662445808,30
1662475087,30
1662532208,30
1662561487,30
1662618608,30
1662647888,29
1662705009,29
1662734287,29
1662791408,29
1662820688,29
1662877808,29
1662907088,29
1662964208,29
1662993488,29
1663050608,29
1663079887,29
1663137008,29
1663166288,29
1663223409,29
1663252688,29
1663309808,29
1663339088,29
1663396208,29
1663425488,29
1663482608,29
1663511888,29
1663569009,29
1663598288,29
1663655408,29
1663684689,29
1663741808,29
1663771089,29
1663828209,29
1663857488,29
1663914608,29
1663943888,29
1664001008,29
1664030289,29
1664087408,29
1664116688,29
1664173808,29
1664203088,29
1664260209,29
1664289488,29
1664346608,29
1664375889,29
1664433009,29
1664462299,29
1664519409,29
1664548689,0
1664605809,0
1664635087,0
1664692208,0
1664721488,0
1668167816,60
1668436891,60
1668442268,60
1668443128,60
1668447102,60
1668560548,61
1668646940,58
1668733344,55
1671620811,48
1671622017,48
1671622377,48
1671624392,48
1671628426,48
1671632865,48
1671635108,48
1671670810,48
1671695289,48
1671699407,48
1671715463,48
1671717006,48
1671718728,48
1671720283,48
1673603112,47
1674453614,47
1674541811,47
1674628212,45
1674714612,45
1674801017,43
1674887411,43
1674973812,43
1675060211,43
1675146611,43
1675233012,43
1675319411,43
1675405812,43
1675492211,43
1675578612,43
1675665012,43
1675751410,43
1675837810,43
1675924211,42
1676010610,42
1676097011,42
1676183410,42
1676269810,42
1676356210,42
1676442609,42
1676529010,42
1676615411,44
1676701811,43
1676788209,43
1676874610,43
1676961011,44
1677047410,44
1677133809,44
1677220210,44
1677306610,44
1677393010,44
1677479410,44
1677565810,44
1677652210,44
1677738611,44
1677825010,44
1677911410,44
1677997810,44
1678084211,44
1678170610,44
1678257020,45
1678343410,45
1678429809,45
1678465430,45
1678516252,45
1678602611,45
1678689010,45
1678775411,45
1678809859,44
1678811699,44
1678861811,44
1678948220,44
1679000769,44
1679034646,44
1679121011,44
1679293811,44
1679380210,44
1679466610,44
1679553010,38
1679584808,38
1679639410,38
1679649177,38
1679654365,38
1679655510,38
1679670682,38
1679676091,38
1679682753,38
1679689131,38
1679694171,38
1679725811,38
1679808611,38
1679895011,38
1679981412,38
1680067811,38
1680154209,38
1680240610,38
1680327009,38
1680413409,38
1680499808,38
1680586209,38
1680672608,38
1680759009,38
1680845409,38
1680931810,38
1681018209,38
1681104610,38
1681191009,38
1681277410,38
1681363809,38
1681450210,38
1681536611,38
1681623010,38
1681709409,38
1681795810,38
1681882210,38
1681968610,38
1682055010,38
1682141409,38
1682227809,38
1682314210,38
1682400611,38
1682487010,38
1682573409,38
1682659809,38
1682746209,38
1682832609,38
1682919009,38
1683005410,38
1683091810,38
1683178210,39
1683264610,39
1683351010,39
1683437409,39
1683523810,39
1683610209,39
1683696611,39
1683783010,39
1683869410,39
1683955810,39
1684042210,39
1684128611,39
1685631069,37
1685683809,37
1685770211,37
1685856609,37
1685943011,37
1686029409,37
1686115808,37
1686202209,37
1686288609,38
1686375010,38
1686461410,38
1686547809,38
1686634209,38
1686720608,38
1686807009,38
1686893408,38
1686979813,38
1687066213,38
1687152612,38
1687239011,38
1687325412,38
1687498212,38
1687584613,38
1687671012,38
1687757412,38
1687843811,38
1687930212,38
1688016612,38
1688103012,38
1688189413,38
1688275822,38
1688362213,38
1688448612,38
1688621413,38
1688707813,38
1688794212,38
1688880614,38
1688967012,38
1689053412,38
1689139813,38
1689226213,38
1689312612,38
1689399016,38
1689485412,38
1689571812,38
1689658213,38
1689744612,38
1689831013,38
1689917413,38
1690003813,38
1690090213,38
1690176613,38
1690263013,38
1690349414,38
1690435813,38
1690522214,38
1690608613,38
1690695014,38
1690781413,38
1690867814,38
1690954214,38
1691040614,38
1691127014,38
1691213414,38
1691299813,38
1691386214,38
1691472613,38
1691559014,38
1691645413,37
1691731815,37
1691818214,37
1691904615,37
1691991015,37
1692077410,37
1692163811,37
1692250210,37
1692336610,38
1692423010,37
1692509412,37
1692595810,37
1692682212,37
1692768611,37
1692855011,37
1692941412,37
1693027810,37
1693114215,37
1693200610,37
1693287011,36
1693373410,36
1693459814,36
1693546210,36
1693632611,36
1693719019,36
1693805410,36
1693891809,36
1693978210,37
1694064610,36
1694151010,36
1694237410,36
1694323810,36
1694410211,36
1694496610,36
1694583011,36
1694669411,36
1694755813,36
1694842211,37
1694928612,37
1695015010,37
1695101411,36
1695274210,36
1695360611,36
1695447011,36
1695533410,36
1695619810,36
1695706215,36
1695792613,36
1695879013,36
1695965423,36
1696051812,36
1696138213,36
1696224612,36
1696311013,36
1696397413,36
1696483814,36
1696570213,36
1696656613,36
1696743014,36
1696829413,36
1696915813,37
1697002213,36
1697088613,36
1697175013,36
1697261413,36
1697347817,36
1697434214,36
1697520613,36
1697607013,36
1697693414,36
1697779814,36
1697866213,36
1697952614,36
1698039015,36
1698125414,36
1698211814,36
1698298214,36
1698384614,36
1698471014,36
1698561014,36
1698647414,36
1698733814,36
1698820213,36
1698906613,35
1698993014,35
1699079414,35
1699165813,35
1699252213,35
1699338618,35
1699425014,35
1699511414,35
1699597813,35
1699684213,35
1699770614,35
1699857014,35
1699943414,35
1700029818,35
1700116220,35
1700202614,35
1700289014,35
1700375414,35
1700461815,35
1700548215,37
1700634615,37
1700721014,37
1700807415,37
1700893815,37
1700980215,37
1701066615,37
1701153015,37
1701325815,37
1701412215,37
1701498614,37
1701585014,37
1701671414,37
1701757814,37
1701844214,37
1702017013,37
1702103414,37
1702189815,37
1702276215,37
1702362625,37
1702449014,37
1702535414,37
1702621817,37
1702708224,37
1702794615,37
1702881014,37
1702967414,37
1703053814,37
1703140214,37
1703226615,37
1703313014,37
1703399415,37
1703485815,37
1703658615,37
1703745015,37
1703831415,37
1703917815,37
1704004215,37
1704090615,37
1704177015,37
1704263414,37
1704349814,37
1704436214,37
1704522614,37
1704609014,37
1704695415,37
1704781817,37
1704868216,37
1704954617,37
1705041016,37
1705127417,37
1705213818,37
1705386619,37
1705473017,37
1705559418,37
1705645817,37
1705732217,37
1705818618,37
1705905017,37
1705991418,37
1706077817,37
1706164218,37
1706250618,37
1706337018,37
1706423418,37
1706509818,37
1706596218,35
1706682619,35
1706769018,35
1706855425,35
1706941818,35
1707028218,35
1707114626,35
1707201018,35
1707287418,35
1707373817,35
1707460217,34
1707546619,34
1707633018,34
1707719418,34
1707805817,35
1707892219,35
1707978618,35
1708065017,35
1708151418,35
1708237818,35
1708324219,35
1708410618,35
1708497013,35
1708583417,35
1708669819,34
1708756219,34
1708842619,34
1708929018,34
1709015419,34
1709101818,34
1709188224,34
1709274619,33
1709361018,34
1709447418,34
1709533817,34
1709620218,34
1709706618,34
1709793019,34
1709879419,34
1710052219,34
1710138619,34
1710225018,34
1710311419,34
1710397819,34
1710484221,34
1710570618,35
1710657018,35
1710743418,35
1710829818,35
1710916218,35
1711002617,35
1711089019,35
1711175417,35
1711261819,35
1711348217,35
1711434619,35
1711521018,35
1711607419,35
1711693818,36
1711780218,36
1711863018,36
1711949419,36
1712035819,36
1712122219,36
1712208640,36
1712295029,36
1712381419,36
1712467818,36
1712554220,36
1712640619,36
1712727018,36
1712813418,36
1712899818,36
1712986219,40
1713072620,40
1713159020,40
1713245420,40
1713331820,40
1713418219,40
1713504618,40
1713591020,40
1713677419,40
1713763820,40
1713850220,40
1713936619,40
1714023020,40
1714109421,40
1714195820,40
1714282219,40
1714368620,40
1714455020,40
1714541419,40
1714627820,40
1714800619,40
1714887021,40
1714973420,40
1715059819,40
1715146220,40
1715232621,40
1715319019,40
1715405448,40
1715491822,40
1715578222,40
1718108480,39
1718170220,39
1718256621,39
1718343031,39
1718429425,39
1718515820,39
1718602220,39
1718688621,39
1718775020,39
1718861421,39
1718947820,39
1719034221,39
1719120620,39
1719207020,39
1719293414,39
1719379816,39
1719466215,39
1719552614,39
1719639015,39
1719725414,39
1719811814,39
1719898214,39
1719984614,39
1720071015,36
1720157416,36
1720243816,36
1720330216,36
1720416614,36
1720503016,36
1720589416,36
1720675815,36
1720762216,36
1720848616,36
1721021415,36
1721107814,36
1721194217,36
1721280615,36
1721367015,36
1721453416,36
1721539815,36
1721626215,36
1721712615,36
1721799016,36
1721885415,36
1721971815,36
1722058214,36
1722144616,36
1722231016,36
1722317415,36
1722403816,36
1722490216,36
1722576615,36
1722663015,36
1722749416,36
1722835815,36
1722922216,35
1723008614,35
1723095016,35
1723181416,35
1723267815,35
1723354216,35
1723440616,35
1723527016,35
1723613416,35
1723699817,35
1723786214,35
1723872615,35
1723959015,35
1724045416,35
1724131815,35
1724218214,35
1724304616,35
1724391016,35
1724477415,35
1724563816,35
1724650215,35
1724736616,35
1724823016,35
1724909416,35
1724995816,35
1725082216,35
1725168615,35
1725255016,35
1725341416,35
1725427815,35
1725514215,35
1725600615,33
1725687015,33
1725773415,33
1725859817,33
1725946215,33
1726032617,33
1726119017,33
1726205415,33
1726291815,33
1726378217,33
1726464615,33
1726551015,33
1726637416,33
1726723816,33
1726810217,33
1726896616,33
1726983016,33
1727069416,33
1727155816,33
1727242216,33
1727328616,33
1727415017,33
1727501418,33
1727587816,33
1727674215,33
1727760615,33
1727847017,33
1727933418,33
1728019815,33
1728106216,33
1728192616,33
1728279016,33
1728365416,32
1728451816,33
1728538216,33
1728624616,33
1728711017,33
1728797417,33
1728883817,33
1728970218,33
1729056617,33
1729143016,33
1729229416,33
1729315816,33
1729402216,33
1729488616,33
1729575016,33
1729661416,33
1729747818,33
1729834216,34
1729920616,34
1730010617,34
1730097015,34
1730183417,34
1730269817,34
1730356216,34
1730442618,34
1730529017,34
1730615417,34
1730701817,34
1730788218,34
1730874617,34
1730961017,34
1731047417,34
1731133818,34
1731220217,34
1731306617,34
1731393017,34
1731479417,34
1731565817,34
1731652217,34
1731738617,34
1731825015,34
1731911418,34
1731997815,34
1732084219,34
1732170617,34
1732257016,34
1732343417,34
1732429816,34
1732516217,34
1732602615,35
1732689017,35
1732775416,35
1732861818,34
1732948221,34
1733034620,34
1733121020,34
1733207421,34
1733293822,34
1733380222,33
