1642805117,1
1642805834,1
1642824017,1
1642855092,1
1644561017,2
1644733822,1
1644770413,1
1644993017,1
1645252217,1
1645467072,1
1645470791,1
1645511417,1
1645770616,1
1645857016,7
1646029817,1
1646116216,1
1648362619,1
1648794617,1
1648967418,1
1649140217,1
1649313017,1
1650349817,1
1650436217,1
1650522617,1
1650609029,1
1650695416,8
1650781820,1
1650868217,1
1650954617,2
1651041017,1
1651127418,1
1651213817,1
1651300219,1
1651386622,1
1651473017,1
1651559421,2
1651645827,1
1651818617,1
1651905018,1
1651991417,1
1652077818,1
1652164218,1
1652250621,1
1652423417,1
1652509817,1
1652596217,1
1652769018,1
1652855418,1
1653028217,1
1653201018,1
1653546617,1
1653633018,1
1653719418,1
1653805821,1
1653892219,1
1654065018,3
1654151419,1
1654237818,1
1654324218,2
1654410618,2
1654497019,1
1654669819,1
1654756220,1
1654842619,1
1654929020,1
1655015420,1
1655101820,1
1655188220,1
1655361020,1
1655533820,1
1655620219,1
1655706620,1
1655879419,1
1657866623,1
1657895901,1
1658298621,1
1658327901,1
1661236224,1
1661265501,1
1661870301,1
1661927420,1
1661956700,1
1662359420,2
1662388701,2
1662964220,1
1662993501,1
1663166301,2
1663914621,1
1663943902,1
1679639432,2
1680759032,1
1681018231,1
1681709434,1
1682055034,1
1685856632,1
1686029431,1
1686202233,5
1686720636,3
1696397445,1
1698993045,1
1699511438,1
1700721041,1
1710916249,1
1711434657,1
1712295052,1
1712813449,1
1713331852,1
1718602257,1
1718688659,1
1719293448,1
1720503049,5
1721971847,1
1723354248,1
1724477449,1
1726119049,1
1726723852,1
1727328651,1
1727587850,1
1728279054,1
1731306649,1
1732516250,1
