1637726914,22001
1637813369,70796
1638158887,4949
1638245235,58856
1638331638,2
1639980923,8
1639983233,8
1639985995,8
1640059226,6
1640080313,6
1640145685,6
1640232083,2
1640318424,2
1640404823,2
1640491284,2
1640577691,2
1640664024,2
1640750484,2
1640836884,2
1640923223,2
1641009626,2
1641096084,2
1641182484,2
1641268824,2
1641355224,2
1641441684,2
1641528084,2
1641700884,2
1641787224,2
1641873686,2
1642392088,8
1642408942,8
1642478484,4
1642564885,2
1642651226,2
1642676514,2
1642805851,4
1642824026,6
1642855125,6
1642910490,8
1642924655,8
1642934565,8
1642937864,8
1642996892,16
1643083292,2
1643169628,2
1643256090,11
1643342487,2
1643428827,2
1643515288,2
1643601634,2
1643622207,2
1643688028,4
1643708607,4
1643774489,4
1643860889,4
1643947288,2
1644033629,2
1644120088,2
1644206493,2
1644292831,2
1644321030,2
1644388289,4
1644407490,4
1644474692,4
1644493888,4
1644561030,4
1644647492,2
1644733834,2
1644770508,2
1644820292,14
1644906689,2
1644993090,2
1645079499,2
1645165829,2
1645252290,2
1645338629,2
1645425030,2
1645467113,2
1645470826,2
1645511492,6
1645597892,2
1645684232,2
1645770629,2
1645857150,2
1645943553,2
1646029893,2
1646116237,2
1646202760,2
1646289033,2
1646375551,2
1646461951,2
1646548229,2
1646634751,2
1646721161,1995
1646807431,2
1646893952,8136
1646980230,2
1647066751,2
1647153150,2
1647239550,2
1647325952,2
1647412352,2
1647498752,2
1647585151,2
1647757954,2
1647844355,2
1647930752,2
1648017150,2
1648103550,2
1648189831,2
1648276229,2
1648362752,2
1648449033,2
1648535442,2
1648621952,2
1648708231,2
1648794750,2
1648881149,2
1648967561,2
1649053832,2
1649140351,2
1649226751,2
1649313029,2
1649399549,2
1649485949,2
1649572354,2
1649658750,2
1649745150,2
1649831565,2
1649917950,2
1650004228,2
1650090628,2
1650177150,2
1650263549,2
1650349831,2
1650436229,2
1650522756,2
1650609163,2
1650695550,2
1650781953,2
1650868349,2
1650954630,2
1651041030,2
1651127552,2
1651213951,2
1651300352,2
1651386755,2
1651473034,2
1651559564,2
1651645850,2
1651732362,2
1651818753,2
1651905153,2
1651991564,2
1652077954,2
1652164360,2
1652250764,2
1652337032,2
1652423553,2
1652509832,2
1652596232,2
1652682759,2
1652769160,2
1652855561,2
1652941964,2
1653028353,2
1653114753,24
1653201159,6
1653287558,2141
1653373954,566
1653460234,39
1653546755,2
1653633154,339
1653719553,2
1653805957,2
1653892236,2
1653978755,180
1654065033,964
1654151553,629
1654237831,309
1654324351,2
1654410631,2
1654497153,2
1654583555,1352
1654669837,2456
1654756356,2408
1654842756,2402
1654929156,2402
1655015436,2402
1655101838,2418
1655188357,2475
1655274636,2503
1655361158,2402
1655447555,2402
1655533836,2402
1655620256,2402
1655706645,2402
1655793158,2452
1655879557,2402
1655965955,2402
1656052365,2402
1656138754,2402
1656225155,2402
1656311556,2436
1656397956,2402
1656484356,2402
1656570758,2408
1656743558,2400
1656829841,2402
1656916357,2402
1657002637,2508
1657089163,2402
1657175559,2402
1657261838,2402
1657348240,2402
1657434758,2402
1657521164,2402
1657607566,2402
1657693957,2402
1657780357,2402
1657803090,2402
1657804447,2402
1657809517,2402
1657866760,2410
1657896040,2410
1657953158,2404
1657982325,2404
1658039438,2404
1658068726,2404
1658125843,2404
1658155247,2404
1658212362,2407
1658241661,2407
1658298758,2404
1658328052,2404
1658385041,2404
1658414447,2404
1658471560,2404
1658500847,2404
1658557962,2404
1658587247,2404
1658644360,2404
1658673645,2404
1658730762,2404
1658760045,2404
1658817160,2404
1658846453,2404
1658903439,2404
1658932848,2404
1658989840,2404
1659019246,2404
1659076365,2404
1659105646,2404
1659162770,2404
1659192044,2404
1659249159,2404
1659278470,2404
1659335565,2404
1659364847,2404
1659421963,2404
1659451128,2404
1659508368,2404
1659537519,2404
1659594767,2404
1659624049,2404
1659681160,2404
1659710444,2404
1659767561,2404
1659796845,2404
1659853840,2404
1659883130,2404
1659940369,2404
1659969638,2404
1660026647,2404
1660056049,2404
1660113163,2404
1660142439,2404
1660199441,2404
1660228849,2404
1660285970,2405
1660315250,2405
1660372250,2404
1660401521,2404
1660458761,2404
1660488049,2404
1660545162,2404
1660574449,2404
1660631564,2404
1660660730,2404
1660717841,2404
1660747248,2404
1660804362,2404
1660833647,2404
1660890760,2404
1660920046,2404
1660977162,2404
1661006455,2404
1661063442,2404
1661092854,2404
1661149842,2404
1661179125,2404
1661236366,2473
1661265647,2473
1661322641,2404
1661352051,2404
1661409162,2404
1661438449,2404
1661495561,2404
1661524735,2404
1661581964,2404
1661611239,2404
1661668363,2404
1661697647,2404
1661700049,2404
1661754784,2406
1661784048,2406
1661870448,2404
1661927560,2404
1661956724,2404
1662013964,2404
1662043246,2404
1662100359,2404
1662129642,2404
1662186760,2404
1662216045,2404
1662273039,2404
1662302447,2404
1662359559,2404
1662388727,2404
1662445958,2404
1662475124,2404
1662532358,2404
1662561643,2404
1662618758,2409
1662647931,2409
1662705164,2404
1662734437,2404
1662791558,2404
1662820724,2404
1662877847,2404
1662907237,2404
1662964357,2404
1662993645,2404
1663050638,2404
1663080057,2404
1663137169,2404
1663166448,2404
1663223564,2404
1663252844,2404
1663309969,2404
1663339237,2404
1663396358,2404
1663425653,2404
1663482759,2404
1663512042,2404
1663569159,2404
1663598447,2404
1663655565,2404
1663684725,2404
1663741840,2404
1663771124,2404
1663828239,2404
1663857524,2404
1663914640,2404
1663943934,2404
1664001039,2404
1664030318,2404
1664087438,2404
1664116722,2404
1664173842,2404
1664203127,2404
1664260251,2404
1664289537,2404
1664346641,2404
1664375951,2404
1664433041,2404
1664462320,2404
1664519554,6909
1664548711,6909
1664605833,14404
1664635111,14404
1668081545,1200
1668350533,1200
1668355972,1200
1668356757,1200
1668360810,1200
1668474184,4623
1668560577,7652
1668646979,8557
1671629111,6959
1671630664,6959
1671632450,6959
1671634011,6959
1673516775,7044
1674367285,7211
1674455475,7283
1674541884,7177
1674628285,7019
1674714694,7082
1674801082,6925
1674887480,7100
1674973872,7046
1675060281,7188
1675146682,7240
1675233071,7005
1675319481,7276
1675405883,6802
1675492281,6600
1675578681,6774
1675665075,6778
1675751474,6704
1675837863,3541
1676356254,4981
1676442661,6472
1676529061,6667
1676615450,6438
1676701857,6593
1676788249,6556
1676874662,6545
1676961061,6621
1677047454,6520
1677133857,6454
1677220262,6535
1677306660,6600
1677393061,6571
1677479458,6554
1677565859,33918
1677652257,81205
1677738657,7551
1677825057,7446
1677911460,7512
1677997847,7461
1678084257,7454
1678170666,7565
1678257055,7546
1678343445,7087
1679569142,5119
1679584407,5119
1679589867,5119
1679596494,5119
1679602915,5119
1679607956,5119
1679639532,3824
1679722309,2309
1679808717,2306
1679895117,1348
1679981518,2306
1680067912,2310
1680154308,2312
1680240714,2308
1680327097,2310
1680413504,2306
1680499902,2310
1680586299,2316
1680672702,2386
1680759104,2337
1680845523,2357
1680931899,2354
1681018301,2358
1681104713,2358
1681191117,2310
1681277516,2354
1681363906,2133
1681450306,1730
1681536706,1730
1681623105,1730
1681709528,1730
1681795909,1730
1681882326,1739
1681968706,1118
1682055103,866
1682141505,866
1682227910,868
1682314324,867
1682400707,866
1682487105,866
1682573524,866
1682659898,866
1682746309,866
1682832700,866
1682919107,866
1683005499,875
1683091901,866
1683178309,866
1683264713,866
1683351101,866
1683437506,866
1683523904,866
1683610328,506
1683696716,2
1683783116,2
1683869508,2
1683955918,2
1684042308,2
1685597496,2
1685683902,2
1685770303,2
1685856701,2
1685943100,2
1686029502,2
1686115904,2
1686202306,2
1686288711,2
1686375108,2
1686461512,2
1686547909,2
1686634309,2
1686720704,2
1686807105,2
1686893562,2
1686979954,2
1687066360,2
1687152774,2
1687239150,2
1687411953,2
1687498393,2
1687584774,2
1687671173,2
1687757568,2
1687843969,2
1687930377,2
1688016807,2
1688103218,2
1688189597,2
1688275996,2
1688362412,2
1688535215,2
1688621614,4
1688708029,2
1688794420,2
1688880821,2
1688967219,2
1689053626,2
1689140028,2
1689226424,2
1689312837,2
1689399195,2
1689485597,2
1689572000,2
1689658397,2
1689744807,2
1689831241,2
1689917640,2
1690004042,2
1690090404,2
1690176817,2
1690263240,2
1690349617,2
1690436012,2
1690522443,2
1690608808,2
1690695212,2
1690781617,2
1690868047,2
1690954421,2
1691040818,2
1691127250,2
1691213630,2
1691300015,2
1691386395,2
1691472821,2
1691559206,2
1691645653,2
1691732035,2
1691818443,2
1691904834,2
1691991184,2
1692077570,2
1692163972,2
1692250382,2
1692336773,2
1692423180,2
1692509573,2
1692595944,2
1692682368,2
1692768764,2
1692855167,2
1692941568,2
1693027980,2
1693114356,2
1693200777,2
1693287141,2
1693373568,2
1693459952,2
1693546364,2
1693632754,3
1693719144,2
1693805540,2
1693891949,2
1693978362,2
1694064749,2
1694151151,5
1694237547,2
1694323959,2
1694410362,2
1694496769,2
1694583178,2
1694669562,2
1694755972,2
1694842363,2
1694928766,2
1695015165,2
1695187975,2
1695274380,2
1695360784,2
1695447164,2
1695533586,2
1695619990,2
1695706406,2
1695792808,2
1695879218,42
1695965624,2
1696052011,2
1696138408,2
1696224807,2
1696311219,2
1696397621,2
1696484041,2
1696570435,2
1696656841,2
1696743237,2
1696829644,2
1696916048,2
1697002439,2
1697088838,2
1697175238,2
1697261644,2
1697348050,2
1697434425,2
1697520844,2
1697607247,2
1697693651,2
1697780021,2
1697866447,2
1697952848,2
1698039229,2
1698125641,2
1698212053,2
1698298423,3
1698384826,2
1698474862,2
1698561261,2
1698647660,2
1698734051,2
1698820440,2
1698906836,2
1698993260,2
1699079643,2
1699166057,2
1699252467,2
1699338847,2
1699425254,2
1699511642,2
1699598052,4
1699684453,2
1699770845,2
1699857241,2
1699943653,2
1700030030,2
1700116443,2
1700202865,2
1700289223,2
1700375637,2
1700462021,2
1700548451,2
1700634836,2
1700721246,2
1700807657,2
1700894058,2
1700980458,2
1701066868,2
1701239661,2
1701326039,2
1701412459,2
1701498834,2
1701585234,2
1701671642,2
1701758036,2
1701930831,2
1702017289,2
1702103633,2
1702190033,2
1702276447,2
1702362833,3
1702449238,2
1702535641,2
1702622071,2
1702708433,2
1702794843,2
1702881239,2
1702967665,2
1703054037,2
1703140439,2
1703226865,2
1703313245,2
1703399641,2
1703572441,2
1703658841,2
1703745239,2
1703831661,2
1703918046,2
1704004443,2
1704090847,2
1704177241,2
1704263638,2
1704350037,2
1704436450,2
1704522832,2
1704609231,2
1704695681,2
1704782089,2
1704868474,2
1704954878,2
1705041294,2
1705127674,2
1705300477,2
1705386877,2
1705473291,2
1705559692,2
1705646097,2
1705732479,2
1705818877,2
1705905294,2
1705991686,2
1706078101,2
1706164491,2
1706250972,2
1706337342,2
1706423747,2
1706510148,2
1706596552,2
1706682956,2
1706769366,2
1706855781,2
1706942169,2
1707028569,2
1707114964,2
1707201363,2
1707287760,2
1707374158,2
1707460602,2
1707546967,2
1707633370,2
1707719770,2
1707806171,2
1707892577,2
1707978960,2
1708065403,2
1708151763,2
1708238171,2
1708324568,2
1708410859,2
1708497318,2
1708583778,2
1708670174,2
1708756568,2
1708842965,2
1708929366,2
1709015768,2
1709102173,2
1709188566,2
1709275007,2
1709361374,2
1709447776,2
1709534155,2
1709620564,2
1709706962,2
1709793367,2
1709966169,2
1710052561,2
1710138969,2
1710225362,2
1710311773,2
1710398159,2
1710484595,2
1710570954,2
1710657364,2
1710743767,2
1710830176,2
1710916554,2
1711002952,2
1711089395,2
1711175767,2
1711262153,2
1711348567,2
1711434966,2
1711521368,2
1711607758,2
1711694155,2
1711776969,2
1711863379,2
1711949767,2
1712036181,2
1712122595,2
1712209001,2
1712295387,2
1712381761,2
1712468183,2
1712554571,2
1712640970,2
1712727387,2
1712813813,2
1712900232,2
1712986589,2
1713073014,2
1713159410,2
1713245803,2
1713332196,2
1713418604,2
1713505010,2
1713591405,2
1713677807,2
1713764197,2
1713850601,2
1713937016,2
1714023425,2
1714109816,2
1714196216,2
1714282602,2
1714369033,2
1714455398,2
1714541804,2
1714714600,2
1714801009,2
1714887409,2
1714973810,2
1715060210,2
1715146632,2
1715233058,2
1715319563,2
1715405851,2
1715492244,2
1718022496,2
1718084230,4
1718170636,2
1718257047,2
1718343427,2
1718429818,2
1718516215,2
1718602645,2
1718689022,2
1718775431,2
1718861831,2
1718948217,2
1719034629,2
1719121031,2
1719207304,2
1719293732,2
1719380130,2
1719466523,2
1719552933,2
1719639300,2
1719725705,2
1719812104,2
1719898511,2
1719984907,2
1720071331,2
1720157731,2
1720244127,2
1720330509,2
1720416929,2
1720503328,2
1720589730,2
1720676127,2
1720762554,2
1721021712,2
1721108139,2
1721194539,2
1721280942,2
1721367339,2
1721453736,2
1721540139,2
1721626512,2
1721712930,2
1721799317,2
1721885729,2
1721972116,2
1722058513,2
1722144941,2
1722231340,2
1722317737,2
1722404147,2
1722490541,2
1722576933,2
1722663315,2
1722749743,2
1722836105,2
1722922512,2
1723008910,2
1723095317,2
1723181712,2
1723268105,2
1723354509,2
1723440921,2
1723527316,2
1723613721,2
1723700119,2
1723786513,2
1723872909,2
1723959316,2
1724045707,2
1724132118,2
1724218520,2
1724304925,2
1724391319,2
1724477730,2
1724564111,2
1724650531,2
1724736906,2
1724823316,2
1724909717,2
1724996108,2
1725082506,2
1725168909,2
1725255319,2
1725341717,2
1725428109,2
1725514506,2
1725600914,2
1725687306,2
1725773707,2
1725860113,2
1725946519,2
1726032920,2
1726119315,2
1726292115,2
1726378512,2
1726464916,2
1726551329,2
1726637718,2
1726724132,2
1726810515,2
1726896925,2
1726983322,2
1727069719,2
1727156114,2
1727242538,2
1727328917,2
1727415326,2
1727501713,2
1727588116,2
1727674524,2
1727760922,2
1727847333,2
1727933723,2
1728020122,2
1728106547,2
1728192945,2
1728279336,2
1728365743,2
1728452151,2
1728538537,2
1728624938,2
1728711328,2
1728797737,2
1728884126,2
1728970539,2
1729056925,2
1729143336,2
1729229724,2
1729316123,2
1729402521,2
1729488952,2
1729575323,2
1729661730,2
1729748135,2
1729834546,2
1729924541,2
1730010943,2
1730097332,2
1730183730,2
1730270141,2
1730356536,2
1730442925,2
1730529338,2
1730615759,2
1730702128,2
1730788525,2
1730874965,2
1730961326,2
1731047722,2
1731134141,2
1731220531,2
1731306938,2
1731393338,2
1731479747,2
1731566125,2
1731652532,2
1731738930,2
1731825326,2
1731911726,2
1731998131,60
1732084532,2
1732170946,2
1732257343,2
1732343726,2
1732430128,2
1732516530,2
1732602931,2
1732689332,2
1732775733,4
1732862185,2
1732948585,2
1733034986,2
1733121412,2
1733207816,2
1733294214,2
