1697607247,6
1697693651,216
1697780021,271
1697866447,153
1697952848,229
1698039229,187
1698125641,186
1698212053,356
1698298423,322
1698384826,111
1698474862,203
1698561261,195
1698647660,226
1698734051,431
1698820440,975
1698906836,142
1698993260,131
1699079643,237
1699166057,268
1699252467,289
1699338847,334
1699425254,117
1699511642,21
1721885729,55
1721972116,40
