1657780357,7
1657803090,7
1657804447,7
1657809517,7
1657866760,5
1657896040,5
1657953158,7
1657982325,7
1658039438,9
1658068726,9
1658125843,16
1658155247,16
1658212362,7
1658241661,7
1658298758,24
1658328052,24
1658385041,13
1658414447,13
1658471560,15
1658500847,15
1658557962,7
1658587247,7
1658644360,9
1658673645,9
1658730762,15
1658760045,15
1658817160,11
1658846453,11
1658903439,9
1658932848,9
1658989840,8
1659019246,8
1659076365,8
1659105646,8
