1648967561,1
1649053832,4
1649140351,1
1649226751,4
1649313029,7
1649399549,9
1649485949,4
1649572354,3
1649658750,9
1649745150,1
1649831565,8
1649917950,8
1650004228,5
1650090628,5
1650177150,3
1650263549,1
