1637072812,6
1637122028,3
1637381227,11
1637554087,7
1637589848,7
1638158887,16
1638245235,32
1638331638,10
1640059226,91
1640080313,91
1640145685,1
1640232083,1
1640491284,2
1640750484,5
1640836884,2
1640923223,42
