1636895594,5
1636898490,6
1636900709,7
1637070326,5
1637070818,5
1637072812,15
1637122028,17
1637208446,10
1637294806,13
1637381227,21
1637467621,17
1637554087,12
1637589848,12
1637640464,19
1637726914,8
1637813369,19
1637899638,13
