1682919034,1
1687498241,2
1688016640,2
1688103041,3
1688362240,2
1688535044,1
1688621445,1
1688707844,1
1688794245,1
1688880644,1
1688967042,1
1689053441,1
1689139840,1
1689226241,1
1689312653,1
1689744640,1
1689831044,1
1689917446,1
1690003846,1
1690263047,1
1690522245,1
1690867847,1
1691127048,1
1691645448,1
1691818247,1
1691991040,1
1692077440,1
1692163831,1
1692250233,1
1692336633,1
1692423035,2
1692509432,2
1692682233,2
1692768633,2
1692855035,2
1692941433,2
1693027839,2
1693114233,1
1693200633,2
1693978232,1
1694323834,1
1694410234,1
1694583036,1
1694755834,1
1694842234,1
1694928634,1
1695187834,1
1695274234,2
1695360634,1
1695533434,1
1695619839,1
1695965441,1
1696483842,1
1696570241,1
1696656645,1
1696743043,1
1696829444,1
1697175042,1
1697261447,2
1697347842,2
1697520642,2
1697607044,3
1697693444,3
1697866244,3
1697952644,3
1698211845,3
1698474646,3
1698561046,3
1698647445,3
1698733843,3
1698993045,5
1699079441,3
1699165843,3
1699252253,15
1699338639,2
1699425038,3
1699597838,4
1699684239,3
1699770639,3
1699943446,3
1700116239,3
1700202637,6
1700548240,2
1700721041,2
1700807441,4
1700893840,2
1700980240,2
1701066641,2
1701239442,2
1701412240,4
1702017040,2
1702621850,2
1703226640,2
1703831442,2
1704349840,3
1704436239,2
1706855451,1
1708410644,1
1713504653,1
1730874652,2
