1699943653,28
1700030030,241
1700116443,194
1700202865,318
1700289223,165
1700375637,430
1700462021,131
1700548451,120
1700634836,201
1700721246,178
1700807657,196
1700894058,86
1700980458,101
1701066868,248
1701239661,99
1701326039,106
1701412459,233
1701498834,448
1701585234,207
1701671642,229
1701758036,258
1701930831,250
1702017289,184
1702103633,156
1702190033,104
1702276447,100
1702362833,106
1702449238,53
