1654669837,10
1654756356,6
1654842756,7
1654929156,6
1655015436,7
1655101838,9
1655188357,6
1655274636,8
1655361158,17
1655447555,7
1655533836,8
1655620256,14
1655706645,9
1655793158,11
1655879557,16
1655965955,1
