1694410234,1
1694583036,2
1694669436,2
1694755834,2
1694842234,2
1694928634,2
1695187834,2
1695274234,2
1695360634,2
1695533434,2
1695619839,2
1700202637,2
1700548240,1
1700721041,1
1700807441,2
1700893840,1
1700980240,1
1705645846,1
1708410644,2
1708583454,1
