1679895117,25
1679981518,275
1680067912,129
1680154308,538
1680240714,139
1680327097,391
1680413504,470
1680499902,295
1680586299,388
1680672702,251
1680759104,406
1680845523,282
1680931899,180
1681018301,275
1681104713,214
1681191117,38
