1645165829,7
1645252290,11
1645338629,23
1645425030,14
1645467113,14
1645470826,14
1645511492,13
1645597892,8
1645684232,15
1645770629,25
1645857150,18
1645943553,13
1646029893,12
1646116237,25
1646202760,17
1646289033,13
1646375551,20
1646461951,13
1646548229,1
