1695706406,29
1695792808,30
1695879218,18
1695965624,26
1696052011,22
1696138408,22
1696224807,28
1696311219,26
1696397621,22
1696484041,15
1696570435,19
1696656841,17
1696743237,29
1696829644,23
1696916048,30
1697002439,27
1697088838,19
