1688016640,1
1688103041,1
1688275841,1
1688362240,1
1688535044,1
1688621445,1
1688707844,1
1688794245,1
1688880644,1
1688967042,1
1689053441,1
1689139840,1
1689226241,1
1689312653,1
1689744640,1
1689831044,1
1689917446,1
1690003846,1
1690263047,1
1690522245,1
1690867847,1
1691127048,1
1691213447,10
1694323834,1
1694583036,2
1694755834,1
1694842234,1
1694928634,1
1695274234,1
1695360634,1
1695533434,1
1695619839,1
1712813449,1
