1657866760,5
1657896040,5
1657953158,40
1657982325,40
1658039438,34
1658068726,34
1658125843,42
1658155247,42
1658212362,39
1658241661,39
1658298758,41
1658328052,41
1658385041,44
1658414447,44
1658471560,33
1658500847,33
1658557962,39
1658587247,39
1658644360,26
1658673645,26
1658730762,27
1658760045,27
1658817160,23
1658846453,23
1658903439,32
1658932848,32
1658989840,31
1659019246,31
1659076365,26
1659105646,26
1659162770,35
1659192044,35
1659249159,9
1659278470,9
