1693114356,5
1693200777,5
1693287141,7
1693373568,2
1693459952,11
1693546364,20
1693632754,8
1693719144,10
1693805540,8
1693891949,9
1693978362,6
1694064749,2
1694151151,8
1694237547,10
1694323959,1
1694410362,5
1694496769,1
1694583178,4
1694669562,7
1694755972,28
1694842363,10
1694928766,5
1695015165,3
1695187975,6
1695274380,2
1695360784,6
1695447164,3
1695533586,13
1695619990,2
1695706406,12
1695792808,5
1695879218,4
1695965624,15
1696052011,8
1696138408,9
1696224807,10
1696311219,11
1696397621,1
