1690522245,1
1690867847,1
1691127048,1
1691645448,1
1691731846,1
1691818247,1
1691904646,1
1692077440,1
1692163831,1
1692250233,1
1692336633,1
1692423035,1
1692509432,1
1692682233,1
1692768633,1
1692855035,1
1692941433,1
1693027839,1
1693200633,1
1693978232,1
1694323834,1
1694583036,1
1694669436,1
1694755834,1
1694842234,1
1694928634,1
1695187834,1
1695274234,1
1695360634,1
1695533434,3
1695619839,3
1695965441,3
1696311044,2
1696483842,2
1696570241,2
1696656645,2
1696743043,2
1696829444,2
1696915841,2
1697002242,2
1697088641,2
1697175042,2
1697261447,2
1697347842,2
1697520642,2
1697607044,2
1697693444,2
1697866244,2
1697952644,2
1698211845,2
1698474646,2
1698561046,2
1698647445,2
1698733843,3
1698993045,6
1699079441,2
1699165843,2
1699252253,12
1699338639,2
1699425038,2
1699597838,3
1699684239,2
1699770639,2
1699857040,2
1699943446,2
1700116239,2
1700202637,4
1700548240,1
1700721041,2
1700807441,4
1700893840,2
1700980240,2
1701066641,2
1701239442,2
1701412240,4
1702017040,3
1702621850,2
1703226640,2
1703831442,2
1704436239,1
1711261844,1
1727415052,1
1730874652,2
