1706250646,3
1706855451,2
1707460251,2
1708065054,3
1709274654,2
1710484249,2
1711089048,2
1718602257,2
1719379849,2
1720762249,3
1721367051,1
1724391048,1
1724477449,1
1726551051,1
1727587850,1
1730874652,1
