1652682759,20
1652769160,22
1652855561,16
1652941964,20
1653028353,25
1653114753,17
1653201159,13
1653287558,22
1653373954,15
1653460234,20
1653546755,15
1653633154,26
1653719553,20
1653805957,19
1653892236,19
1653978755,10
