1679584314,2
1679589759,2
1679596397,2
1679602819,2
1679607852,2
1679639432,3
1679981431,1
1680240629,1
1680845434,2
1683437432,1
1683610233,3
1687498241,1
1687584640,1
1688016640,3
1688103041,3
1688275841,1
1688362240,3
1688535044,3
1688621445,3
1688707844,3
1688794245,3
1688880644,3
1688967042,3
1689053441,3
1689139840,3
1689226241,3
1689312653,3
1689744640,1
1689831044,3
1689917446,3
1690003846,3
1690263047,1
1690522245,2
1690867847,3
1691127048,3
1691645448,2
1691731846,1
1691818247,1
1691904646,1
1691991040,2
1692077440,2
1692163831,5
1692250233,5
1692336633,5
1692423035,5
1692509432,5
1692682233,4
1692768633,4
1692855035,4
1692941433,4
1693027839,5
1693114233,3
1693200633,5
1693978232,5
1694323834,3
1694410234,2
1694496634,3
1694583036,3
1694669436,1
1694755834,3
1694842234,3
1694928634,3
1695187834,2
1695274234,3
1695360634,4
1695533434,3
1695619839,3
1695965441,3
1696483842,2
1696656645,2
1696743043,2
1696829444,2
1696915841,2
1697002242,2
1697088641,2
1697175042,1
1697261447,2
1697347842,2
1697520642,2
1697607044,2
1697693444,2
1697866244,2
1697952644,2
1698211845,3
1698474646,2
1698561046,2
1698647445,2
1698733843,2
1698906644,1
1698993045,3
1699079441,2
1699165843,2
1699252253,8
1699338639,2
1699425038,2
1699597838,3
1699684239,2
1699770639,2
1699943446,1
1700116239,1
1700202637,2
1700548240,3
1700721041,5
1700807441,6
1700893840,3
1700980240,3
1701066641,2
1701239442,2
1701412240,4
1702017040,2
1702621850,2
1703226640,2
1703831442,2
1704349840,5
1704436239,3
1705041045,1
1708410644,4
1726551051,3
1727415052,4
1730874652,2
1732084253,1
