1691127048,1
1691645448,1
1691731846,1
1691818247,1
1691904646,1
1691991040,1
1692077440,1
1692163831,1
1692250233,1
1692336633,1
1692423035,1
1692509432,1
1695360634,1
1700116239,1
1700202637,2
1704436239,1
