1662100359,1
1662129642,1
1662186760,12
1662216045,12
1662273039,13
1662302447,13
1662359559,15
1662388727,15
1662445958,13
1662475124,13
1662532358,19
1662561643,19
1662618758,5
1662647931,5
1662705164,10
1662734437,10
1662791558,14
1662820724,14
1662877847,1
1662907237,1
