1673516775,15
1674887480,2
1675492281,7
1675578681,9
1675665075,7
1675751474,8
1676442661,2
1676788249,2
1676874662,2
1677393061,2
1677652257,4
1679722309,7
1680067912,2
1680327097,2
1680499902,5
1680586299,4
1681709528,2
1681968706,18
1682055103,3
1682314324,4
1682400707,2
1682487105,3
1682573524,13
1682659898,5
1682746309,1
1682832700,15
1682919107,6
1683005499,4
1683091901,7
1683178309,4
1683264713,8
1683351101,5
1683437506,4
1683523904,3
1683610328,3
1683696716,2
1683783116,4
1683869508,2
1685544777,6
1685597496,13
1685683902,10
1685770303,13
1685856701,17
1685943100,15
1686029502,15
1686115904,11
1686202306,5
1686288711,4
1686375108,11
1686461512,11
1686547909,15
1686634309,10
1686720704,13
1686807105,10
1686893562,9
1686979954,2
1687066360,5
1687152774,3
1687584774,1
1687671173,2
1687757568,6
1687843969,2
1687930377,2
1688016807,1
1688103218,10
1688189597,3
1688275996,1
1688362412,1
1688535215,3
1688621614,8
1688708029,8
1688794420,10
1688880821,18
1688967219,2
1689053626,24
1689140028,1
1689226424,3
1689312837,12
1689658397,3
1689744807,5
1689831241,3
1690004042,2
1690176817,2
1690263240,2
1690349617,1
1690522443,2
1690608808,2
1690695212,16
1690781617,4
1690868047,3
1690954421,1
1691127250,2
1691213630,2
1691300015,5
1691386395,5
1691472821,1
1691645653,1
1691732035,2
1691818443,3
1691904834,4
1691991184,13
1692077570,3
1692163972,1
1692250382,1
1692336773,3
1692595944,1
1692682368,20
1692768764,7
1692941568,1
1693027980,2
1693200777,4
1693287141,1
1693373568,1
1693459952,2
1693546364,22
1693632754,5
1693805540,3
1693891949,2
1693978362,1
1694064749,1
1694151151,4
1694237547,16
1694323959,2
1694496769,3
1694669562,3
1694755972,2
1694842363,4
1694928766,1
1695015165,1
1695187975,1
1695274380,4
1695360784,1
1695447164,1
1695533586,1
1695619990,1
1695706406,2
1695792808,2
1695965624,1
1696052011,19
1696138408,15
1696224807,1
1696311219,1
1696484041,4
1696570435,4
1696656841,11
1696743237,5
1696829644,2
1696916048,1
1697002439,31
1697088838,4
1697175238,12
1697261644,2
1697348050,1
1697434425,2
1697520844,1
1697607247,1
1697693651,3
1697780021,5
1697866447,2
1697952848,1
1698039229,3
1698125641,1
1698212053,2
1698384826,4
1698474862,4
1698561261,4
1698647660,3
1698734051,2
1698820440,3
1698906836,1
1698993260,3
1699079643,11
1699166057,1
1699252467,1
1699338847,2
1699425254,6
1699511642,7
1699598052,17
1699684453,21
1699770845,3
1699857241,9
1699943653,6
1700030030,19
1700116443,9
1700202865,7
1700289223,5
1700375637,9
1700462021,15
1700548451,13
1700634836,13
1700721246,11
1700807657,24
1700894058,14
1700980458,18
1701066868,13
1701239661,9
1701326039,3
1701412459,2
1701498834,7
1701585234,2
1701671642,3
1701758036,3
1701930831,1
1702017289,2
1702103633,4
1702276447,2
1702362833,3
1702449238,2
1702535641,7
1702622071,2
1702708433,2
1702794843,1
1702881239,19
1702967665,2
1703140439,11
1703226865,5
1703313245,9
1703399641,1
1703572441,3
1703658841,1
1703831661,3
1704004443,1
1704090847,26
1704177241,18
1704263638,36
1704350037,33
1704436450,30
1704522832,19
1704609231,14
1704695681,7
1704782089,16
1704868474,17
1704954878,14
1705041294,16
1705127674,15
1705300477,6
1705386877,3
1705473291,1
1705559692,2
1705646097,43
1705818877,16
1705905294,5
1705991686,18
1706078101,4
1706250972,2
1706337342,3
1706423747,3
1706510148,7
1706596552,2
1706682956,2
1706769366,3
1706855781,2
1706942169,6
1707028569,1
1707114964,11
1707287760,2
1707374158,2
1707460602,3
1707546967,10
1707719770,8
1707806171,16
1707892577,8
1707978960,7
1708065403,4
1708151763,7
1708238171,17
1708324568,7
1708410859,7
1708497318,6
1708583778,2
1708670174,25
1708756568,13
1708842965,23
1708929366,14
1709015768,15
1709102173,15
1709188566,18
1709275007,19
1709361374,12
1709447776,15
1709534155,29
1709620564,3
1709706962,2
1709793367,7
1709966169,7
1710052561,23
1710138969,5
1710225362,14
1710311773,11
1710398159,6
1710484595,8
1710570954,7
1710657364,12
1710743767,8
1710830176,11
1710916554,6
1711002952,15
1711089395,13
1711175767,12
1711262153,16
1711348567,17
1711434966,4
1711607758,11
1711694155,22
1711776969,14
1711863379,13
1711949767,13
1712036181,13
1712122595,9
1712209001,18
1712295387,5
1712381761,10
1712468183,14
1712554571,3
1712640970,5
1712727387,2
1712813813,26
1712986589,4
1713073014,1
1713159410,7
1713245803,20
1713332196,5
1713418604,8
1713505010,8
1713591405,2
1713677807,5
1713764197,5
1713850601,3
1713937016,1
1714023425,1
1714109816,7
1714196216,3
1714282602,11
1714369033,27
1714455398,23
1714541804,18
1714714600,28
1714801009,46
1714887409,37
1714973810,44
1715060210,41
1715146632,18
1715233058,11
1715319563,12
1715405851,23
1715492244,18
1718022496,39
1718084230,117
1718170636,29
1718257047,113
1718343427,34
1718429818,158
1718516215,14
1718602645,16
1718689022,17
1718775431,23
1718861831,36
1718948217,21
1719034629,36
1719121031,30
1719207304,32
1719293732,48
1719380130,35
1719466523,31
1719552933,32
1719639300,90
1719725705,31
1719812104,29
1719898511,33
1719984907,36
1720071331,34
1720157731,32
1720244127,77
1720330509,56
1720416929,13
1720503328,14
1720589730,2
1720676127,26
1720762554,32
1720935328,40
1721021712,44
1721108139,18
1721194539,70
1721280942,18
1721367339,21
1721453736,4
1721540139,2
1721626512,13
1721712930,22
1721799317,21
1721885729,61
1721972116,17
1722058513,15
1722144941,3
1722231340,3
1722317737,48
1722404147,1
1722490541,2
1722576933,2
1722663315,1
1722749743,45
1722836105,4
1723008910,7
1723095317,2
1723181712,5
1723268105,8
1723354509,1
1723440921,45
1723527316,3
1723700119,2
1723872909,7
1723959316,1
1724045707,2
1724132118,6
1724218520,2
1724304925,19
1724391319,4
1724477730,45
1724564111,4
1724650531,2
1724823316,4
1724909717,47
1724996108,49
1725082506,3
1725168909,34
1725255319,21
1725341717,68
1725428109,4
1725514506,87
1725600914,46
1725687306,90
1725773707,32
1725860113,61
1725946519,8
1726032920,29
1726119315,8
1726205705,12
1726292115,24
1726378512,107
1726464916,5
1726551329,8
1726637718,71
1726724132,63
1726810515,8
1726896925,5
1726983322,5
1727069719,50
1727156114,12
1727242538,10
1727328917,24
1727415326,26
1727501713,63
1727588116,168
1727674524,7
1727760922,9
1727847333,2
1727933723,97
1728020122,6
1728106547,15
1728192945,1
1728279336,105
1728365743,10
1728452151,10
1728538537,149
1728624938,3
1728711328,6
1728797737,11
1728884126,50
1729056925,49
1729143336,8
1729229724,5
1729316123,14
1729402521,95
1729488952,91
1729575323,48
1729661730,46
1729748135,48
1729834546,48
1729924541,52
1730010943,48
1730097332,5
1730183730,17
1730270141,44
1730356536,22
1730442925,9
1730529338,73
1730615759,133
1730702128,59
1730788525,114
1730874965,53
1730961326,74
1731047722,3
1731134141,4
1731220531,51
1731306938,3
1731393338,8
1731479747,98
1731566125,2
1731652532,74
1731738930,6
1731825326,4
1731911726,12
1731998131,3
1732084532,4
1732170946,3
1732257343,53
1732343726,21
1732430128,23
1732516530,17
1732602931,20
1732689332,63
1732775733,8
1732862185,4
1732948585,22
1733034986,38
1733121412,2
1733207816,4
1733294214,6
