1688016640,1
1688103041,1
1688362240,1
1688707844,1
1688794245,1
1688880644,1
1688967042,1
1689053441,1
1689139840,1
1689226241,1
1689312653,1
1689831044,1
1689917446,1
1690003846,1
1690263047,1
1690435846,1
1690522245,1
1690867847,1
1693114233,1
