1683783032,1
1684042234,1
1685544705,1
1685683833,1
1685770233,1
1686029431,1
1686375033,1
1686720636,1
1686893441,1
1686979840,1
1687152641,1
1687239039,1
1687411840,1
1687498241,1
1687584640,1
1687671039,1
1687843838,1
1688275841,1
1703140241,1
1706596254,2
1712727049,1
1729056653,1
1730183452,1
