1660372250,30
1660401521,30
1660458761,305
1660488049,305
1660545162,257
1660574449,257
1660631564,114
1660660730,114
1660717841,112
1660747248,112
1660804362,97
1660833647,97
1660890760,274
1660920046,274
1660977162,193
1661006455,193
1661063442,427
1661092854,427
1661149842,133
1661179125,133
1661236366,134
1661265647,134
1661322641,115
1661352051,115
1661409162,114
1661438449,114
1661495561,161
1661524735,161
1661581964,346
1661611239,346
1661668363,182
1661697647,182
1661700049,182
