1636286412,2
1636286488,2
1636895594,2
1636898490,2
1636900709,2
1637070326,6
1637070818,6
1637072812,7
1637122028,8
1637208446,4
1637294806,6
1637381227,6
1637467621,5
1637554087,5
1637589848,5
1637640464,4
1637726914,6
1637813369,9
1637899638,4
1637986004,5
1638072517,7
1638158887,9
1638245235,8
1638331638,6
1639904549,2
1639907950,2
1639980923,9
1639983233,9
1639985995,9
1640059226,9
1640080313,9
1640145685,8
1640232083,7
1640318424,3
1640404823,6
1640491284,4
1640577691,4
1640664024,9
1640750484,4
1640836884,13
1640923223,8
1641009626,10
1641096084,11
1641182484,3
1641268824,5
1641355224,10
1641441684,3
1641528084,6
1641700884,9
1641787224,8
1641873686,6
1642305627,4
1642319122,4
1642392088,9
1642408942,9
1642478484,11
1642564885,15
1642651226,10
1642676514,10
1642769502,21
1642771604,21
1642805136,21
1642805851,21
1642824026,18
1642855125,18
1642910490,19
1642924655,19
1642934565,19
1642937864,19
1642996892,22
1643083292,15
1643169628,18
1643256090,16
1643342487,18
1643428827,21
1643515288,23
1643601634,19
1643622207,19
1643688028,18
1643708607,18
1643774489,17
1643860889,12
1643947288,18
1644033629,21
1644120088,36
1644206493,28
1644292831,27
1644321030,27
1644388289,15
1644407490,15
1644474692,20
1644493888,20
1644561030,14
1644647492,27
1644733834,19
1644770508,19
1644820292,23
1644906689,25
1644993090,12
1645079499,23
1645165829,19
1645252290,15
1645338629,9
1645425030,12
1645467113,12
1645470826,12
1645511492,18
1645597892,26
1645684232,14
1645770629,13
1645857150,14
1645943553,14
1646029893,14
1646116237,9
1646202760,18
1646289033,10
1646375551,11
1646461951,9
1646548229,9
1646634751,10
1646721161,11
1646807431,10
1646893952,28
1646980230,24
1647066751,35
1647153150,41
1647239550,40
1647325952,37
1647412352,25
1647498752,28
1647585151,36
1647757954,30
1647844355,22
1647930752,31
1648017150,28
1648103550,21
1648189831,38
1648276229,24
1648362752,20
1648449033,25
1648535442,22
1648621952,26
1648708231,36
1648794750,30
1648881149,52
1648967561,56
1649053832,23
1649140351,22
1649226751,21
1649313029,37
1649399549,35
1649485949,35
1649572354,23
1649658750,21
1649745150,24
1649831565,31
1649917950,26
1650004228,29
1650090628,37
1650177150,31
1650263549,23
1650349831,15
1650436229,27
1650522756,21
1650609163,25
1650695550,34
1650781953,23
1650868349,28
1650954630,46
1651041030,36
1651127552,28
1651213951,39
1651300352,32
1651386755,29
1651473034,17
1651559564,40
1651645850,23
1651732362,21
1651818753,21
1651905153,20
1651991564,25
1652077954,12
1652164360,28
1652250764,32
1652337032,41
1652423553,33
1652509832,27
1652596232,21
1652682759,11
1652769160,12
1652855561,13
1652941964,9
1653028353,12
1653114753,6
1653201159,14
1653287558,3
1653373954,16
1653460234,9
1653546755,10
1653633154,8
1653719553,10
1653805957,14
1653892236,12
1653978755,8
1654065033,14
1654151553,6
1654237831,8
1654324351,10
1654410631,10
1654497153,5
1654583555,11
1654669837,14
1654756356,14
1654842756,12
1654929156,13
1655015436,15
1655101838,11
1655188357,1
1655274636,13
1655361158,12
1655447555,17
1655533836,7
1655620256,14
1655706645,15
1655793158,14
1655879557,13
1655965955,8
1656052365,11
1656138754,9
1656225155,14
1656311556,11
1656397956,9
1656484356,6
1656570758,9
1656743558,16
1656829841,15
1656916357,19
1657002637,7
1657089163,12
1657175559,15
1657261838,13
1657348240,11
1657434758,14
1657521164,14
1657607566,23
1657693957,21
1657780357,22
1657803090,22
1657804447,22
1657809517,22
1657866760,20
1657896040,20
1657953158,14
1657982325,14
1658039438,16
1658068726,16
1658125843,15
1658155247,15
1658212362,5
1658241661,5
1658298758,8
1658328052,8
1658385041,12
1658414447,12
1658471560,13
1658500847,13
1658557962,9
1658587247,9
1658644360,10
1658673645,10
1658730762,7
1658760045,7
1658817160,7
1658846453,7
1658903439,2
1658932848,2
1658989840,9
1659019246,9
1659076365,14
1659105646,14
1659162770,1
1659192044,1
1659249159,13
1659278470,13
1659335565,13
1659364847,13
1659421963,7
1659451128,7
1659508368,7
1659537519,7
1659594767,8
1659624049,8
1659681160,7
1659710444,7
1659767561,12
1659796845,12
1659853840,18
1659883130,18
1659940369,13
1659969638,13
1660026647,40
1660056049,40
1660113163,42
1660142439,42
1660199441,27
1660228849,27
1660285970,34
1660315250,34
1660372250,37
1660401521,37
1660458761,33
1660488049,33
1660545162,20
1660574449,20
1660631564,17
1660660730,17
1660717841,4
1660747248,4
1660804362,9
1660833647,9
1660890760,11
1660920046,11
1660977162,8
1661006455,8
1661063442,14
1661092854,14
1661149842,26
1661179125,26
1661236366,41
1661265647,41
1661322641,172
1661352051,172
1661409162,34
1661438449,34
1661495561,55
1661524735,55
1661581964,48
1661611239,48
1661668363,32
1661697647,32
1661700049,32
1661754784,123
1661784048,123
1661870448,195
1661927560,97
1661956724,97
1662013964,7
1662043246,7
1662100359,6
1662129642,6
1662186760,19
1662216045,19
1662273039,36
1662302447,36
1662359559,20
1662388727,20
1662445958,9
1662475124,9
1662532358,14
1662561643,14
1662618758,18
1662647931,18
1662705164,20
1662734437,20
1662791558,14
1662820724,14
1662877847,7
1662907237,7
1662964357,6
1662993645,6
1663050638,13
1663080057,13
1663137169,12
1663166448,12
1663223564,12
1663252844,12
1663309969,15
1663339237,15
1663396358,9
1663425653,9
1663482759,18
1663512042,18
1663569159,17
1663598447,17
1663655565,11
1663684725,11
1663741840,26
1663771124,26
1663828239,24
1663857524,24
1663914640,23
1663943934,23
1664001039,23
1664030318,23
1664087438,18
1664116722,18
1664173842,12
1664203127,12
1664260251,12
1664289537,12
1664346641,5
1664375951,5
1664433041,7
1664462320,7
1664519554,21
1664548711,21
1664605833,30
1664635111,30
1668081545,4
1668350533,5
1668355972,5
1668356757,5
1668360810,5
1668474184,3
1668560577,4
1668646979,2
1671629111,3
1671630664,3
1671632450,3
1671634011,3
1673516775,9
1674367285,60
1674455475,29
1674541884,26
1674628285,31
1674714694,58
1674801082,42
1674887480,24
1674973872,32
1675060281,24
1675146682,21
1675233071,21
1675319481,16
1675405883,19
1675492281,34
1675578681,21
1675665075,30
1675751474,15
1675837863,7
1676356254,2
1676442661,9
1676529061,5
1676615450,8
1676701857,13
1676788249,10
1676874662,12
1676961061,8
1677047454,9
1677133857,9
1677220262,14
1677306660,11
1677393061,10
1677479458,9
1677565859,8
1677652257,14
1677825057,10
1677911460,11
1677997847,24
1678084257,35
1678170666,23
1678257055,19
1678343445,17
1679569142,19
1679584407,19
1679589867,19
1679596494,19
1679602915,19
1679607956,19
1679639532,24
1679722309,23
1679808717,25
1679895117,19
1679981518,18
1680067912,32
1680154308,29
1680240714,17
1680327097,20
1680413504,16
1680499902,38
1680586299,46
1680672702,66
1680759104,46
1680845523,28
1680931899,29
1681018301,19
1681104713,30
1681191117,21
1681277516,18
1681363906,22
1681450306,6
1681536706,17
1681623105,21
1681709528,5
1681795909,14
1681882326,16
1681968706,8
1682055103,6
1682141505,24
1682227910,16
1682314324,14
1682400707,11
1682487105,11
1682573524,5
1682659898,4
1682746309,13
1682832700,5
1682919107,4
1683005499,6
1683091901,6
1683178309,9
1683264713,5
1683351101,16
1683437506,10
1683523904,5
1683610328,5
1683696716,4
1683783116,9
1683869508,3
1683955918,6
1684042308,8
1685544777,5
1685597496,3
1685683902,6
1685770303,6
1685856701,9
1685943100,2
1686029502,8
1686115904,3
1686202306,3
1686288711,5
1686375108,10
1686461512,7
1686547909,4
1686634309,3
1686720704,4
1686807105,5
1686893562,6
1686979954,5
1687066360,1
1687152774,7
1687239150,3
1687411953,4
1687498393,6
1687584774,8
1687671173,4
1687757568,5
1687843969,7
1687930377,11
1688016807,6
1688103218,4
1688189597,3
1688275996,2
1688362412,7
1688535215,7
1688621614,5
1688708029,20
1688794420,17
1688880821,6
1688967219,13
1689053626,3
1689140028,7
1689226424,5
1689312837,6
1689399195,4
1689485597,5
1689572000,5
1689658397,10
1689744807,6
1689831241,6
1690004042,3
1690090404,2
1690176817,3
1690263240,3
1690349617,7
1690436012,4
1690522443,5
1690608808,2
1690695212,8
1690781617,4
1690868047,7
1690954421,11
1691040818,8
1691127250,8
1691213630,6
1691300015,10
1691386395,5
1691472821,1
1691559206,2
1691645653,2
1691732035,5
1691818443,2
1691904834,2
1691991184,5
1692077570,3
1692163972,4
1692336773,1
1692509573,3
1692682368,4
1692855167,1
1692941568,3
1693114356,5
1693200777,4
1693287141,2
1693373568,3
1693459952,3
1693546364,6
1693632754,15
1693719144,7
1693805540,3
1693891949,3
1693978362,2
1694064749,3
1694151151,1
1694237547,5
1694323959,2
1694410362,1
1694496769,2
1694583178,1
1694669562,1
1694755972,2
1694842363,2
1694928766,1
1695015165,3
1695187975,6
1695274380,6
1695360784,1
1695447164,2
1695533586,3
1695619990,2
1695706406,4
1695792808,2
1696138408,1
1696224807,2
1696311219,2
1696397621,6
1696484041,1
1696570435,2
1696656841,2
1696743237,2
1696829644,3
1696916048,2
1697175238,2
1697348050,2
1697434425,3
1697607247,1
1697693651,4
1697780021,1
1697866447,10
1697952848,11
1698039229,6
1698125641,4
1698212053,10
1698298423,7
1698384826,2
1698561261,1
1698647660,4
1698734051,9
1698820440,4
1698906836,18
1698993260,19
1699079643,22
1699166057,20
1699252467,23
1699338847,14
1699425254,5
1700030030,2
1700116443,2
1700202865,2
1700289223,1
1700634836,1
1700721246,2
1700807657,1
1701326039,2
1701412459,1
1701585234,2
1701758036,1
1701930831,2
1702103633,1
1702622071,1
1702708433,2
1702794843,2
1703313245,1
1703399641,1
1703572441,3
1703745239,1
1703918046,1
1704090847,1
1704350037,1
1704522832,1
1705041294,1
1705473291,1
1705732479,1
1706423747,1
1706596552,2
1707028569,1
1707374158,1
1707460602,1
1707633370,1
1708151763,2
1708324568,1
1708410859,2
1708497318,1
1708583778,2
1708670174,2
1708756568,1
1709015768,1
1709102173,1
1709188566,2
1709275007,1
1709361374,1
1709447776,1
1709793367,1
1710138969,2
1710225362,2
1710570954,2
1710657364,1
1710743767,1
1710830176,1
1710916554,1
1711262153,1
1711348567,3
1711607758,2
1711694155,1
1711863379,1
1712036181,2
1712209001,1
1712295387,3
1712468183,1
1712727387,2
1713073014,7
1713159410,3
1713245803,1
1713332196,1
1713505010,1
1713591405,1
1713850601,3
1714109816,1
1714196216,3
1714282602,2
1714369033,1
1714541804,1
1714714600,2
1714801009,3
1714887409,1
1714973810,3
1715233058,3
1715319563,3
1715492244,3
1718022496,1
1718170636,2
1718257047,5
1718343427,3
1718429818,4
1718516215,4
1718602645,1
1718775431,3
1718948217,1
1719293732,2
1719380130,2
1719552933,3
1719812104,2
1719898511,3
1720071331,1
1720157731,5
1720244127,5
1720330509,1
1720503328,2
1720589730,7
1720935328,5
1721021712,2
1721108139,1
1721194539,3
1721280942,3
1721367339,3
1721453736,2
1721540139,2
1721626512,2
1721712930,1
1721799317,1
1721885729,3
1721972116,4
1722058513,6
1722144941,4
1722231340,1
1722404147,1
1722490541,1
1722576933,5
1722663315,2
1722749743,2
1722836105,5
1722922512,2
1723008910,1
1723095317,1
1723181712,2
1723268105,1
1723354509,4
1723440921,1
1723527316,1
1723613721,2
1723700119,3
1723786513,2
1723959316,1
1724045707,4
1724132118,1
1724218520,2
1724391319,2
1724477730,2
1724564111,3
1724650531,2
1724823316,1
1724909717,3
1724996108,3
1725082506,1
1725168909,1
1725255319,4
1725341717,5
1725428109,1
1725514506,4
1725600914,2
1725687306,1
1725773707,3
1725860113,3
1725946519,3
1726032920,3
1726119315,4
1726205705,4
1726292115,3
1726724132,3
1726810515,3
1726983322,2
1727156114,2
1727328917,3
1727415326,3
1727588116,2
1727674524,8
1727760922,2
1727847333,4
1727933723,4
1728020122,2
1728192945,5
1728279336,3
1728365743,5
1728452151,3
1728538537,2
1728624938,3
1728711328,3
1728797737,7
1728884126,5
1729056925,2
1729143336,4
1729229724,2
1729402521,1
1729488952,2
1729575323,2
1729661730,1
1729834546,4
1729924541,2
1730010943,1
1730183730,2
1730270141,6
1730356536,2
1730442925,3
1730529338,3
1730615759,3
1730702128,2
1730788525,2
1730874965,2
1730961326,2
1731134141,5
1731220531,1
1731566125,4
1731652532,2
1731738930,4
1731825326,2
1731911726,4
1731998131,3
1732170946,3
1732257343,3
1732343726,3
1732430128,2
1732516530,3
1732602931,3
1732862185,4
1732948585,2
1733121412,3
1733207816,5
