1676874662,5
1682659898,2
1683955918,1
1687671173,1
1687757568,1
1688275996,1
1689572000,1
1689658397,2
1691213630,2
1691991184,1
1692336773,1
1692855167,1
1692941568,1
1693978362,1
1694064749,2
1694151151,2
1694237547,1
1694323959,1
1694410362,2
1694583178,1
1694669562,1
1694755972,1
1694842363,3
1694928766,1
1695187975,3
1702794843,4
1702967665,1
1703054037,1
1703745239,2
1703831661,2
1703918046,1
1704004443,1
1704436450,4
1704609231,3
1704695681,6
1704868474,7
1704954878,4
1707546967,2
1710570954,1
1710657364,2
1720676127,5
