1654929156,1
1658471560,1
1658500847,1
1658557962,2
1658587247,2
1658730762,1
1658760045,1
1658903439,1
1658932848,1
1660545162,3
1660574449,3
1730788525,3
1731047722,4
1731134141,2
1731479747,4
1731652532,2
