1650004228,2
1655015436,1
1657866760,46
1657896040,46
1657953158,1
1657982325,1
1658989840,2
1659019246,2
1659508368,2
1659537519,2
1659594767,6
1659624049,6
1659767561,4
1659796845,4
1659853840,4
1659883130,4
1659940369,2
1659969638,2
1660113163,2
1660142439,2
1660285970,1
1660315250,1
1660458761,2
1660488049,2
1660717841,2
1660747248,2
1660890760,2
1660920046,2
1660977162,2
1661006455,2
1661063442,2
1661092854,2
1661149842,4
1661179125,4
1661322641,4
1661352051,4
1661409162,4
1661438449,4
1661495561,6
1661524735,6
1661754784,5
1661784048,5
1661927560,2
1661956724,2
1662013964,4
1662043246,4
1662359559,2
1662388727,2
1662445958,6
1662475124,6
1662532358,6
1662561643,6
1662791558,4
1662820724,4
1663050638,7
1663080057,7
1663137169,2
1663166448,2
1663223564,4
1663252844,4
1663309969,4
1663339237,4
1663396358,4
1663425653,4
1663482759,4
1663512042,4
1663569159,4
1663598447,4
1663655565,2
1663684725,2
1663741840,9
1663771124,9
1663828239,2
1663857524,2
1663914640,3
1663943934,3
1664087438,6
1664116722,6
1664173842,10
1664203127,10
1664346641,4
1664375951,4
1664433041,6
1664462320,6
1664519554,6
1664548711,6
1664605833,8
1664635111,8
1668081545,4
1668474184,2
1671629111,4
1671630664,4
1671632450,4
1671634011,4
1674628285,30
1674714694,28
1674801082,3
1675060281,29
1675233071,28
1675492281,3
1675751474,3
1676615450,859
1676788249,5
1676961061,5
1677306660,3
1677479458,30
1677738657,10
1677911460,32
1677997847,4
1679569142,6
1679584407,6
1679589867,6
1679596494,6
1679602915,6
1679607956,6
1680067912,3
1680327097,3
1681104713,5
1681191117,36
1681450306,22
1681536706,39
1682227910,6
1682314324,4
1682659898,9
1682832700,1
1683005499,2
1683351101,3
1683610328,1
1683783116,1
1683955918,34
1684042308,51
1685683902,1
1685856701,1
1685943100,1
1686115904,2
1686288711,1
1686375108,2
1686547909,6
1686807105,43
1687152774,2
1687239150,1
1687498393,2
1688621614,1
1688967219,1
1689053626,2
1689572000,46
1690176817,1
1690695212,13
1690781617,3
1690954421,1
1692768764,2
1693891949,2
1694237547,1
1694842363,1
1695187975,1
1695360784,10
1695879218,1
1696311219,1
1696570435,4
1696656841,1
1697348050,3
1697607247,882
1698039229,2
1698125641,1392
1698212053,7
1698474862,882
1698561261,869
1698734051,876
1698906836,6
1699166057,3
1699684453,901
1699770845,867
1699857241,1
1699943653,2
1700030030,1029
1700462021,2
1700807657,1
1700980458,1
1702103633,1
1702190033,4
1702362833,3
1702881239,1
1703226865,2
1703399641,1
1703572441,1
1703918046,5
1704004443,1
1704436450,5
1704782089,2
1704868474,4
1705127674,2
1705386877,104
1705818877,8
1706164491,1
1706250972,2
1706942169,1
1707114964,2
1707201363,1
1707374158,3
1707633370,1
1708410859,4
1708670174,2
1708842965,1
1709102173,1
1709188566,1
1709361374,2
1710138969,1
1710398159,4
1710484595,2
1710657364,1
1711089395,16
1711175767,2
1711262153,2
1712036181,2
1713073014,1
1714282602,4
1714541804,2
1715319563,27
1718022496,4
1718170636,105
1718257047,86
1718343427,3
1718429818,3
1718689022,112
1718861831,35
1718948217,72
1719380130,4
1719466523,73
1719639300,2
1719812104,2
1719984907,3
1720244127,103
1720416929,7
1720676127,100
1720935328,1
1721367339,21
1721453736,6
1721712930,10
1721885729,4
1721972116,3
1722058513,9
1722663315,105
1722749743,99
1722922512,4
1723268105,102
1723440921,2
1723527316,2
1723613721,2
1724823316,1
1724996108,3
1725168909,1
1725341717,906
1725428109,3
1725773707,2
1725860113,2
1726551329,5
1727588116,24
1727674524,253
1728884126,2
1731479747,7
1731566125,3
1733034986,2
