1648708231,22
1648794750,744
1648881149,257
1648967561,226
1649053832,250
1649140351,169
1649226751,136
1649313029,185
1649399549,156
1649485949,165
1649572354,263
1649658750,192
1649745150,307
1649831565,144
1649917950,283
1650004228,145
