1656052365,58
1656138754,159
1656225155,141
1656311556,150
1656397956,126
1656484356,145
1656570758,141
1656743558,70
1656829841,252
1656916357,313
1657002637,170
1657089163,232
1657175559,210
1657261838,362
1657348240,153
1657434758,151
1657521164,203
1657607566,141
1657693957,138
1657780357,128
1657803090,128
1657804447,128
1657809517,128
1657866760,200
1657896040,200
1657953158,133
1657982325,133
1658039438,204
1658068726,204
1658125843,243
1658155247,243
1658212362,139
1658241661,139
1658298758,150
1658328052,150
1658385041,337
1658414447,337
1658471560,428
1658500847,428
1658557962,96
1658587247,96
1658644360,569
1658673645,569
1658730762,493
1658760045,493
1658817160,312
1658846453,312
1658903439,134
1658932848,134
1658989840,891
1659019246,891
1659076365,132
1659105646,132
1659162770,107
1659192044,107
1659249159,138
1659278470,138
1659335565,216
1659364847,216
1659421963,213
1659451128,213
1659508368,255
1659537519,255
1659594767,126
1659624049,126
1659681160,195
1659710444,195
