1681968635,1
1692682233,1
1692768633,1
1692855035,1
1692941433,1
1693027839,1
1693200633,1
1700548240,1
1700807441,2
1700893840,1
1700980240,1
1701239442,1
1701412240,2
1702017040,2
1702621850,1
1703226640,1
1703831442,1
1710311452,1
1713936654,1
