1692768633,2
1692855035,2
1692941433,2
1693027839,2
1693114233,1
1693200633,2
1693978232,2
1694151031,1
1694323834,2
1694496634,2
1694583036,2
1694669436,2
1694755834,2
1694842234,2
1694928634,2
1704436239,3
1705041045,3
1708583454,2
1711261844,1
1728970254,1
1729747853,1
1730356254,1
