1650004228,1
1650090628,6
1650177150,5
1650263549,5
1650349831,4
1650436229,8
1650522756,8
1650609163,9
1650695550,1
1650781953,9
1650868349,12
1650954630,15
1651041030,21
1651127552,11
1651213951,19
1651300352,12
1651386755,14
1651473034,5
1651559564,13
1651645850,12
1651732362,11
1651818753,16
1651905153,15
1651991564,5
1652077954,4
1652164360,6
1652250764,4
1652337032,6
1652423553,8
1652509832,5
1652596232,8
1652682759,12
1652769160,16
1652855561,18
1652941964,21
1653028353,27
1653114753,22
1653201159,12
1653287558,21
1653373954,17
1653460234,17
1653546755,15
1653633154,19
1653719553,17
1653805957,19
1653892236,20
1653978755,5
