1659335565,6
1659364847,6
1659421963,28
1659451128,28
1659508368,29
1659537519,29
1659594767,18
1659624049,18
1659681160,14
1659710444,14
1659767561,9
1659796845,9
1659853840,14
1659883130,14
1659940369,28
1659969638,28
1660026647,25
1660056049,25
