1682919107,16
1683005499,26
1683091901,145
1683178309,154
1683264713,147
1683351101,291
1683437506,122
1683523904,258
1683610328,392
1683696716,137
1683783116,200
1683869508,148
1683955918,154
1684042308,187
