1688103041,1
1688621445,1
1688707844,2
1688794245,2
1688880644,2
1688967042,4
1689053441,4
1689139840,4
1689226241,4
1689312653,4
1689744640,4
1689831044,4
1689917446,4
1690003846,4
1690263047,4
1690522245,2
1690867847,4
1691127048,4
1692423035,1
1692509432,1
1697002242,1
1697088641,1
1697175042,1
1697261447,1
1697347842,1
1698474646,1
1698561046,1
1698647445,1
1699684239,1
1699770639,1
1700807441,2
1700893840,1
1700980240,1
1726551051,2
1730874652,1
