1688621445,1
1689485439,1
1690176650,1
1690349447,1
1694064634,2
1695619839,1
1697088641,1
1698298245,1
1699943446,1
1700289040,2
1700721041,2
1700893840,1
1701930638,1
1703140241,2
1703658641,2
1707633051,2
1707978650,1
1710484249,1
1711261844,1
1712295052,3
1713677452,1
1715146260,1
1718022118,8
1718083857,5
1718343064,2
1720330245,1
1721280649,2
1721712651,1
1723095049,1
1724131846,3
1725859849,1
1726983051,2
1727415052,3
1730183452,4
1730615453,3
1730874652,5
1731565854,1
