1662013964,7
1662043246,7
1662100359,2
1662129642,2
1662186760,2
1662216045,2
1662273039,2
1662302447,2
1662359559,5
1662388727,5
1662532358,2
1662561643,2
1662618758,2
1662647931,2
1662705164,2
1662734437,2
1662791558,64
1662820724,64
1662877847,4
1662907237,4
1662964357,2
1662993645,2
1663050638,3
1663080057,3
1663137169,2
1663166448,2
1663223564,3
1663252844,3
1663309969,4
1663339237,4
1663396358,4
1663425653,4
1663569159,27
1663598447,27
