1687757568,108
1687843969,421
1687930377,719
1688016807,143
1688103218,108
1688189597,13
1688275996,13
1688362412,64
1688535215,67
1688621614,33
1688708029,170
1688794420,14
1688880821,14
1688967219,23
1689053626,54
1689140028,22
1689226424,21
1689312837,19
1689399195,14
1689485597,14
1689572000,55
1689658397,159
1689744807,39
1689831241,54
1689917640,30
1690004042,14
1690090404,14
1690176817,85
1690263240,174
1690349617,26
1690436012,82
1690522443,145
1690608808,19
1690695212,14
1690781617,91
1690868047,110
1690954421,128
1691040818,21
1691127250,393
1691213630,14
1691300015,14
1691386395,73
1691472821,374
1691559206,58
1691645653,77
1691732035,65
1691818443,14
1691904834,64
1691991184,170
1692077570,437
1692163972,66
1692250382,1811
1692336773,321
1692423180,13
1692509573,13
1692595944,89
1692682368,161
1692768764,281
1692855167,65
1692941568,603
1693027980,13
1693114356,13
1693200777,78
1693287141,797
1693373568,507
1693459952,416
1693546364,104
1693632754,24
1693719144,2
1693805540,219
1693891949,477
1693978362,222
1694064749,453
1694151151,820
1694237547,15
1694323959,4
1694410362,266
1694496769,220
1694583178,87
1694669562,125
1694755972,215
1694842363,13
1694928766,2
1695015165,1491
1695187975,114
1695274380,1258
1695360784,374
1695447164,11
1695533586,34
1695619990,1430
1695706406,2044
1695792808,2469
1695879218,153
1695965624,270
1696052011,2
1696138408,13
1696224807,102
1696311219,345
1696397621,820
1696484041,1364
1696570435,877
1696656841,14
1696743237,13
1696829644,723
1696916048,365
1697002439,235
1697088838,251
1697175238,630
1697261644,13
1697348050,19
1697434425,4064
1697520844,182
1697607247,87
1697693651,400
1697780021,118
1697866447,13
1697952848,17
1698039229,219
1698125641,895
1698212053,180
1698298423,144
1698384826,471
1698474862,15
1698561261,13
1698647660,1037
1698734051,854
1698820440,186
1698906836,471
1698993260,47
1699079643,13
1699166057,13
1699252467,91
1699338847,815
1699425254,690
1699511642,1031
1699598052,996
1699684453,15
1699770845,13
1699857241,715
1699943653,1088
1700030030,484
1700116443,1259
1700202865,310
1700289223,15
1700375637,14
1700462021,98
1700548451,383
1700634836,414
1700721246,287
1700807657,255
1700894058,14
1700980458,13
1701066868,690
1701239661,510
1701326039,13
