1679639432,3
1679722230,4
1679808631,4
1679981431,2
1680067829,4
1680154230,3
1680240629,3
1680327029,5
1680413427,5
1680499830,4
1680586231,4
1680672631,4
1680759032,4
1680845434,4
1680931831,4
1681018231,2
1681104631,3
1681191033,5
1681277433,4
1681363834,2
1681450235,4
1681536635,4
1681623032,4
1681709434,4
1681795835,3
1681882234,5
1681968635,4
1682055034,4
1682141433,2
1682227834,4
1682314235,4
1682400635,2
1682487032,5
1682573432,2
1682659832,4
1682746233,4
1682832633,4
1682919034,4
1683005434,3
1683091833,4
1683264631,4
1683351031,3
1683437432,4
1683523832,3
1683610233,5
1683696632,1
1683783032,3
1683869438,4
1683955833,2
1684042234,4
1685544705,2
1685597429,3
1685683833,3
1685770233,3
1685856632,1
1685943031,2
1686029431,1
1686115831,2
1686202233,2
1686288634,1
1686375033,3
1686461431,3
1686547832,1
1686634231,3
1686720636,1
1686807032,4
1686893441,3
1686979840,3
1687066239,2
1687152641,4
1687239039,2
1687411840,2
1687498241,2
1687584640,2
1687671039,1
1687757437,2
1687843838,4
1687930240,2
1688016640,1
1688103041,1
1688189452,1
1688275841,2
1688362240,1
1688535044,2
1688621445,2
1688707844,1
1688794245,2
1688880644,2
1688967042,1
1689053441,2
1689139840,1
1689226241,1
1689312653,3
1689399039,2
1689485439,3
1689571840,2
1689658239,2
1689744640,2
1689831044,1
1689917446,1
1690003846,2
1690090245,3
1690176650,3
1690263047,2
1690349447,1
1690435846,2
1690522245,1
1690608645,2
1690695045,2
1690781448,4
1690867847,1
1690954248,3
1691040648,3
1691127048,2
1691299847,4
1691472645,4
1691559043,2
1691645448,2
1691731846,1
1691818247,2
1691904646,2
1691991040,1
1692077440,2
1692163831,1
1692250233,3
1692336633,2
1692423035,2
1692509432,1
1692682233,2
1692768633,1
1692855035,2
1692941433,2
1693027839,1
1693114233,3
1693200633,1
1693373437,2
1693459835,4
1693546239,1
1693632645,2
1693719037,4
1693805431,2
1693891835,2
1693978232,1
1694064634,2
1694151031,1
1694237434,2
1694323834,1
1694410234,2
1694496634,1
1694583036,1
1694669436,3
1694842234,1
1694928634,1
1695015035,1
1695187834,1
1695274234,2
1695360634,1
1695447034,1
1695533434,1
1695706241,2
1695792643,1
1695879053,2
1695965441,1
1696051841,2
1696138241,1
1696224642,1
1696397445,2
1696483842,1
1696570241,3
1696656645,1
1696743043,3
1696829444,2
1697002242,2
1697088641,2
1697347842,2
1697434244,1
1697520642,1
1697607044,1
1697693444,1
1697779843,1
1697866244,2
1697952644,1
1698039045,2
1698125444,2
1698211845,2
1698298245,1
1698384642,2
1698474646,1
1698561046,1
1698647445,1
1698733843,1
1698820251,1
1698906644,2
1698993045,2
1699079441,2
1699165843,1
1699252253,1
1699338639,2
1699425038,1
1699511438,3
1699597838,2
1699684239,1
1699770639,1
1699857040,1
1699943446,3
1700029845,2
1700116239,1
1700202637,1
1700289040,3
1700375440,2
1700461838,1
1700548240,2
1700634640,1
1700721041,1
1700807441,2
1700893840,1
1700980240,3
1701066641,1
1701239442,1
1701325840,1
1701412240,1
1701498639,3
1701585040,2
1701671441,2
1701757841,1
1701930638,1
1702017040,1
1702103440,3
1702189840,1
1702276251,1
1702362639,2
1702449040,2
1702535444,1
1702621850,1
1702708241,1
1702794640,2
1702881040,2
1702967450,1
1703053840,2
1703140241,1
1703226640,1
1703313041,2
1703399442,1
1703572241,3
1703658641,2
1703745040,1
1703831442,1
1703917841,1
1704004241,1
1704090642,2
1704177040,1
1704263440,2
1704349840,1
1704436239,1
1704522640,1
1704609039,2
1704695446,1
1704781855,2
1704868244,1
1704954645,1
1705041045,2
1705127446,2
1705300246,1
1705386645,1
1705473046,1
1705559446,2
1705645846,1
1705732246,1
1705818647,1
1705905046,2
1705991446,2
1706077848,1
1706164249,2
1706250646,1
1706337052,2
1706423450,2
1706509853,1
1706596254,1
1706682653,2
1706769066,2
1706855451,1
1706941851,1
1707028260,1
1707114652,2
1707201051,1
1707287450,1
1707373846,1
1707460251,1
1707546652,1
1707633051,3
1707805853,1
1707892254,3
1707978650,2
1708065054,1
1708151451,1
1708237849,1
1708324253,1
1708410644,1
1708497044,1
1708583454,1
1708669850,1
1708756257,2
1708842649,2
1708929053,3
1709015454,1
1709101860,2
1709188256,1
1709274654,1
1709361052,1
1709447452,1
1709533851,1
1709620251,2
1709706650,1
1709793052,2
1710052251,2
1710225056,1
1710311452,2
1710397854,1
1710484249,1
1710570649,1
1710657050,1
1710743450,2
1710829851,1
1710916249,1
1711002651,1
1711089048,1
1711175450,1
1711261844,1
1711348246,2
1711434657,1
1711521045,1
1711607445,1
1711693844,1
1711776649,1
1711863050,3
1711949450,3
1712035850,2
1712122273,2
1712208660,2
1712295052,1
1712381450,2
1712467850,3
1712554251,2
1712640649,2
1712727049,3
1712813449,2
1712899850,3
1712986252,2
1713072653,1
1713159052,1
1713245451,3
1713331852,2
1713418260,3
1713504653,1
1713591051,1
1713677452,1
1713763854,1
1713850252,1
1713936654,3
1714023055,3
1714109453,2
1714195863,2
1714282254,3
1714368659,3
1714455052,2
1714541454,1
1714714252,1
1714800655,3
1714887055,2
1714973453,1
1715059856,3
1715146260,3
1715232665,3
1715319121,1
1715405462,2
1715491864,1
1718022118,3
1718083857,3
1718170259,1
1718256669,3
1718343064,2
1718429457,2
1718515859,2
1718602257,2
1718688659,2
1718775058,1
1718861458,2
1718947860,2
1719034258,1
1719120657,2
1719207047,2
1719293448,2
1719379849,3
1719466247,2
1719552647,2
1719639047,2
1719725446,2
1719811846,3
1719898247,1
1719984647,1
1720071049,1
1720157449,2
1720243849,2
1720330245,1
1720416649,1
1720503049,3
1720589449,2
1720675849,2
1720762249,1
1720935048,1
1721021447,2
1721107850,3
1721194248,2
1721280649,3
1721367051,1
1721453448,2
1721539849,2
1721626248,1
1721712651,1
1721799049,1
1721885449,1
1721971847,1
1722058248,1
1722144650,3
1722231051,1
1722317451,1
1722403851,1
1722490250,1
1722576648,1
1722663050,1
1722749450,1
1722835849,1
1722922247,1
1723008649,1
1723095049,1
1723181449,1
1723267849,1
1723354248,2
1723440651,2
1723613452,2
1723699847,1
1723786250,2
1723872647,1
1723959048,1
1724045446,1
1724131846,1
1724218249,1
1724304649,1
1724391048,2
1724477449,1
1724563847,1
1724650249,1
1724736648,2
1724823048,1
1724995846,1
1725082248,1
1725168647,1
1725255050,2
1725341448,1
1725427848,1
1725514248,1
1725600651,2
1725687049,1
1725773450,1
1725859849,2
1725946251,1
1726032651,1
1726119049,1
1726205448,1
1726291851,1
1726378249,1
1726464648,1
1726551051,1
1726637450,1
1726723852,1
1726810249,1
1726896651,1
1726983051,1
1727069449,2
1727242251,1
1727328651,1
1727501449,1
1727587850,1
1727674250,2
1727760651,1
1727847052,1
1727933451,1
1728019853,1
1728106253,1
1728192652,1
1728279054,1
1728365452,1
1728451854,1
1728538253,2
1728624654,1
1728711053,1
1728883856,1
1728970254,2
1729056653,1
1729143053,1
1729229452,1
1729315851,1
1729402253,1
1729488653,1
1729575053,1
1729661454,1
1729747853,1
1729834253,1
1729924251,1
1730010649,1
1730097050,1
1730183452,1
1730269853,1
1730356254,1
1730442652,1
1730529053,1
1730615453,1
1730701851,1
1730788251,1
1730874652,2
1730961053,1
1731047452,1
1731133849,1
1731220250,1
1731306649,1
1731393053,1
1731479453,1
1731652254,1
1731738652,1
1731825055,1
1731911451,1
1731997855,1
1732084253,1
1732257053,1
1732343452,1
1732429852,1
1732516250,1
1732602651,1
1732775454,1
1732861859,1
1732948260,1
1733034659,1
1733293861,1
