1646807431,9
1646893952,143
1646980230,485
1647066751,103
1647153150,368
1647239550,123
1647325952,523
1647412352,171
1647498752,606
1647585151,181
1647757954,152
1647844355,186
1647930752,155
1648017150,227
1648103550,377
1648189831,137
1648276229,247
1648362752,149
1648449033,155
1648535442,146
1648621952,183
1648708231,267
