1676529061,16
1676788249,3
1676874662,3
1676961061,3
1677479458,4
1678170666,4
1678343445,12
1679569142,6
1679584407,6
1679589867,6
1679596494,6
1679602915,6
1679607956,6
1679639532,19
1679722309,3
1679808717,15
1679895117,4
1679981518,5
1680067912,5
1680154308,6
1680240714,6
1680327097,6
1680413504,3
1680499902,5
1680586299,8
1680672702,7
1680759104,5
1680845523,4
1680931899,5
1681018301,6
1681104713,4
1681191117,5
1681277516,8
1681363906,7
1681450306,4
1681536706,5
1681623105,4
1681709528,6
1681795909,16
1681882326,5
1681968706,6
1682055103,14
1682141505,7
1682227910,6
1682314324,4
1682400707,12
