1722663315,1
1722749743,63
1722836105,45
1722922512,3
1723008910,16
1723095317,10
1723181712,107
1723268105,30
1723354509,12
1723440921,3
1723527316,47
1723613721,45
1723700119,4
1723786513,6
1723872909,9
1723959316,63
1724045707,53
