1695187834,1
1695274234,1
1695360634,1
1695533434,1
1695619839,1
1695965441,1
1696051841,1
1696483842,1
1696570241,1
1696656645,1
1696743043,1
1696829444,1
1696915841,1
1697002242,1
1697088641,1
1697175042,1
1697261447,1
1697347842,1
