1651386755,8
1651473034,21
1651559564,16
1651645850,29
1651732362,27
1651818753,30
1651905153,16
1651991564,24
1652077954,16
1652164360,15
1652250764,16
1652337032,20
1652423553,13
1652509832,14
1652596232,9
1652682759,7
