1636895594,7
1636898490,7
1636900709,7
1637070326,7
1637070818,9
1637072812,23
1637122028,24
1637208446,34
1637294806,19
1637381227,9
1637467621,32
1637554087,9
1637589848,9
1637726914,10
1637813369,12
1638072517,10
1638158887,12
1638245235,11
1638331638,21
1639904549,3
1639907950,3
1639980923,14
1639983233,14
1639985995,14
1640059226,15
1640080313,15
1640145685,11
1640232083,11
1640318424,13
1640404823,14
1640491284,12
1640577691,16
1640664024,10
1640750484,14
1640836884,19
1640923223,14
1641009626,16
1641096084,13
1641182484,14
1641268824,12
1641355224,10
1641441684,15
1641528084,7
1641700884,10
1641787224,17
1641873686,13
1642392088,13
1642408942,13
1642478484,15
1642564885,6
1642651226,17
1642676514,17
1642805851,16
1642824026,15
1642855125,15
1642910490,17
1642924655,17
1642934565,17
1642937864,17
1642996892,21
1643083292,8
1643169628,6
1643256090,10
1643342487,17
1643428827,8
1643515288,9
1643601634,9
1643622207,9
1643688028,13
1643708607,13
1643774489,13
1643860889,10
1643947288,7
1644033629,25
1644120088,10
1644206493,8
1644292831,12
1644321030,12
1644388289,21
1644407490,21
1644474692,14
1644493888,14
1644561030,15
1644647492,15
1644733834,20
1644770508,20
1644820292,31
1644906689,14
1644993090,21
1645079499,12
1645165829,9
1645252290,10
1645338629,11
1645425030,12
1645467113,12
1645470826,12
1645511492,18
1645597892,13
1645684232,14
1645770629,8
1645857150,46
1645943553,18
1646029893,13
1646116237,9
1646202760,12
1646289033,17
1646375551,41
1646461951,11
1646548229,11
1646634751,14
1646721161,9
1646807431,61
1646893952,28
1646980230,10
1647066751,24
1647153150,12
1647239550,13
1647325952,12
1647412352,21
1647498752,21
1647585151,57
1647757954,17
1647844355,13
1647930752,17
1648017150,9
1648103550,13
1648189831,14
1648276229,54
1648362752,11
1648449033,17
1648535442,13
1648621952,14
1648708231,14
1648794750,10
1648881149,17
1648967561,14
1649053832,10
1649140351,15
1649226751,13
1649313029,13
1649399549,15
1649485949,10
1649572354,72
1649658750,13
1649745150,15
1649831565,30
1649917950,12
1650004228,7
1650090628,11
1650177150,14
1650263549,17
1650349831,22
1650436229,20
1650522756,12
1650609163,14
1650695550,9
1650781953,22
1650868349,16
1650954630,32
1651041030,13
1651127552,9
1651213951,23
1651300352,12
1651386755,13
1651473034,13
1651559564,30
1651645850,9
1651732362,9
1651818753,9
1651905153,11
1651991564,12
1652077954,48
1652164360,9
1652250764,12
1652337032,11
1652423553,9
1652509832,16
1652596232,11
1652682759,14
1652769160,12
1652855561,14
1652941964,12
1653028353,10
1653114753,12
1653201159,13
1653287558,51
1653373954,15
1653460234,19
1653546755,12
1653633154,26
1653719553,12
1653805957,12
1653892236,10
1653978755,12
1654065033,13
1654151553,13
1654237831,13
1654324351,12
1654410631,13
1654497153,57
1654583555,10
1654669837,14
1654756356,14
1654842756,56
1654929156,13
1655015436,15
1655101838,9
1655188357,14
1655274636,15
1655361158,14
1655447555,12
1655533836,17
1655620256,25
1655706645,22
1655793158,11
1655879557,18
1655965955,35
1656052365,13
1656138754,15
1656225155,34
1656311556,11
1656397956,28
1656484356,17
1656570758,11
1656743558,40
1656829841,13
1656916357,19
1657002637,40
1657089163,12
1657175559,14
1657261838,54
1657348240,11
1657434758,167
1657521164,12
1657607566,16
1657693957,16
1657780357,113
1657803090,113
1657804447,113
1657809517,113
1657866760,39
1657896040,39
1657953158,17
1657982325,17
1658039438,18
1658068726,18
1658125843,22
1658155247,22
1658212362,108
1658241661,108
1658298758,197
1658328052,197
1658385041,107
1658414447,107
1658471560,194
1658500847,194
1658557962,108
1658587247,108
1658644360,17
1658673645,17
1658730762,46
1658760045,46
1658817160,18
1658846453,18
1658903439,18
1658932848,18
1658989840,19
1659019246,19
1659076365,23
1659105646,23
1659162770,19
1659192044,19
1659249159,19
1659278470,19
1659335565,26
1659364847,26
1659421963,28
1659451128,28
1659508368,26
1659537519,26
1659594767,47
1659624049,47
1659681160,25
1659710444,25
1659767561,28
1659796845,28
1659853840,19
1659883130,19
1659940369,28
1659969638,28
1660026647,18
1660056049,18
1660113163,21
1660142439,21
1660199441,21
1660228849,21
1660285970,43
1660315250,43
1660372250,27
1660401521,27
1660458761,25
1660488049,25
1660545162,119
1660574449,119
1660631564,25
1660660730,25
1660717841,25
1660747248,25
1660804362,24
1660833647,24
1660890760,57
1660920046,57
1660977162,29
1661006455,29
1661063442,25
1661092854,25
1661149842,24
1661179125,24
1661236366,21
1661265647,21
1661322641,29
1661352051,29
1661409162,23
1661438449,23
1661495561,25
1661524735,25
1661581964,26
1661611239,26
1661668363,114
1661697647,114
1661700049,114
1661754784,31
1661784048,31
1661870448,52
1661927560,27
1661956724,27
1662013964,20
1662043246,20
1662100359,26
1662129642,26
1662186760,25
1662216045,25
1662273039,28
1662302447,28
1662359559,21
1662388727,21
1662445958,23
1662475124,23
1662532358,30
1662561643,30
1662618758,16
1662647931,16
1662705164,47
1662734437,47
1662791558,22
1662820724,22
1662877847,18
1662907237,18
1662964357,105
1662993645,105
1663050638,15
1663080057,15
1663137169,18
1663166448,18
1663223564,16
1663252844,16
1663309969,16
1663339237,16
1663396358,20
1663425653,20
1663482759,24
1663512042,24
1663569159,22
1663598447,22
1663655565,18
1663684725,18
1663741840,107
1663771124,107
1663828239,17
1663857524,17
1663914640,35
1663943934,35
1664001039,18
1664030318,18
1664087438,24
1664116722,24
1664173842,18
1664203127,18
1664260251,17
1664289537,17
1664346641,19
1664375951,19
1664433041,15
1664462320,15
1664519554,31
1664548711,31
1664605833,18
1664635111,18
1668081545,19
1668350533,32
1668355972,32
1668356757,32
1668360810,32
1668474184,9
1668560577,11
1668646979,13
1671629111,879
1671630664,879
1671632450,879
1671634011,879
1673516775,16
1674367285,13
1674455475,28
1674541884,23
1674628285,14
1674714694,16
1674801082,11
1674887480,20
1674973872,17
1675060281,14
1675146682,14
1675233071,13
1675319481,11
1675405883,461
1675492281,29
1675578681,11
1675665075,20
1675751474,20
1675837863,8
1676356254,5
1676442661,14
1676529061,14
1676615450,19
1676701857,12
1676788249,17
1676874662,14
1676961061,10
1677047454,17
1677133857,13
1677220262,15
1677306660,11
1677393061,12
1677479458,14
1677565859,10
1677652257,30
1677738657,16
1677825057,9
1677911460,12
1677997847,11
1678084257,13
1678170666,12
1678257055,11
1678343445,38
1679569142,32
1679584407,32
1679589867,32
1679596494,32
1679602915,32
1679607956,32
1679639532,58
1679722309,13
1679808717,13
1679895117,13
1679981518,12
1680067912,17
1680154308,18
1680240714,18
1680327097,19
1680413504,17
1680499902,65
1680586299,20
1680672702,18
1680759104,12
1680845523,12
1680931899,17
1681018301,18
1681104713,14
1681191117,16
1681277516,13
1681363906,14
1681450306,16
1681536706,10
1681623105,24
1681709528,9
1681795909,20
1681882326,15
1681968706,11
1682055103,15
1682141505,10
1682227910,18
1682314324,10
1682400707,23
1682487105,10
