1636895594,18
1636898490,19
1636900709,19
1637070326,8
1637070818,8
1637072812,18
1637122028,21
1637208446,13
1637294806,18
1637381227,26
1637467621,18
1637554087,15
1637589848,15
1637640464,8303
1637726914,16
1637813369,16
1637899638,20
1637986004,14
1638072517,18
1638158887,17
1638245235,14
1638331638,7
