1651300352,12
1651386755,14
1651473034,9
1651559564,31
1651645850,15
1651732362,14
1651818753,11
1651905153,8
1651991564,4
1652077954,5
1652164360,11
1652250764,3
1652337032,4
1652423553,7
1652509832,4
1652596232,2
