1694583036,1
1694669436,1
1694755834,1
1694842234,1
1694928634,1
1700116239,1
1700202637,2
1700548240,1
1700721041,1
1700807441,2
1700893840,1
1700980240,1
1701066641,1
1701239442,1
1701412240,2
1702017040,2
1702621850,1
1703226640,1
1703831442,1
1711089048,1
