1679584314,1
1679589759,1
1679596397,1
1679602819,1
1679607852,1
1679639432,1
1679981431,1
1680845434,1
1683437432,1
1683610233,1
1687498241,1
1688016640,1
1688103041,1
1688362240,1
1688535044,1
1688621445,1
1688707844,1
1688794245,1
1688880644,1
1688967042,1
1689053441,1
1689139840,1
1689226241,1
1689312653,1
1689744640,1
1689831044,1
1689917446,1
1690003846,1
1690263047,1
1690867847,1
1691127048,1
1691645448,1
1691731846,1
1691904646,1
1691991040,1
1692077440,1
1692163831,1
1692250233,1
1692336633,1
1692423035,1
1692509432,1
1692682233,1
1692768633,1
1692855035,1
1692941433,1
1693027839,1
1693114233,1
1693200633,1
1693978232,1
1694323834,1
1694496634,1
1694583036,2
1694755834,1
1694842234,1
1694928634,1
1695274234,2
1695360634,1
1695533434,1
1695619839,1
1695965441,1
1696483842,1
1696743043,1
1696829444,1
1696915841,1
1697002242,1
1697088641,1
1697261447,1
1697347842,1
1697520642,1
1697607044,1
1697693444,1
1697866244,1
1697952644,1
1698211845,1
1698474646,1
1698561046,1
1698647445,1
1698733843,1
1698993045,2
1699079441,1
1699165843,1
1699252253,5
1699338639,1
1699425038,1
1699597838,2
1699684239,1
1699770639,1
1699943446,1
1700029845,1
1700116239,1
1700202637,2
1700548240,1
1700634640,2
1700721041,2
1700807441,4
1700893840,2
1700980240,2
1701066641,2
1701239442,2
1701412240,4
1702017040,2
1702621850,2
1703226640,2
1703831442,2
1704349840,6
1704436239,2
1705041045,1
1705645846,1
1707633051,6
1708583454,1
