1649140351,1
1649226751,6
1649313029,7
1649399549,1
1649485949,11
1649572354,10
1649658750,10
1649745150,11
1649831565,7
1649917950,10
1650004228,5
1650090628,11
1650177150,4
1650263549,14
1650349831,4
1650436229,12
1650522756,11
1650609163,7
1650695550,8
1650781953,13
1650868349,13
1650954630,16
1651041030,20
1651127552,18
1651213951,27
1651300352,24
1651386755,25
1651473034,25
1651559564,9
1651645850,22
1651732362,21
1651818753,22
1651905153,22
1651991564,7
1652077954,13
1652164360,6
1652250764,16
1652337032,5
1652423553,5
1652509832,7
1652596232,7
1652682759,9
1652769160,23
1652855561,25
1652941964,36
1653028353,19
1653114753,6
