1662532358,2
1662561643,2
1662618758,4
1662647931,4
1662705164,4
1662734437,4
1662791558,4
1662820724,4
1662877847,4
1662907237,4
1662964357,4
1662993645,4
1663050638,4
1663080057,4
1663137169,4
1663166448,4
1663223564,4
1663252844,4
1663309969,4
1663339237,4
1663396358,4
1663425653,4
1663482759,4
1663512042,4
1663569159,4
1663598447,4
1663655565,4
1663684725,4
1663741840,4
1663771124,4
1663828239,4
1663857524,4
1663914640,4
1663943934,4
1664001039,4
1664030318,4
1664087438,4
1664116722,4
1664173842,4
1664203127,4
1664260251,4
1664289537,4
1664346641,4
1664375951,4
1664433041,4
1664462320,4
1664519554,4
1664548711,4
1664605833,4
1664635111,4
1668560577,2
1668646979,2
1678170666,4
