1693114356,374
1693200777,205
1693287141,63
1693373568,148
1693459952,239
1693546364,272
1693632754,85
1693719144,241
1693805540,277
1693891949,207
1693978362,247
1694064749,12
1694151151,135
1694237547,193
1694323959,30
1694410362,41
1694496769,41
1694583178,852
1694669562,357
1694755972,234
1694842363,121
1694928766,437
1695015165,221
1695187975,135
1695274380,146
1695360784,497
1695447164,133
1695533586,82
1695619990,45
1695706406,659
1695792808,348
1695879218,298
1695965624,419
1696052011,114
1696138408,76
1696224807,380
1696311219,781
1696397621,179
