1658298758,4
1658328052,4
1658385041,10
1658414447,10
1658471560,10
1658500847,10
1658557962,5
1658587247,5
1658644360,9
1658673645,9
1658730762,12
1658760045,12
1658817160,12
1658846453,12
1658903439,6
1658932848,6
1658989840,7
1659019246,7
1659076365,4
1659105646,4
1659162770,8
1659192044,8
1659249159,7
1659278470,7
1659335565,10
1659364847,10
1659421963,6
1659451128,6
1659508368,5
1659537519,5
1659594767,7
1659624049,7
