1636895594,10
1636898490,10
1636900709,10
1637070326,8
1637070818,8
1637072812,15
1637122028,28
1637208446,14
1637294806,15
1637381227,18
1637467621,16
1637554087,12
1637589848,12
1637640464,25
1637726914,19
1637813369,16
1637899638,28
1637986004,13
1638072517,17
1638158887,13
1638245235,14
1638331638,7
1639904549,2
1639907950,2
1639980923,9
1639983233,9
1639985995,9
1640059226,2
1640080313,2
1640145685,8
1640232083,4
1640318424,4
1640404823,7
1640491284,3
1640577691,6
1640664024,4
1640750484,10
1640836884,4
1640923223,3
