1647066751,13
1647153150,7
1647239550,1
1647325952,3
1647412352,5
1647498752,4
1647585151,3
1647757954,3
1647844355,6
1647930752,4
1648017150,4
1648103550,5
1648189831,3
1648276229,1
1648362752,3
1648449033,4
1648535442,7
1648621952,3
1648708231,2
1648794750,5
1648881149,3
1648967561,1
1649053832,2
1649140351,8
1649226751,7
1649313029,4
1649399549,3
1649485949,6
1649658750,5
1649745150,3
1649831565,6
1649917950,3
1650004228,8
1650090628,5
1650177150,7
1650263549,7
1650349831,1
