1636286412,8
1636286488,8
1636895594,67
1636898490,76
1636900709,76
1637070326,82
1637070818,82
1637072812,97
1637122028,126
1637208446,107
1637294806,110
1637381227,108
1637467621,207
1637554087,155
1637589848,155
1637640464,96
1637726914,182
1637813369,125
1637899638,142
1637986004,247
1638072517,565
1638158887,166
1638245235,137
1638331638,224
1639904549,181
1639907950,181
1639980923,120
1639983233,120
1639985995,120
1640059226,151
1640080313,151
1640145685,120
1640232083,152
1640318424,123
1640404823,228
1640491284,243
1640577691,103
1640664024,125
1640750484,90
1640836884,142
1640923223,112
