1698298423,11
1698384826,20
1698474862,22
1698561261,40
1698647660,34
1698734051,21
1698820440,31
1698906836,22
1698993260,29
1699079643,24
1699166057,25
1699252467,23
1699338847,44
1699425254,27
1699511642,24
1699598052,22
1699684453,22
1699770845,23
1699857241,19
1699943653,6
1700030030,24
1700116443,20
1700202865,24
1700289223,26
1700375637,23
1700462021,19
1700548451,36
1700634836,24
1700721246,22
1700807657,29
1700894058,35
1700980458,20
1701066868,26
1701239661,2
1701326039,20
1701412459,21
1701498834,23
1701585234,22
1701671642,26
1701758036,19
1701930831,28
1702017289,31
1702103633,21
1702190033,23
1702276447,11
