1659249159,15
1659278470,15
1659335565,28
1659364847,28
1659421963,27
1659451128,27
1659508368,26
1659537519,26
1659594767,5
1659624049,5
1659681160,10
1659710444,10
1659767561,22
1659796845,22
1659853840,24
1659883130,24
1659940369,25
1659969638,25
1660026647,32
1660056049,32
1660113163,9
1660142439,9
1660199441,17
1660228849,17
1660285970,29
1660315250,29
1660372250,30
1660401521,30
1660458761,35
1660488049,35
1660545162,7
1660574449,7
