1679639432,1
1679981431,1
1680240629,1
1680845434,1
1682141433,1
1683437432,1
1683610233,1
1688621445,1
1689226241,1
1689312653,2
1689831044,1
1689917446,1
1690003846,1
1690522245,1
1690867847,2
1691127048,2
1691645448,2
1691731846,1
1691818247,1
1691904646,1
1691991040,2
1692077440,2
1692163831,2
1692250233,2
1692336633,2
1692423035,2
1692509432,2
1692682233,2
1692768633,2
1692855035,2
1692941433,2
1693027839,2
1693200633,2
1693978232,2
1694151031,1
1694496634,1
1694583036,2
1694669436,2
1694755834,2
1694842234,2
1694928634,2
1695187834,2
1695274234,2
1695360634,2
1695533434,2
1695619839,2
1695965441,2
1696483842,3
1696570241,3
1696656645,3
1696743043,2
1696829444,3
1696915841,3
1697002242,3
1697088641,3
1697175042,3
1697261447,3
1697347842,3
1697520642,3
1697607044,3
1697693444,3
1697866244,3
1697952644,3
1698211845,1
1698474646,1
1698561046,1
1698647445,1
1698733843,2
1698993045,2
1699079441,1
1699165843,1
1699252253,6
1699425038,1
1699597838,1
1699684239,1
1699770639,1
1699857040,1
1699943446,1
1700116239,1
1700202637,2
1700548240,1
1700721041,1
1700807441,2
1700893840,1
1700980240,1
1701066641,1
1701239442,1
1701412240,2
1702017040,2
1702621850,1
1703226640,1
1703831442,1
1704436239,2
1705041045,2
1705645846,2
1707287450,1
1707978650,1
1708410644,2
1708583454,2
1714109453,1
1722231051,1
1726551051,1
1730874652,1
