1686375108,56
1686461512,719
1686547909,208
1686634309,91
1686720704,94
1686807105,178
1686893562,74
1686979954,95
1687066360,251
1687152774,504
1687239150,490
1687411953,176
1687498393,152
1687584774,117
1687671173,214
1687757568,100
1687843969,150
1687930377,135
1688016807,32
