1640923223,2
1641009626,11
1641096084,4
1641182484,15
1641268824,17
1641355224,14
1641441684,26
1641528084,19
1641700884,17
1641787224,26
1641873686,17
1642305627,17
1642319122,17
1642392088,16
1642408942,16
1642478484,15
