1673516775,18
1674367285,21
1674455475,24
1674541884,12
1674628285,7
1674714694,10
1674801082,16
1674887480,19
1674973872,16
1675060281,7
1675146682,2
1675233071,6
1675319481,10
1675405883,5
1675492281,2
1675578681,4
1675665075,11
1675751474,7
1675837863,4
1676356254,9
1676442661,14
1676529061,12
1676615450,11
1676701857,3
1676788249,3
1676874662,6
1676961061,13
1677047454,7
1677133857,14
1677220262,13
1677306660,6
1677393061,12
1677479458,9
1677565859,9
1677652257,6
1677738657,3
1677825057,4
1677911460,3
1677997847,3
1678084257,5
1678170666,5
1678257055,4
1678343445,16
1679569142,9
1679584407,9
1679589867,9
1679596494,9
1679602915,9
1679607956,9
1679722309,15
1679808717,13
1679895117,17
1679981518,16
1680067912,14
1680154308,7
1680240714,29
1680327097,15
1680413504,8
1680499902,10
1680586299,5
1680672702,6
1680759104,10
1680845523,9
1680931899,11
1681018301,14
1681104713,8
1681191117,10
1681277516,7
1681363906,12
1681450306,10
1681536706,9
1681623105,9
1681709528,7
1681795909,10
1681882326,9
1681968706,29
1682055103,13
1682141505,14
1682227910,16
1682314324,8
1682400707,9
1682487105,7
1682573524,18
1682659898,9
1682746309,28
1682832700,9
1682919107,8
1683005499,9
1683091901,14
1683178309,8
1683264713,9
1683351101,9
1683437506,18
1683523904,9
1683610328,16
1683696716,9
1683783116,6
1683869508,7
1683955918,12
1684042308,14
1685544777,37
1685597496,16
1685683902,22
1685770303,17
1685856701,22
1685943100,22
1686029502,10
1686115904,27
1686202306,21
1686288711,24
1686375108,24
1686461512,28
1686547909,23
1686634309,28
1686720704,18
1686807105,17
1686893562,4
1686979954,6
1687066360,7
1687152774,8
1687239150,11
1687411953,11
1687498393,17
1687584774,10
1687671173,6
1687757568,15
1687843969,11
1687930377,7
1688016807,16
1688103218,16
1688189597,5
1688275996,6
1688362412,10
1688535215,8
1688621614,4
1688708029,16
1688794420,15
1688880821,9
1688967219,15
1689053626,3
1689140028,16
1689226424,8
1689312837,11
1689399195,5
1689485597,4
1689572000,9
1689658397,11
1689744807,13
1689831241,11
1689917640,2
1690004042,8
1690090404,10
1690176817,16
1690263240,13
1690349617,19
1690436012,20
1690522443,9
1690608808,23
1690695212,19
1690781617,19
1690868047,14
1690954421,6
1691040818,14
1691127250,8
1691213630,9
1691300015,9
1691386395,10
1691472821,18
1691559206,11
1691645653,10
1691732035,13
1691818443,6
1691904834,8
1691991184,6
1692077570,15
1692163972,12
1692250382,11
1692336773,8
1692423180,11
1692509573,13
1692595944,4
1692682368,23
1692768764,4
1692855167,4
1692941568,10
1693027980,2
1693114356,10
1693200777,15
1693287141,2
1693373568,9
1693459952,6
1693546364,8
1693632754,14
1693719144,10
1693805540,7
1693891949,7
1693978362,7
1694064749,12
1694151151,10
1694237547,15
1694323959,9
1694410362,6
1694496769,6
1694583178,7
1694669562,8
1694755972,14
1694842363,7
1694928766,10
1695015165,6
1695187975,8
1695274380,3
1695360784,3
1695447164,6
1695533586,2
1695619990,7
1695706406,11
1695792808,14
1695879218,10
1695965624,8
1696052011,6
1696138408,9
1696224807,5
1696311219,4
1696397621,7
1696484041,4
1696570435,6
1696656841,7
1696743237,2
1696829644,17
1696916048,3
1697002439,6
1697088838,7
1697175238,16
1697261644,4
1697348050,4
1697434425,11
1697520844,5
1697607247,6
1697693651,14
1697780021,11
1697866447,7
1697952848,7
1698039229,4
1698125641,10
1698212053,6
1698298423,7
1698384826,3
1698474862,4
1698561261,6
1698647660,5
1698734051,8
1698820440,4
1698906836,9
1698993260,9
1699079643,15
1699166057,4
1699252467,9
1699338847,7
1699425254,4
1699511642,8
1699598052,26
1699684453,15
1699770845,14
1699857241,12
1699943653,11
1700030030,8
1700116443,4
1700202865,7
1700289223,9
1700375637,8
1700462021,6
1700548451,4
1700634836,7
1700721246,12
1700807657,25
1700894058,6
1700980458,2
1701066868,15
1701239661,4
1701326039,5
1701412459,7
1701498834,9
1701585234,8
1701671642,7
1701758036,13
1701930831,12
1702017289,10
1702103633,10
1702190033,11
1702276447,4
1702362833,8
1702449238,7
1702535641,10
1702622071,6
1702708433,3
1702794843,6
1702881239,7
1702967665,2
1703054037,14
1703140439,14
1703226865,12
1703313245,10
1703399641,15
1703572441,9
1703658841,9
1703745239,6
1703831661,6
1703918046,22
1704004443,7
1704090847,8
1704177241,13
1704263638,11
1704350037,12
1704436450,9
1704522832,5
1704609231,11
1704695681,14
1704782089,5
1704868474,8
1704954878,10
1705041294,10
1705127674,23
1705300477,6
1705386877,11
1705473291,7
1705559692,3
1705646097,7
1705732479,19
1705818877,4
1705905294,13
1705991686,15
1706078101,2
1706164491,11
1706250972,12
1706337342,40
1706423747,9
1706510148,6
1706596552,13
1706682956,6
1706769366,5
1706855781,14
1706942169,7
1707028569,9
1707114964,9
1707201363,6
1707287760,5
1707374158,7
1707460602,5
1707546967,15
1707633370,7
1707719770,6
1707806171,19
1707892577,13
1707978960,15
1708065403,12
1708151763,4
1708238171,10
1708324568,5
1708410859,3
1708497318,4
1708583778,3
1708670174,15
1708756568,9
1708842965,13
1708929366,6
1709015768,8
1709102173,8
1709188566,5
1709275007,8
1709361374,13
1709447776,6
1709534155,6
1709620564,11
1709706962,7
1709793367,20
1709966169,5
1710052561,8
1710138969,9
1710225362,9
1710311773,13
1710398159,15
1710484595,3
1710570954,5
1710657364,3
1710743767,6
1710830176,3
1710916554,7
1711002952,7
1711089395,12
1711175767,9
1711262153,6
1711348567,6
1711434966,5
1711607758,5
1711694155,12
1711776969,11
1711863379,8
1711949767,3
1712036181,7
1712122595,7
1712209001,8
1712295387,11
1712381761,5
1712468183,3
1712554571,6
1712640970,10
1712727387,4
1712813813,3
1712900232,11
1712986589,3
1713073014,7
1713159410,13
1713245803,17
1713332196,9
1713418604,11
1713505010,9
1713591405,4
1713677807,6
1713764197,12
1713850601,7
1713937016,11
1714023425,14
1714109816,9
1714196216,2
1714282602,4
1714369033,4
1714455398,8
1714541804,8
1714714600,10
1714801009,1
1714887409,4
1714973810,2
1715060210,18
1715146632,13
1715233058,8
1715319563,2
1715405851,15
1715492244,11
1718022496,14
1718084230,24
1718170636,16
1718257047,12
1718343427,3
1718429818,11
1718516215,6
1718602645,8
1718689022,12
1718775431,8
1718861831,7
1718948217,9
1719034629,8
1719121031,6
1719207304,4
1719293732,13
1719380130,5
1719466523,10
1719552933,16
1719725705,2
1719812104,9
1719898511,8
1719984907,9
1720071331,5
1720157731,17
1720244127,6
1720330509,8
1720416929,15
1720503328,5
1720589730,4
1720676127,6
1720762554,16
1720935328,21
1721021712,20
1721108139,8
1721194539,8
1721280942,18
1721367339,8
1721453736,9
1721540139,5
1721626512,9
1721712930,6
1721799317,13
1721885729,6
1721972116,12
1722058513,4
1722144941,4
1722231340,18
1722317737,16
1722404147,6
1722490541,14
1722576933,9
1722663315,6
1722749743,9
1722836105,8
1722922512,2
1723008910,16
1723095317,8
1723181712,18
1723268105,6
1723354509,1
1723440921,8
1723527316,6
1723613721,6
1723700119,9
1723786513,7
1723872909,9
1723959316,6
1724045707,2
1724132118,9
1724218520,6
1724304925,8
1724391319,7
1724477730,10
1724564111,5
1724650531,4
1724736906,3
1724823316,12
1724909717,8
1724996108,7
1725082506,8
1725168909,11
1725255319,12
1725341717,8
1725428109,7
1725514506,392
1725600914,31
1725687306,19
1725773707,19
1725860113,4
1725946519,8
1726032920,5
1726119315,15
1726205705,6
1726292115,2
1726378512,8
1726464916,6
1726551329,13
1726637718,13
1726724132,3
1726810515,4
1726896925,4
1726983322,10
1727069719,27
1727156114,11
1727242538,9
1727328917,9
1727415326,14
1727501713,3
1727588116,17
1727674524,6
1727760922,15
1727847333,7
1727933723,5
1728020122,2
1728106547,3
1728192945,1
1728279336,6
1728365743,3
1728452151,3
1728538537,15
1728624938,6
1728711328,24
1728797737,11
1728884126,4
1728970539,6
1729056925,6
1729143336,13
1729229724,18
1729316123,24
1729402521,16
1729488952,14
1729575323,13
1729661730,15
1729748135,16
1729834546,16
1729924541,14
1730010943,21
1730097332,7
1730183730,13
1730270141,10
1730356536,18
1730442925,18
1730529338,11
1730615759,32
1730702128,16
1730788525,17
1730874965,29
1730961326,15
1731047722,18
1731134141,28
1731220531,10
1731306938,12
1731393338,9
1731479747,10
1731566125,16
1731652532,20
1731738930,13
1731825326,12
1731911726,22
1731998131,19
1732084532,11
1732170946,12
1732257343,22
1732343726,15
1732430128,23
1732516530,10
1732602931,31
1732689332,15
1732775733,13
1732862185,7
1732948585,22
1733034986,29
1733121412,28
1733207816,32
1733294214,7
