1683783032,1
1684042234,1
1685544705,1
1685856632,1
1685943031,1
1686202233,1
1686375033,1
1686634231,1
1686720636,1
1686807032,1
1686893441,1
1686979840,1
1687239039,1
1687671039,1
1687843838,1
1688189452,1
1688275841,1
1698125444,1
1711863050,1
1725341448,1
1726551051,1
1732170653,6
1732257053,1
