1652682759,24
1652769160,639
1652855561,1441
1652941964,1440
1653028353,1441
1653114753,1441
1653201159,1441
1653287558,1441
1653373954,1441
1653460234,1441
1653546755,1441
1653633154,1441
1653719553,1441
1653805957,1441
1653892236,1441
1653978755,1441
1654065033,1441
1654151553,1441
1654237831,1441
1654324351,1441
1654410631,1441
1654497153,1441
1654583555,1439
1654669837,1441
1654756356,1441
1654842756,1441
1654929156,1441
1655015436,1441
1655101838,1441
1655188357,1441
1655274636,1441
1655361158,1441
1655447555,1441
1655533836,1441
1655620256,1441
1655706645,1441
1655793158,1450
1655879557,1441
1655965955,1441
1656052365,1441
1656138754,1441
1656225155,1441
1656311556,1482
1656397956,1527
1656484356,1461
1656570758,1495
1656743558,1480
1656829841,1506
1656916357,1513
1657002637,1488
1657089163,1485
1657175559,1496
1657261838,1493
1657348240,1472
1657434758,1472
1657521164,1483
1657607566,1474
1657693957,1477
1657780357,1511
1657803090,1511
1657804447,1511
1657809517,1511
1657866760,1483
1657896040,1483
1657953158,1460
1657982325,1460
1658039438,1475
1658068726,1475
1658125843,1492
1658155247,1492
1658212362,1484
1658241661,1484
1658298758,1477
1658328052,1477
1658385041,1487
1658414447,1487
1658471560,1464
1658500847,1464
1658557962,1458
1658587247,1458
1658644360,1475
1658673645,1475
1658730762,1482
1658760045,1482
1658817160,1485
1658846453,1485
1658903439,1460
1658932848,1460
1658989840,1475
1659019246,1475
1659076365,1477
1659105646,1477
1659162770,1462
1659192044,1462
1659249159,1495
1659278470,1495
1659335565,1485
1659364847,1485
1659421963,1470
1659451128,1470
1659508368,1481
1659537519,1481
1659594767,1485
1659624049,1485
1659681160,1474
1659710444,1474
1659767561,1466
1659796845,1466
1659853840,1469
1659883130,1469
1659940369,1519
1659969638,1519
1660026647,1498
1660056049,1498
1660113163,1468
1660142439,1468
1660199441,1487
1660228849,1487
1660285970,1554
1660315250,1554
1660372250,1463
1660401521,1463
1660458761,1483
1660488049,1483
1660545162,1551
1660574449,1551
1660631564,1645
1660660730,1645
1660717841,1591
1660747248,1591
1660804362,1639
1660833647,1639
1660890760,1530
1660920046,1530
1660977162,1469
1661006455,1469
1661063442,1468
1661092854,1468
1661149842,1555
1661179125,1555
1661236366,1480
1661265647,1480
1661322641,1513
1661352051,1513
1661409162,1512
1661438449,1512
1661495561,1477
1661524735,1477
1661581964,1503
1661611239,1503
1661668363,1484
1661697647,1484
1661700049,1484
1661754784,1490
1661784048,1490
1661870448,1487
1661927560,1480
1661956724,1480
1662013964,1472
1662043246,1472
1662100359,1498
1662129642,1498
1662186760,1493
1662216045,1493
1662273039,1467
1662302447,1467
1662359559,1469
1662388727,1469
1662445958,1498
1662475124,1498
1662532358,1558
1662561643,1558
1662618758,1639
1662647931,1639
1662705164,1625
1662734437,1625
1662791558,1587
1662820724,1587
1662877847,1487
1662907237,1487
1662964357,1508
1662993645,1508
1663050638,1485
1663080057,1485
1663137169,1490
1663166448,1490
1663223564,1536
1663252844,1536
1663309969,1550
1663339237,1550
1663396358,1550
1663425653,1550
1663482759,1521
1663512042,1521
1663569159,1603
1663598447,1603
1663655565,1626
1663684725,1626
1663741840,1524
1663771124,1524
1663828239,1550
1663857524,1550
1663914640,1622
1663943934,1622
1664001039,1512
1664030318,1512
1664087438,1544
1664116722,1544
1664173842,1524
1664203127,1524
1664260251,1555
1664289537,1555
1664346641,1506
1664375951,1506
1664433041,1500
1664462320,1500
1664519554,1504
1664548711,1504
1664605833,1504
1664635111,1504
1668081545,1844
1668350533,1822
1668355972,1822
1668356757,1822
1668360810,1822
1668474184,1817
1668560577,1870
1668646979,1846
1671629111,1803
1671630664,1803
1671632450,1803
1671634011,1803
1673516775,1832
1674367285,1813
1674455475,1809
1674541884,1788
1674628285,1789
1674714694,1796
1674801082,1813
1674887480,1771
1674973872,1770
1675060281,1784
1675146682,1783
1675233071,1802
1675319481,1856
1675405883,1909
1675492281,1780
1675578681,1920
1675665075,43368
1675751474,3240
1675837863,1533
1676356254,657
1676442661,1823
1676529061,1801
1676615450,1764
1676701857,1757
1676788249,1753
1676874662,1771
1676961061,1846
1677047454,1783
1677133857,1763
1677220262,1766
1677306660,1773
1677393061,1757
1677479458,2416
1677565859,2222
1677652257,2125
1677738657,2107
1677825057,2316
1677911460,1757
1677997847,1754
1678084257,1761
1678170666,1978
1678257055,1765
1678343445,2847
1679569142,2019
1679584407,2019
1679589867,2019
1679596494,2019
1679602915,2019
1679607956,2019
1679639532,2255
1679722309,7602
1679808717,1876
1679895117,1022
1679981518,1213
1680067912,1841
1680154308,2443
1680240714,3422
1680327097,3704
1680413504,3705
1680499902,3667
1680586299,3563
1680672702,3486
1680759104,4042
1680845523,3369
1680931899,3315
1681018301,3573
1681104713,3342
1681191117,3235
1681277516,3267
1681363906,3291
1681450306,3317
1681536706,3257
1681623105,3255
1681709528,3450
1681795909,3317
1681882326,3262
1681968706,3240
1682055103,3374
1682141505,3303
1682227910,3210
1682314324,3313
1682400707,3320
1682487105,3225
1682573524,3271
1682659898,3193
1682746309,3199
1682832700,3200
1682919107,3199
1683005499,3912
1683091901,3396
1683178309,4103
1683264713,3313
1683351101,3199
1683437506,3235
1683523904,3714
1683610328,3297
1683696716,3224
1683783116,3253
1683869508,3194
1683955918,3204
1684042308,3214
1685544777,3171
1685597496,3201
1685683902,3211
1685770303,3193
1685856701,3184
1685943100,3237
1686029502,3188
1686115904,3187
1686202306,3226
1686288711,3215
1686375108,3186
1686461512,3202
1686547909,3201
1686634309,3339
1686720704,3180
1686807105,3180
1686893562,3183
1686979954,3302
1687066360,3180
1687152774,3188
1687239150,3199
1687411953,3168
1687498393,3179
1687584774,3203
1687671173,3156
1687757568,3095
1687843969,2925
1687930377,2941
1688016807,3008
1688103218,2946
1688189597,2895
1688275996,2912
1688362412,3136
1688535215,3004
1688621614,2987
1688708029,3161
1688794420,2901
1688880821,2910
1688967219,2968
1689053626,2346
1689140028,2932
1689226424,2955
1689312837,3012
1689399195,2895
1689485597,2901
1689572000,2910
1689658397,2936
1689744807,2906
1689831241,2899
1689917640,2894
1690004042,2899
1690090404,2933
1690176817,2898
1690263240,2911
1690349617,2913
1690436012,2912
1690522443,2331
1690608808,1453
1690695212,1459
1690781617,1469
1690868047,1464
1690954421,2185
1691040818,2905
1691127250,2919
1691213630,2924
1691300015,2893
1691386395,2845
1691472821,2293
1691559206,2926
1691645653,2911
1691732035,2906
1691818443,2885
1691904834,2897
1691991184,2977
1692077570,2951
1692163972,2969
1692250382,2960
1692336773,2906
1692423180,2901
1692509573,3088
1692595944,867
1692682368,2188
1692768764,2926
1692855167,4692
1692941568,2904
1693027980,3043
1693114356,2904
1693200777,2906
1693287141,1876
1693373568,1922
1693459952,2897
1693546364,2894
1693632754,2894
1693719144,2884
1693805540,2918
1693891949,2931
1693978362,2911
1694064749,2994
1694151151,3115
1694237547,2902
1694323959,2886
1694410362,2921
1694496769,3176
1694583178,12474
1694669562,3215
1694755972,3130
1694842363,2916
1694928766,2912
1695015165,3087
1695187975,3380
1695274380,3159
1695360784,3061
1695447164,2899
1695533586,2925
1695619990,3326
1695706406,3402
1695792808,3386
1695879218,4475
1695965624,3293
1696052011,2996
1696138408,2901
1696224807,3212
1696311219,3057
1696397621,3395
1696484041,3545
1696570435,3003
1696656841,2932
1696743237,3003
1696829644,2903
1696916048,3131
1697002439,3044
1697088838,3048
1697175238,3110
1697261644,2951
1697348050,3115
1697434425,3268
1697520844,2943
1697607247,3032
1697693651,4187
1697780021,2894
1697866447,3553
1697952848,2906
1698039229,3378
1698125641,3031
1698212053,3348
1698298423,4472
1698384826,2956
1698474862,2891
1698561261,2917
1698647660,2944
1698734051,2933
1698820440,3401
1698906836,2902
1698993260,2972
1699079643,2909
1699166057,2906
1699252467,3080
1699338847,2940
1699425254,2953
1699511642,2978
1699598052,2948
1699684453,2908
1699770845,2908
1699857241,3495
1699943653,4865
1700030030,2915
1700116443,2918
1700202865,2938
1700289223,2925
1700375637,2925
1700462021,8118
1700548451,4796
1700634836,2976
1700721246,2888
1700807657,2930
1700894058,2929
1700980458,2897
1701066868,2924
1701239661,2929
1701326039,2908
1701412459,2912
1701498834,2928
1701585234,2892
1701671642,2931
1701758036,2928
1701930831,2934
1702017289,2943
1702103633,2917
1702190033,2941
1702276447,2958
1702362833,5974
1702449238,2907
1702535641,4177
1702622071,2903
1702708433,2898
1702794843,2896
1702881239,2954
1702967665,2939
1703054037,2940
1703140439,3025
1703226865,2888
1703313245,2914
1703399641,2898
1703572441,2904
1703658841,2912
1703745239,2981
1703831661,3313
1703918046,2929
1704004443,3772
1704090847,2899
1704177241,2936
1704263638,2934
1704350037,2904
1704436450,2903
1704522832,2905
1704609231,15477
1704695681,7907
1704782089,2935
1704868474,2922
1704954878,3665
1705041294,2936
1705127674,2900
1705300477,2921
1705386877,2899
1705473291,3954
1705559692,3355
1705646097,2896
1705732479,2911
1705818877,2902
1705905294,2901
1705991686,2914
1706078101,2902
1706164491,2929
1706250972,2909
1706337342,2906
1706423747,2909
1706510148,2888
1706596552,2902
1706682956,3056
1706769366,3109
1706855781,2969
1706942169,2935
1707028569,3209
1707114964,4172
1707201363,3072
1707287760,5140
1707374158,4029
1707460602,3568
1707546967,10153
1707633370,90394
1707719770,64035
1707806171,5232
1707892577,11142
1707978960,12158
1708065403,3803
1708151763,3280
1708238171,3307
1708324568,3594
1708410859,3843
1708497318,3930
1708583778,3702
1708670174,4015
1708756568,3800
1708842965,3235
1708929366,3189
1709015768,4309
1709102173,3403
1709188566,3043
1709275007,3871
1709361374,3447
1709447776,3581
1709534155,4155
1709620564,4047
1709706962,3587
1709793367,3906
1709966169,3424
1710052561,3864
1710138969,3108
1710225362,4629
1710311773,5903
1710398159,5472
1710484595,21381
1710570954,5960
1710657364,4361
1710743767,10898
1710830176,4225
1710916554,8500
1711002952,9379
1711089395,8320
1711175767,4920
1711262153,4583
1711348567,4314
1711434966,4200
1711521368,3754
1711607758,7273
1711694155,4552
1711776969,5041
1711863379,6134
1711949767,3432
1712036181,3177
1712122595,3268
1712209001,3113
1712295387,3141
1712381761,3325
1712468183,4128
1712554571,3565
1712640970,3341
1712727387,3435
1712813813,4176
1712900232,4077
1712986589,4758
1713073014,4952
1713159410,6606
1713245803,13728
1713332196,5222
1713418604,5880
1713505010,4185
1713591405,4348
1713677807,4488
1713764197,5129
1713850601,3727
1713937016,21497
1714023425,9024
1714109816,5292
1714196216,5941
1714282602,7083
1714369033,5951
1714455398,5450
1714541804,6232
1714714600,5634
1714801009,4348
1714887409,4476
1714973810,4708
1715060210,6373
1715146632,66799
1715233058,5425
1715319563,5029
1715405851,3922
1715492244,4107
1718022496,4189
1718084230,6564
1718170636,4349
1718257047,3605
1718343427,4892
1718429818,4307
1718516215,3949
1718602645,4650
1718689022,5567
1718775431,5032
1718861831,5732
1718948217,9594
1719034629,8096
1719121031,7966
1719207304,10347
1719293732,11613
1719380130,10062
1719466523,10049
1719552933,9493
1719639300,9529
1719725705,10949
1719812104,16045
1719898511,18172
1719984907,12684
1720071331,13182
1720157731,11350
1720244127,9385
1720330509,9972
1720416929,9862
1720503328,24966
1720589730,15370
1720676127,13750
1720762554,14248
1720935328,10342
1721021712,7543
1721108139,7838
1721194539,9147
1721280942,8147
1721367339,8443
1721453736,8552
1721540139,5392
1721626512,6135
1721712930,12772
1721799317,6960
1721885729,8015
1721972116,6242
1722058513,6951
1722144941,7075
1722231340,7945
1722317737,8602
1722404147,15427
1722490541,11524
1722576933,10108
1722663315,3522
1722749743,5335
1722836105,5783
1722922512,6618
1723008910,11000
1723095317,8887
1723181712,10336
1723268105,10865
1723354509,9410
1723440921,10906
1723527316,14343
1723613721,12811
1723700119,13646
1723786513,14428
1723872909,13760
1723959316,10262
1724045707,8269
1724132118,13237
1724218520,16666
1724304925,11266
1724391319,6876
1724477730,3335
1724564111,5258
1724650531,3414
1724736906,5048
1724823316,5447
1724909717,6374
1724996108,15741
1725082506,12765
1725168909,10009
1725255319,13035
1725341717,19347
1725428109,24888
1725514506,14059
1725600914,11289
1725687306,9463
1725773707,7480
1725860113,6343
1725946519,6098
1726032920,7332
1726119315,9135
1726205705,6394
1726292115,9239
1726378512,12950
1726464916,8692
1726551329,8373
1726637718,10423
1726724132,13667
1726810515,13666
1726896925,11326
1726983322,7320
1727069719,7165
1727156114,3710
1727242538,3887
1727328917,4378
1727415326,3700
1727501713,7895
1727588116,14977
1727674524,8924
1727760922,6277
1727847333,8863
1727933723,6703
1728020122,7429
1728106547,6134
1728192945,6972
1728279336,6347
1728365743,6016
1728452151,6837
1728538537,5206
1728624938,4831
1728711328,4635
1728797737,4217
1728884126,3911
1728970539,5528
1729056925,3888
1729143336,3780
1729229724,4243
1729316123,3851
1729402521,3535
1729488952,3282
1729575323,3114
1729661730,2991
1729748135,3249
1729834546,3172
1729924541,2935
1730010943,3123
1730097332,3205
1730183730,2978
1730270141,3187
1730356536,3089
1730442925,3047
1730529338,2992
1730615759,3254
1730702128,2982
1730788525,2929
1730874965,3471
1730961326,10638
1731047722,2950
1731134141,3439
1731220531,2946
1731306938,3091
1731393338,4226
1731479747,3622
1731566125,3149
1731652532,3075
1731738930,2932
1731825326,3681
1731911726,4008
1731998131,3403
1732084532,3028
1732170946,3304
1732257343,2992
1732343726,2909
1732430128,3252
1732516530,2958
1732602931,2993
1732689332,3885
1732775733,3352
1732862185,4317
1732948585,3100
1733034986,2912
1733121412,4003
1733207816,3075
1733294214,2945
