1691818247,1
1691991040,1
1693027839,1
1693114233,1
1693200633,1
1693978232,1
1694323834,1
1694410234,1
1694583036,1
1694755834,1
1694842234,1
1694928634,1
1695187834,1
1695274234,1
1695360634,1
1695533434,1
1695619839,1
1695879053,1
1695965441,1
1700116239,1
1700202637,2
1700721041,1
1700807441,2
1700893840,1
1700980240,1
1704436239,1
1705041045,1
1730874652,2
1731479453,1
1733034659,1
