1658730762,19
1658760045,19
1658817160,2
1658846453,2
1658989840,5
1659019246,5
1659076365,2
1659105646,2
1659162770,2
1659192044,2
1659335565,2
1659364847,2
1659421963,1
1659451128,1
1659508368,3
1659537519,3
