1691645653,3
1691732035,24
1691818443,23
1691904834,23
1691991184,20
1692077570,19
1692163972,21
1692250382,30
1692336773,21
1692423180,14
1692509573,27
1692595944,7
1692682368,20
1692768764,33
1692855167,25
1692941568,17
1693027980,13
1693114356,6
