1689485439,1
1689744640,1
1690090245,1
1691040648,1
1691299847,1
1691472645,1
1691559043,1
1691818247,1
1692250233,1
1693027839,1
1693459835,1
1693632645,1
1693719037,1
1694410234,1
1694669436,1
1695706241,1
1695879053,1
1696397445,1
1696570241,1
1696743043,1
1699511438,1
1700980240,1
1703745040,2
1704695446,1
1705300246,1
1705473046,1
1706596254,3
1707892254,1
1707978650,1
1708065054,1
1708410644,1
1708583454,1
1708756257,1
1708842649,1
1710657050,4
1713850252,8
1718429457,3
1720330245,1
1723872647,1
1729488653,6
1731652254,1
