1688707844,2
1688794245,2
1688880644,2
1688967042,2
1689053441,2
1689139840,2
1689226241,2
1689312653,2
1689744640,2
1689831044,2
1689917446,2
1690003846,2
1690263047,1
1690522245,2
1690867847,2
1691127048,2
1691645448,2
1691731846,1
1691991040,2
1692077440,2
1692163831,2
1692250233,2
1692336633,2
1692423035,2
1692509432,2
1692682233,2
1692768633,2
1692855035,2
1692941433,2
1693027839,2
1693200633,2
1693978232,1
1726551051,1
