1710052251,1
1712295052,30
1712727049,3
1714714252,3
1714800655,2
1715491864,9
1718083857,5
1718343064,4
1721280649,3
1722576648,1
1724045446,1
1726810249,2
1726983051,11
1727587850,1
1729056653,9
1729661454,2
1730183452,5
1730961053,1
1731047452,2
1731133849,1
1732516250,2
1732689052,1
1733207462,1
