1658385041,1
1658414447,1
1658471560,2
1658500847,2
1658557962,4
1658587247,4
1658644360,1
1658673645,1
1658730762,4
1658760045,4
1658817160,1
1658846453,1
1658903439,2
1658932848,2
1659249159,1
1659278470,1
1659335565,2
1659364847,2
1659421963,1
1659451128,1
1659508368,2
1659537519,2
1659594767,1
1659624049,1
1659681160,3
1659710444,3
1659767561,2
1659796845,2
1660026647,3
1660056049,3
1660113163,2
1660142439,2
1660285970,1
1660315250,1
1660372250,1
1660401521,1
1660890760,1
1660920046,1
1661236366,2
1661265647,2
