1695533586,229
1695619990,266
1695706406,180
1695792808,946
1695879218,378
1695965624,410
1696052011,156
1696138408,273
1696224807,444
1696311219,364
1696397621,257
1696484041,315
1696570435,311
1696656841,900
1696743237,278
1696829644,212
1696916048,386
1697002439,302
1697088838,334
1697175238,220
1697261644,156
1697348050,123
1697434425,329
1697520844,206
1697607247,282
1697693651,364
1697780021,597
1697866447,346
1697952848,398
1698039229,492
1698125641,305
1698212053,274
1698298423,428
1698384826,173
1698474862,285
1698561261,183
1698647660,158
1698734051,223
1698820440,174
1698906836,116
1698993260,137
1699079643,138
1699166057,103
1699252467,337
1699338847,346
1699425254,227
1699511642,105
