1657607566,28
1657693957,29
1657780357,12
1657803090,12
1657804447,12
1657809517,12
1657866760,37
1657896040,37
1657953158,16
1657982325,16
1658039438,19
1658068726,19
1658125843,29
1658155247,29
1658212362,60
1658241661,60
1658298758,45
1658328052,45
1658385041,47
1658414447,47
1658471560,22
1658500847,22
1658557962,9
1658587247,9
1658644360,16
1658673645,16
1658730762,35
1658760045,35
1658817160,30
1658846453,30
1658903439,4
1658932848,4
1658989840,13
1659019246,13
