1646807431,10
1646893952,20
1646980230,14
1647066751,13
1647153150,15
1647239550,11
1647325952,10
1647412352,21
1647498752,26
1647585151,27
1647757954,14
1647844355,17
1647930752,19
1648017150,16
1648103550,8
1648189831,13
1648276229,17
1648362752,9
1648449033,13
1648535442,9
1648621952,11
1648708231,14
