1668081505,1
1679584314,4
1679589759,4
1679596397,4
1679602819,4
1679607852,4
1679639432,4
1679981431,4
1680154230,1
1680240629,3
1680672631,1
1680845434,4
1680931831,1
1681536635,1
1681709434,2
1682573432,4
1682919034,1
1683610233,4
1686029431,2
1686115831,1
1686288634,1
1686893441,2
1686979840,1
1687152641,3
1687498241,4
1687584640,1
1688016640,4
1688103041,4
1688189452,2
1688275841,3
1688362240,4
1688535044,4
1688621445,4
1688707844,4
1688794245,4
1688880644,3
1688967042,5
1689053441,4
1689139840,6
1689226241,4
1689312653,4
1689399039,1
1689658239,2
1689744640,2
1689831044,4
1689917446,4
1690003846,4
1690090245,1
1690263047,4
1690522245,3
1690781448,2
1690867847,4
1691127048,4
1691213447,44
1691299847,3
1691472645,3
1691559043,2
1691645448,4
1691731846,2
1691818247,3
1691904646,2
1691991040,4
1692077440,4
1692163831,5
1692250233,4
1692336633,4
1692423035,4
1692509432,4
1692682233,4
1692768633,4
1692855035,4
1692941433,4
1693027839,4
1693114233,5
1693200633,4
1693978232,4
1694064634,1
1694323834,4
1694410234,1
1694496634,2
1694583036,4
1694755834,4
1694842234,4
1694928634,4
1695187834,2
1695274234,4
1695360634,4
1695533434,7
1695619839,4
1695879053,1
1695965441,4
1696397445,3
1696483842,4
1696570241,1
1696656645,3
1696743043,4
1696829444,4
1696915841,4
1697002242,4
1697088641,4
1697175042,4
1697261447,4
1697347842,4
1697520642,4
1697607044,4
1697693444,4
1697866244,4
1697952644,4
1698211845,4
1698298245,4
1698474646,4
1698561046,4
1698647445,4
1698733843,5
1698820251,4
1698906644,4
1698993045,12
1699079441,4
1699165843,4
1699252253,16
1699425038,4
1699597838,7
1699684239,4
1699770639,4
1699857040,1
1699943446,4
1700029845,1
1700116239,4
1700202637,8
1700289040,3
1700548240,4
1700721041,4
1700807441,8
1700893840,4
1700980240,6
1701066641,4
1701239442,4
1701412240,8
1702017040,8
1702621850,4
1702794640,2
1702881040,1
1703140241,1
1703226640,5
1703831442,4
1704090642,1
1704436239,4
1704954645,1
1705041045,3
1705127446,5
1705300246,3
1706337052,1
1707460251,1
1707546652,1
1707633051,2
1707719451,1
1707978650,1
1710138651,1
1710484249,1
1711175450,1
1711261844,1
1711521045,1
1711693844,1
1711776649,1
1712381450,1
1713504653,3
1714800655,1
1718429457,4
1718602257,1
1718688659,1
1718775058,1
1719293448,2
1721539849,1
1724304649,6
1725168647,1
1726464648,1
1728192652,1
1728538253,6
1729143053,1
1729575053,1
1730529053,7
1730615453,5
1730701851,1
