1659767561,6
1659796845,6
1659853840,9
1659883130,9
1659940369,17
1659969638,17
1660026647,9
1660056049,9
1660113163,6
1660142439,6
1660199441,25
1660228849,25
1660285970,7
1660315250,7
1660372250,9
1660401521,9
1660458761,11
1660488049,11
1660545162,6
1660574449,6
1660631564,10
1660660730,10
1660717841,5
1660747248,5
1660804362,15
1660833647,15
1660890760,1
1660920046,1
1660977162,13
1661006455,13
1661063442,2
1661092854,2
