1636286412,1
1636286488,1
1636895594,2
1636898490,2
1636900709,2
1637070326,4
1637070818,7
1637072812,21
1637122028,25
1637208446,17
1637294806,7
1637381227,11
1637467621,30
1637554087,6
1637589848,6
1637726914,8
1637813369,5
1638072517,5
1638158887,4
1638245235,4
1638331638,20
1639904549,1
1639907950,1
1639980923,9
1639983233,9
1639985995,9
1640059226,7
1640080313,7
1640145685,8
1640232083,3
1640318424,9
1640404823,2
1640491284,8
1640577691,4
1640664024,4
1640750484,2
1640836884,11
1640923223,6
1641009626,6
1641096084,3
1641182484,3
1641268824,5
1641355224,7
1641441684,3
1641528084,7
1641700884,3
1641787224,9
1641873686,2
1642392088,8
1642408942,8
1642478484,10
1642564885,2
1642651226,12
1642676514,12
1642805851,8
1642824026,12
1642855125,12
1642910490,8
1642924655,8
1642934565,8
1642937864,8
1642996892,17
1643083292,5
1643169628,3
1643256090,2
1643342487,14
1643428827,3
1643515288,4
1643601634,7
1643622207,7
1643688028,18
1643708607,18
1643774489,8
1643860889,12
1643947288,16
1644033629,21
1644120088,12
1644206493,5
1644292831,3
1644321030,3
1644388289,18
1644407490,18
1644474692,9
1644493888,9
1644561030,19
1644647492,6
1644733834,6
1644770508,6
1644820292,16
1644906689,8
1644993090,2
1645079499,4
1645165829,3
1645252290,5
1645338629,3
1645425030,3
1645467113,3
1645470826,3
1645511492,6
1645597892,4
1645684232,8
1645770629,3
1645857150,35
1645943553,2
1646029893,3
1646116237,2
1646202760,3
1646289033,11
1646375551,22
1646461951,2
1646548229,4
1646634751,2
1646721161,5
1646807431,2
1646893952,19
1646980230,51
1647066751,12
1647153150,6
1647239550,4
1647325952,4
1647412352,17
1647498752,16
1647585151,4
1647757954,55
1647844355,5
1647930752,4
1648017150,4
1648103550,9
1648189831,4
1648276229,21
1648362752,6
1648449033,9
1648535442,2
1648621952,2
1648708231,4
1648794750,3
1648881149,4
1648967561,6
1649053832,2
1649140351,4
1649226751,4
1649313029,5
1649399549,6
1649485949,4
1649572354,65
1649658750,4
1649745150,4
1649831565,5
1649917950,5
1650004228,2
1650090628,3
1650177150,4
1650263549,6
1650349831,15
1650436229,12
1650522756,4
1650609163,4
1650695550,2
1650781953,2
1650868349,2
1650954630,12
1651041030,5
1651127552,17
1651213951,18
1651300352,4
1651386755,3
1651473034,8
1651559564,2
1651645850,14
1651732362,28
1651818753,9
1651905153,3
1651991564,13
1652077954,47
1652164360,6
1652250764,15
1652337032,7
1652423553,16
1652509832,23
1652596232,10
1652682759,11
1652769160,11
1652855561,9
1652941964,6
1653028353,8
1653114753,11
1653201159,8
1653287558,45
1653373954,7
1653460234,15
1653546755,7
1653633154,19
1653719553,9
1653805957,7
1653892236,11
1653978755,11
1654065033,7
1654151553,7
1654237831,8
1654324351,14
1654410631,8
1654497153,58
1654583555,6
1654669837,7
1654756356,8
1654842756,51
1654929156,7
1655015436,6
1655101838,8
1655188357,6
1655274636,6
1655361158,10
1655447555,7
1655533836,12
1655620256,18
1655706645,16
1655793158,8
1655879557,11
1655965955,21
1656052365,6
1656138754,8
1656225155,19
1656311556,8
1656397956,26
1656484356,11
1656570758,20
1656743558,7
1656829841,44
1656916357,14
1657002637,36
1657089163,11
1657175559,64
1657261838,20
1657348240,8
1657434758,117
1657521164,6
1657607566,13
1657693957,9
1657780357,122
1657803090,122
1657804447,122
1657809517,122
1657866760,30
1657896040,30
1657953158,17
1657982325,17
1658039438,15
1658068726,15
1658125843,102
1658155247,102
1658212362,14
1658241661,14
1658298758,196
1658328052,196
1658385041,102
1658414447,102
1658471560,191
1658500847,191
1658557962,103
1658587247,103
1658644360,12
1658673645,12
1658730762,42
1658760045,42
1658817160,13
1658846453,13
1658903439,12
1658932848,12
1658989840,12
1659019246,12
1659076365,21
1659105646,21
1659162770,15
1659192044,15
1659249159,12
1659278470,12
1659335565,21
1659364847,21
1659421963,20
1659451128,20
1659508368,41
1659537519,41
1659594767,15
1659624049,15
1659681160,23
1659710444,23
1659767561,15
1659796845,15
1659853840,13
1659883130,13
1659940369,23
1659969638,23
1660026647,13
1660056049,13
1660113163,14
1660142439,14
1660199441,22
1660228849,22
1660285970,21
1660315250,21
1660372250,19
1660401521,19
1660458761,18
1660488049,18
1660545162,114
1660574449,114
1660631564,22
1660660730,22
1660717841,18
1660747248,18
1660804362,12
1660833647,12
1660890760,44
1660920046,44
1660977162,24
1661006455,24
1661063442,12
1661092854,12
1661149842,14
1661179125,14
1661236366,18
1661265647,18
1661322641,14
1661352051,14
1661409162,14
1661438449,14
1661495561,15
1661524735,15
1661581964,89
1661611239,89
1661668363,106
1661697647,106
1661700049,106
1661754784,19
1661784048,19
1661870448,40
1661927560,14
1661956724,14
1662013964,15
1662043246,15
1662100359,12
1662129642,12
1662186760,14
1662216045,14
1662273039,15
1662302447,15
1662359559,14
1662388727,14
1662445958,15
1662475124,15
1662532358,14
1662561643,14
1662618758,16
1662647931,16
1662705164,43
1662734437,43
1662791558,14
1662820724,14
1662877847,99
1662907237,99
1662964357,13
1662993645,13
1663050638,12
1663080057,12
1663137169,13
1663166448,13
1663223564,13
1663252844,13
1663309969,12
1663339237,12
1663396358,13
1663425653,13
1663482759,22
1663512042,22
1663569159,13
1663598447,13
1663655565,91
1663684725,91
1663741840,15
1663771124,15
1663828239,14
1663857524,14
1663914640,25
1663943934,25
1664001039,13
1664030318,13
1664087438,40
1664116722,40
1664173842,15
1664203127,15
1664260251,12
1664289537,12
1664346641,13
1664375951,13
1664433041,13
1664462320,13
1664519554,24
1664548711,24
1664605833,12
1664635111,12
1668081545,1
1668350533,39
1668355972,39
1668356757,39
1668360810,39
1668474184,10
1668560577,7
1668646979,7
1671629111,419
1671630664,419
1671632450,419
1671634011,419
1673516775,6
1674367285,9
1674455475,8
1674541884,8
1674628285,6
1674714694,15
1674801082,10
1674887480,19
1674973872,17
1675060281,11
1675146682,8
1675233071,6
1675319481,6
1675405883,8
1675492281,447
1675578681,9
1675665075,23
1675751474,15
1675837863,12
1676356254,5
1676442661,22
1676529061,12
1676615450,17
1676701857,15
1676788249,26
1676874662,15
1676961061,10
1677047454,6
1677133857,10
1677220262,16
1677306660,7
1677393061,9
1677479458,9
1677565859,7
1677652257,12
1677738657,8
1677825057,8
1677911460,6
1677997847,6
1678084257,6
1678170666,9
1678257055,7
1678343445,31
1679569142,16
1679584407,16
1679589867,16
1679596494,16
1679602915,16
1679607956,16
1679639532,57
1679722309,20
1679808717,6
1679895117,22
1679981518,7
1680067912,8
1680154308,23
1680240714,9
1680327097,11
1680413504,10
1680499902,10
1680586299,13
1680672702,8
1680759104,9
1680845523,8
1680931899,10
1681018301,8
1681104713,6
1681191117,56
1681277516,8
1681363906,7
1681450306,8
1681536706,7
1681623105,10
1681709528,7
1681795909,12
1681882326,9
1681968706,7
1682055103,8
1682141505,13
1682227910,6
1682314324,7
1682400707,10
1682487105,6
1682573524,1
