1640923223,37
1641009626,194
1641096084,105
1641182484,212
1641268824,145
1641355224,190
1641441684,272
1641528084,178
1641700884,148
1641787224,167
1641873686,144
1642305627,211
1642319122,211
1642392088,92
1642408942,92
1642478484,132
