1644033629,4
1644120088,3
1644206493,5
1644292831,12
1644321030,12
1644388289,5
1644407490,5
1644474692,7
1644493888,7
1644561030,4
1644647492,7
1644733834,3
1644770508,3
1644820292,3
1644906689,2
1644993090,5
1645079499,5
1645165829,4
1645252290,2
1645338629,8
1645425030,4
1645467113,4
1645470826,4
1645511492,4
1645597892,1
