1642392088,13
1642408942,13
1642478484,16
1642564885,18
1642651226,13
1642676514,13
1642769502,19
1642771604,19
1642805136,19
1642805851,19
1642824026,16
1642855125,16
1642910490,13
1642924655,13
1642934565,13
1642937864,13
1642996892,14
1643083292,11
1643169628,16
1643256090,18
1643342487,18
1643428827,6
1643515288,5
1643601634,3
1643622207,3
1643688028,6
1643708607,6
1643774489,4
1643860889,8
1643947288,1
1644033629,7
1644120088,4
1644206493,8
1644292831,4
1644321030,4
1644388289,13
1644407490,13
1644474692,4
1644493888,4
1644561030,7
1644647492,6
1644733834,1
1644770508,1
1644820292,4
1644906689,5
1644993090,4
1645079499,2
1645165829,3
1645252290,3
1645338629,2
1645425030,5
1645467113,5
1645470826,5
1645511492,2
1645597892,1
