1678170666,3
1681104713,4
1681191117,4
1681363906,3
1681968706,3
1682055103,5
1682573524,2
1682659898,6
1724045707,7
1724304925,4
1724650531,3
1725255319,7
1725341717,16
1725687306,9
1725773707,16
1725860113,170
1725946519,97
