1704695681,31
1704782089,95
1704868474,258
1704954878,101
1705041294,94
1705127674,183
1705300477,218
1705386877,314
1705473291,339
1705559692,398
1705646097,924
1705732479,395
1705818877,124
1705905294,197
1705991686,270
1706078101,129
1706164491,118
1706250972,276
1706337342,143
1706423747,70
