1658039438,23
1658068726,23
1658125843,26
1658155247,26
1658212362,34
1658241661,34
1658298758,38
1658328052,38
1658385041,46
1658414447,46
1658471560,37
1658500847,37
1658557962,34
1658587247,34
1658644360,20
1658673645,20
1658730762,33
1658760045,33
1658817160,41
1658846453,41
1658903439,24
1658932848,24
1658989840,31
1659019246,31
1659076365,29
1659105646,29
1659162770,40
1659192044,40
1659249159,37
1659278470,37
1659335565,17
1659364847,17
