1642910490,24
1642924655,24
1642934565,24
1642937864,24
1642996892,200
1643083292,192
1643169628,161
1643256090,243
1643342487,129
1643428827,92
1643515288,151
1643601634,210
1643622207,210
1643688028,149
1643708607,149
1643774489,175
1643860889,167
1643947288,231
1644033629,127
1644120088,175
1644206493,180
1644292831,129
1644321030,129
1644388289,183
1644407490,183
1644474692,184
1644493888,184
1644561030,144
1644647492,157
1644733834,203
1644770508,203
1644820292,163
1644906689,212
1644993090,148
1645079499,120
1645165829,120
1645252290,145
1645338629,6
