1663050638,2
1663080057,2
1663137169,4
1663166448,4
1663223564,2
1663252844,2
1663396358,10
1663425653,10
1663482759,10
1663512042,10
1663655565,46
1663684725,46
1663741840,8
1663771124,8
1663828239,4
1663857524,4
