1656484356,3
1656570758,14
1656743558,10
1656829841,10
1656916357,10
1657002637,13
1657089163,10
1657175559,10
1657261838,10
1657348240,15
1657434758,10
1657521164,7
1657607566,7
1657693957,6
1657780357,7
1657803090,7
1657804447,7
1657809517,7
