1658212362,2
1658241661,2
1658298758,89
1658328052,89
1658471560,5
1658500847,5
1658557962,89
1658587247,89
1658730762,16
1658760045,16
1658989840,89
1659019246,89
1659076365,92
1659105646,92
1659249159,93
1659278470,93
1659421963,1
1659451128,1
1659508368,42
1659537519,42
1659594767,2
1659624049,2
1659767561,2
1659796845,2
1659853840,4
1659883130,4
1660113163,2
1660142439,2
1660199441,2
1660228849,2
1660285970,91
1660315250,91
1660372250,2
1660401521,2
1660458761,95
1660488049,95
1660545162,5
1660574449,5
1660717841,4
1660747248,4
1660890760,15
1660920046,15
1661236366,3
1661265647,3
1661322641,29
1661352051,29
1661495561,2
1661524735,2
1661581964,95
1661611239,95
