1636286412,2471
1636286488,2514
1636895594,29296
1636898490,30951
1636900709,32244
1637070326,35948
1637070818,36353
1637072812,59589
1637122028,57182
1637208446,56753
1637294806,56299
1637381227,54639
1637467621,50675
1637554087,51235
1637589848,51235
1637726914,59695
1637813369,54527
1638072517,50483
1638158887,50673
1638245235,64036
1638331638,51628
1639904549,50883
1639907950,50883
1639980923,51337
1639983233,51337
1639985995,51337
1640059226,59487
1640080313,59487
1640145685,56417
1640232083,54642
1640318424,51827
1640404823,48866
1640491284,48602
1640577691,48883
1640664024,51837
1640750484,51539
1640836884,51523
1640923223,50647
1641009626,48817
1641096084,49295
1641182484,64216
1641268824,58686
1641355224,63416
1641441684,53142
1641528084,51959
1641700884,51981
1641787224,52619
1641873686,56929
1642392088,36441
1642408942,36441
1642478484,56869
1642564885,59378
1642651226,60165
1642676514,60165
1642805851,59119
1642824026,55695
1642855125,55695
1642910490,65365
1642924655,65365
1642934565,65365
1642937864,65365
1642996892,55188
1643083292,63871
1643169628,57415
1643256090,57147
1643342487,59666
1643428827,57798
1643515288,53073
1643601634,53902
1643622207,53902
1643688028,65448
1643708607,65448
1643774489,88388
1643860889,88417
1643947288,58936
1644033629,59558
1644120088,53191
1644206493,54153
1644292831,60973
1644321030,60973
1644388289,61137
1644407490,61137
1644474692,62720
1644493888,62720
1644561030,61098
1644647492,58768
1644733834,52905
1644770508,52905
1644820292,54991
1644906689,66213
1644993090,71062
1645079499,64668
1645165829,64305
1645252290,62958
1645338629,53660
1645425030,55332
1645467113,55332
1645470826,55332
1645511492,61878
1645597892,65648
1645684232,72050
1645770629,58930
1645857150,59411
1645943553,54650
1646029893,63273
1646116237,62687
1646202760,59385
1646289033,62040
1646375551,63823
1646461951,58166
1646548229,55388
1646634751,60060
1646721161,62637
1646807431,64690
1646893952,62970
1646980230,61009
1647066751,59021
1647153150,53668
1647239550,53731
1647325952,59558
1647412352,58877
1647498752,59190
1647585151,58456
1647757954,53500
1647844355,49089
1647930752,63673
1648017150,64428
1648103550,58563
1648189831,58678
1648276229,59574
1648362752,53815
1648449033,55272
1648535442,62474
1648621952,63959
1648708231,70597
1648794750,68968
1648881149,61538
1648967561,53517
1649053832,56634
1649140351,59811
1649226751,59031
1649313029,58825
1649399549,59148
1649485949,59377
1649572354,53857
1649658750,54467
1649745150,68819
1649831565,60759
1649917950,64581
1650004228,59357
1650090628,54917
1650177150,54798
1650263549,54747
1650349831,56691
1650436229,62609
1650522756,57166
1650609163,66246
1650695550,61184
1650781953,55078
1650868349,64778
1650954630,72658
1651041030,62867
1651127552,61108
1651213951,64806
1651300352,61106
1651386755,54881
1651473034,58541
1651559564,61858
1651645850,60859
1651732362,61284
1651818753,60706
1651905153,61146
1651991564,56305
1652077954,55344
1652164360,61201
1652250764,67904
1652337032,70689
1652423553,73787
1652509832,79269
1652596232,73291
1652682759,73645
1652769160,79808
1652855561,78645
1652941964,66323
1653028353,60209
1653114753,61715
1653201159,55487
1653287558,55537
1653373954,62202
1653460234,60758
1653546755,56230
1653633154,51123
1653719553,59646
1653805957,55897
1653892236,58680
1653978755,61364
1654065033,60186
1654151553,59825
1654237831,59787
1654324351,60133
1654410631,54804
1654497153,54553
1654583555,56983
1654669837,82312
1654756356,87530
1654842756,111469
1654929156,60750
1655015436,54761
1655101838,147753
1655188357,118653
1655274636,59551
1655361158,58984
1655447555,59563
1655533836,59834
1655620256,54703
1655706645,54764
1655793158,59997
1655879557,59285
1655965955,58002
1656052365,51815
1656138754,51312
1656225155,51484
1656311556,57018
1656397956,56184
1656484356,55950
1656570758,56289
1656743558,56683
1656829841,51409
1656916357,51562
1657002637,58024
1657089163,55018
1657175559,55269
1657261838,55737
1657348240,55908
1657434758,51612
1657521164,59291
1657607566,66956
1657693957,67616
1657780357,72458
1657803090,72458
1657804447,72458
1657809517,72458
1657866760,72422
1657896040,72422
1657953158,72341
1657982325,72341
1658039438,69403
1658068726,69403
1658125843,69566
1658155247,69566
1658212362,70899
1658241661,70899
1658298758,58597
1658328052,58597
1658385041,66328
1658414447,66328
1658471560,62506
1658500847,62506
1658557962,69777
1658587247,69777
1658644360,68868
1658673645,68868
1658730762,64108
1658760045,64108
1658817160,69356
1658846453,69356
1658903439,68255
1658932848,68255
1658989840,53936
1659019246,53936
1659076365,53806
1659105646,53806
1659162770,53865
1659192044,53865
1659249159,51670
1659278470,51670
1659335565,51619
1659364847,51619
1659421963,54883
1659451128,54883
1659508368,53791
1659537519,53791
1659594767,53922
1659624049,53922
1659681160,54061
1659710444,54061
1659767561,53931
1659796845,53931
1659853840,51600
1659883130,51600
1659940369,53430
1659969638,53430
1660026647,56475
1660056049,56475
1660113163,55432
1660142439,55432
1660199441,55367
1660228849,55367
1660285970,55263
1660315250,55263
1660372250,55199
1660401521,55199
1660458761,51800
1660488049,51800
1660545162,51220
1660574449,51220
1660631564,56904
1660660730,56904
1660717841,61128
1660747248,61128
1660804362,59577
1660833647,59577
1660890760,63099
1660920046,63099
1660977162,64689
1661006455,64689
1661063442,53485
1661092854,53485
1661149842,58012
1661179125,58012
1661236366,69948
1661265647,69948
1661322641,59894
1661352051,59894
1661409162,66176
1661438449,66176
1661495561,60305
1661524735,60305
1661581964,56247
1661611239,56247
1661668363,51706
1661697647,51706
1661700049,51706
1661754784,53248
1661784048,53248
1661870448,56791
1661927560,56305
1661956724,56305
1662013964,58071
1662043246,58071
1662100359,56573
1662129642,56573
1662186760,56733
1662216045,56733
1662273039,51318
1662302447,51318
1662359559,61950
1662388727,61950
1662445958,70932
1662475124,70932
1662532358,58805
1662561643,58805
1662618758,57172
1662647931,57172
1662705164,57060
1662734437,57060
1662791558,58213
1662820724,58213
1662877847,51708
1662907237,51708
1662964357,52109
1662993645,52109
1663050638,58926
1663080057,58926
1663137169,58441
1663166448,58441
1663223564,57013
1663252844,57013
1663309969,65924
1663339237,65924
1663396358,71533
1663425653,71533
1663482759,58502
1663512042,58502
1663569159,71893
1663598447,71893
1663655565,67308
1663684725,67308
1663741840,59141
1663771124,59141
1663828239,58034
1663857524,58034
1663914640,56841
1663943934,56841
1664001039,57634
1664030318,57634
1664087438,51817
1664116722,51817
1664173842,51944
1664203127,51944
1664260251,58314
1664289537,58314
1664346641,57384
1664375951,57384
1664433041,60571
1664462320,60571
1664519554,57081
1664548711,57081
1664605833,53769
1664635111,53769
1668081545,55884
1668350533,51105
1668355972,51105
1668356757,51105
1668360810,51105
1668474184,56734
1668560577,56922
1668646979,66415
1671629111,57040
1671630664,57040
1671632450,57040
1671634011,57040
1673516775,11774
1674367285,6217
1674455475,6174
1674541884,11854
1674628285,23024
1674714694,11207
1674801082,22253
1674887480,10923
1674973872,4297
1675060281,6660
1675146682,21633
1675233071,16398
1675319481,22356
1675405883,34681
1675492281,28585
1675578681,20144
1675665075,20677
1675751474,33069
1675837863,24262
1676356254,28035
1676442661,26986
1676529061,37565
1676615450,26310
1676701857,16177
1676788249,21424
1676874662,21534
1676961061,30718
1677047454,25603
1677133857,45474
1677220262,26899
1677306660,27255
1677393061,21992
1677479458,11209
1677565859,27706
1677652257,50911
1677738657,26945
1677825057,27446
1677911460,27349
1677997847,21468
1678084257,21553
1678170666,28533
1678257055,27605
1678343445,27376
1679569142,26694
1679584407,26694
1679589867,26694
1679596494,26694
1679602915,26694
1679607956,26694
1679639532,26873
1679722309,28050
1679808717,21859
1679895117,19131
1679981518,32369
1680067912,17619
1680154308,17953
1680240714,19993
1680327097,19337
1680413504,13941
1680499902,13753
1680586299,20635
1680672702,20405
1680759104,19889
1680845523,20640
1680931899,14124
1681018301,13528
1681104713,13358
1681191117,14042
1681277516,20213
1681363906,30367
1681450306,30922
1681536706,32086
1681623105,25121
1681709528,25197
1681795909,31756
1681882326,31290
1681968706,31165
1682055103,143239
1682141505,30964
1682227910,129820
1682314324,29603
1682400707,157674
1682487105,31522
1682573524,30732
1682659898,59111
1682746309,26631
1682832700,29579
1682919107,25201
1683005499,26315
1683091901,59049
1683178309,64920
1683264713,41280
1683351101,21166
1683437506,14175
1683523904,56603
1683610328,105591
1683696716,20892
1683783116,54372
1683869508,20272
1683955918,22803
1684042308,14374
1685544777,20040
1685597496,21457
1685683902,18693
1685770303,18820
1685856701,13192
1685943100,13315
1686029502,17377
1686115904,13644
1686202306,19008
1686288711,18378
1686375108,17617
1686461512,13206
1686547909,13321
1686634309,30316
1686720704,29889
1686807105,16684
1686893562,27092
1686979954,28664
1687066360,23369
1687152774,23156
1687239150,31994
1687411953,26537
1687498393,29240
1687584774,23592
1687671173,23169
1687757568,23781
1687843969,29461
1687930377,28487
1688016807,28174
1688103218,27505
1688189597,27253
1688275996,22848
1688362412,23030
1688535215,15190
1688621614,27553
1688708029,26820
1688794420,27572
1688880821,22905
1688967219,23203
1689053626,27496
1689140028,26597
1689226424,26869
1689312837,25939
1689399195,26135
1689485597,22956
1689572000,23118
1689658397,26826
1689744807,26619
1689831241,26932
1689917640,26746
1690004042,26867
1690090404,23681
1690176817,23112
1690263240,26100
1690349617,25348
1690436012,25471
1690522443,23872
1690608808,22571
1690695212,19917
1690781617,20088
1690868047,23785
1690954421,24868
1691040818,28851
1691127250,25538
1691213630,25432
1691300015,22906
1691386395,22773
1691472821,26796
1691559206,27422
1691645653,26757
1691732035,26216
1691818443,26589
1691904834,22657
1691991184,22771
1692077570,27407
1692163972,31070
1692250382,26686
1692336773,26651
1692423180,27441
1692509573,22969
1692595944,16250
1692682368,27862
1692768764,28302
1692855167,26545
1692941568,26644
1693027980,26951
1693114356,22676
1693200777,24020
1693287141,24185
1693373568,27640
1693459952,26494
1693546364,26224
1693632754,26854
1693719144,22290
1693805540,22597
1693891949,26961
1693978362,26718
1694064749,34226
1694151151,26684
1694237547,26883
1694323959,22368
1694410362,22415
1694496769,27326
1694583178,25842
1694669562,44933
1694755972,62952
1694842363,33253
1694928766,23090
1695015165,30844
1695187975,103483
1695274380,42400
1695360784,236797
1695447164,32143
1695533586,48345
1695619990,415702
1695706406,349249
1695792808,246937
1695879218,99774
1695965624,29158
1696052011,30753
1696138408,21936
1696224807,54488
1696311219,36725
1696397621,30122
1696484041,23361
1696570435,31117
1696656841,34081
1696743237,35899
1696829644,29303
1696916048,33892
1697002439,32921
1697088838,47482
1697175238,35073
1697261644,44907
1697348050,28772
1697434425,36211
1697520844,32512
1697607247,34707
1697693651,37650
1697780021,31667
1697866447,36729
1697952848,26231
1698039229,31506
1698125641,46618
1698212053,39608
1698298423,36487
1698384826,53299
1698474862,58869
1698561261,49690
1698647660,24671
1698734051,31294
1698820440,32721
1698906836,20788
1698993260,31055
1699079643,30122
1699166057,22515
1699252467,25490
1699338847,39690
1699425254,36411
1699511642,34319
1699598052,36023
1699684453,27665
1699770845,21238
1699857241,22921
1699943653,43377
1700030030,34462
1700116443,33460
1700202865,32918
1700289223,34925
1700375637,23880
1700462021,24071
1700548451,37719
1700634836,34571
1700721246,37247
1700807657,33715
1700894058,33623
1700980458,23392
1701066868,23733
1701239661,33622
1701326039,33505
1701412459,32323
1701498834,34062
1701585234,23523
1701671642,24101
1701758036,35722
1701930831,32801
1702017289,32356
1702103633,33223
1702190033,23605
1702276447,23770
1702362833,34767
1702449238,34668
1702535641,34147
1702622071,32832
1702708433,35195
1702794843,23608
1702881239,23748
1702967665,36789
1703054037,34263
1703140439,35733
1703226865,37551
1703313245,37706
1703399641,24733
1703572441,24106
1703658841,24067
1703745239,31135
1703831661,29956
1703918046,30411
1704004443,24982
1704090847,22691
1704177241,23975
1704263638,34511
1704350037,33611
1704436450,32239
1704522832,32091
1704609231,23633
1704695681,24755
1704782089,34064
1704868474,34250
1704954878,34167
1705041294,44649
1705127674,35136
1705300477,33532
1705386877,37238
1705473291,38100
1705559692,33966
1705646097,33741
1705732479,37683
1705818877,23209
1705905294,23749
1705991686,36384
1706078101,36570
1706164491,34024
1706250972,34360
1706337342,36049
1706423747,22833
1706510148,24441
1706596552,36415
1706682956,34047
1706769366,33898
1706855781,40825
1706942169,38278
1707028569,26812
1707114964,32322
1707201363,40378
1707287760,38266
1707374158,35286
1707460602,33557
1707546967,35351
1707633370,36364
1707719770,30385
1707806171,35858
1707892577,35674
1707978960,51933
1708065403,35700
1708151763,36013
1708238171,25915
1708324568,36659
1708410859,39831
1708497318,38010
1708583778,38438
1708670174,35639
1708756568,37526
1708842965,25864
1708929366,25980
1709015768,39058
1709102173,36660
1709188566,36666
1709275007,36629
1709361374,37671
1709447776,24926
1709534155,25772
1709620564,39373
1709706962,38814
1709793367,37789
1709966169,38214
1710052561,27722
1710138969,29760
1710225362,40771
1710311773,39993
1710398159,38267
1710484595,39801
1710570954,39683
1710657364,27569
1710743767,29021
1710830176,38436
1710916554,39210
1711002952,36474
1711089395,36870
1711175767,36498
1711262153,24928
1711348567,27103
1711434966,37843
1711521368,35380
1711607758,38882
1711694155,41172
1711776969,25169
1711863379,24140
1711949767,24553
1712036181,13623
1712122595,25145
1712209001,24856
1712295387,24605
1712381761,44745
1712468183,34573
1712554571,34767
1712640970,46851
1712727387,45843
1712813813,45965
1712900232,46605
1712986589,47249
1713073014,36166
1713159410,44135
1713245803,93368
1713332196,56856
1713418604,45081
1713505010,43768
1713591405,45428
1713677807,33810
1713764197,34039
1713850601,48362
1713937016,49026
1714023425,47805
1714109816,44085
1714196216,45156
1714282602,33126
1714369033,33472
1714455398,44814
1714541804,43031
1714714600,43602
1714801009,43733
1714887409,32040
1714973810,39002
1715060210,45238
1715146632,41725
1715233058,42405
1715319563,31513
1715405851,38748
1715492244,28899
1718022496,13191
1718084230,41382
1718170636,39860
1718257047,39828
1718343427,39984
1718429818,38042
1718516215,28328
1718602645,30391
1718689022,41826
1718775431,37350
1718861831,40139
1718948217,38675
1719034629,29068
1719121031,28076
1719207304,29384
1719293732,39193
1719380130,48516
1719466523,47918
1719552933,49004
1719639300,54830
1719725705,28697
1719812104,29603
1719898511,37576
1719984907,36936
1720071331,36741
1720157731,35530
1720244127,41875
1720330509,26993
1720416929,27061
1720503328,35556
1720589730,34354
1720676127,33024
1720762554,33728
1720935328,26711
1721021712,28439
1721108139,33087
1721194539,30410
1721280942,32937
1721367339,40402
1721453736,30626
1721540139,24872
1721626512,32009
1721712930,33445
1721799317,28613
1721885729,28512
1721972116,16019
1722058513,15640
1722144941,11973
1722231340,25313
1722317737,31640
1722404147,30539
1722490541,29558
1722576933,29748
1722663315,29547
1722749743,24568
1722836105,26881
1722922512,32994
1723008910,34298
1723095317,31639
1723181712,31150
1723268105,34821
1723354509,24625
1723440921,25232
1723527316,36049
1723613721,36929
1723700119,39888
1723786513,32779
1723872909,34562
1723959316,24028
1724045707,24859
1724132118,34684
1724218520,57932
1724304925,156821
1724391319,36112
1724477730,33078
1724564111,67392
1724650531,23638
1724736906,32102
1724823316,31685
1724909717,33052
1724996108,36893
1725082506,33097
1725168909,23153
1725255319,24523
1725341717,37435
1725428109,34986
1725514506,37099
1725600914,31210
1725687306,33031
1725773707,23458
1725860113,24499
1725946519,34268
1726032920,33180
1726119315,34134
1726205705,33620
1726292115,33331
1726378512,24029
1726464916,24244
1726551329,32995
1726637718,32294
1726724132,32279
1726810515,32685
1726896925,31749
1726983322,23025
1727069719,23226
1727156114,31732
1727242538,24756
1727328917,21727
1727415326,23281
1727501713,23050
1727588116,22546
1727674524,22411
1727760922,23957
1727847333,61440
1727933723,31830
1728020122,32676
1728106547,32737
1728192945,24295
1728279336,25779
1728365743,68308
1728452151,63459
1728538537,48972
1728624938,43312
1728711328,42814
1728797737,32668
1728884126,32979
1728970539,65444
1729056925,64777
1729143336,40551
1729229724,40128
1729316123,22378
1729402521,11704
1729488952,33207
1729575323,42641
1729661730,52071
1729748135,52020
1729834546,50072
1729924541,40535
1730010943,31583
1730097332,36144
1730183730,40256
1730270141,37884
1730356536,38235
1730442925,37365
1730529338,37426
1730615759,30788
1730702128,30509
1730788525,37919
1730874965,38788
1730961326,38129
1731047722,37837
1731134141,38996
1731220531,30782
1731306938,30739
1731393338,39970
1731479747,45126
1731566125,45105
1731652532,41477
1731738930,46399
1731825326,31674
1731911726,37419
1731998131,41792
1732084532,45698
1732170946,38617
1732257343,39293
1732343726,42247
1732430128,30070
1732516530,30270
1732602931,46937
1732689332,39344
1732775733,38292
1732862185,44975
1732948585,47558
1733034986,33440
1733121412,32470
1733207816,38727
1733294214,38539
