1680759104,118
1681191117,11
1681709528,32
1682573524,1
1682659898,1
1682832700,1
1682919107,1
1683437506,1
1683783116,9
1683869508,1
1683955918,1
1684042308,1
1685770303,1
1685943100,1
1686893562,20
1687498393,1
1687584774,1
1687671173,1
1687843969,2
1689312837,1
1689399195,1
1692595944,1
1698298423,2
1703140439,1
1706510148,1
1709275007,1
1731998131,68
