1660545162,22
1660574449,22
1660631564,113
1660660730,113
1660717841,275
1660747248,275
1660804362,312
1660833647,312
1660890760,236
1660920046,236
1660977162,359
1661006455,359
1661063442,301
1661092854,301
1661149842,145
1661179125,145
1661236366,120
1661265647,120
1661322641,157
1661352051,157
1661409162,149
1661438449,149
1661495561,437
1661524735,437
1661581964,150
1661611239,150
1661668363,139
1661697647,139
1661700049,139
1661754784,153
1661784048,153
1661870448,148
