1642478484,26
1642564885,31
1642651226,25
1642676514,25
1642769502,30
1642771604,30
1642805136,30
1642805851,30
1642824026,32
1642855125,32
1642910490,21
1642924655,21
1642934565,21
1642937864,21
1642996892,18
1643083292,19
1643169628,24
1643256090,25
1643342487,22
1643428827,4
1643515288,15
1643601634,14
1643622207,14
1643688028,12
1643708607,12
1643774489,15
1643860889,12
1643947288,8
1644033629,16
1644120088,13
1644206493,8
1644292831,7
1644321030,7
1644388289,5
1644407490,5
1644474692,5
1644493888,5
1644561030,7
1644647492,10
1644733834,6
1644770508,6
1644820292,7
1644906689,16
1644993090,5
1645079499,12
1645165829,12
1645252290,7
1645338629,3
1645425030,15
1645467113,15
1645470826,15
1645511492,9
1645597892,10
1645684232,6
1645770629,9
1645857150,2
1645943553,12
1646029893,10
1646116237,8
1646202760,4
1646289033,9
1646375551,18
1646461951,6
1646548229,2
