1679584314,12
1679589759,12
1679596397,12
1679602819,12
1679607852,12
1679639432,12
1679981431,10
1680240629,12
1680845434,12
1682573432,4
1683437432,10
1683610233,12
1685856632,1
1686288634,4
1687066239,1
1687152641,1
1687498241,12
1688016640,12
1688103041,12
1688362240,12
1688535044,10
1688621445,12
1688707844,12
1688794245,12
1688880644,11
1688967042,12
1689053441,12
1689139840,12
1689226241,11
1689312653,12
1689744640,12
1689831044,11
1689917446,12
1690003846,12
1690263047,7
1690522245,8
1690781448,3
1690867847,12
1691127048,12
1691645448,13
1691731846,3
1691818247,8
1691904646,8
1691991040,13
1692077440,13
1692163831,13
1692250233,12
1692336633,13
1692423035,13
1692509432,13
1692682233,13
1692768633,13
1692855035,12
1692941433,13
1693027839,13
1693114233,6
1693200633,13
1693978232,13
1694323834,10
1694410234,3
1694496634,4
1694583036,24
1694669436,7
1694755834,11
1694842234,11
1694928634,11
1695187834,3
1695274234,11
1695360634,10
1695533434,10
1695619839,10
1695879053,1
1695965441,9
1696483842,8
1696656645,7
1696743043,8
1696829444,8
1696915841,9
1697002242,8
1697088641,7
1697261447,7
1697347842,7
1697520642,7
1697607044,7
1697693444,6
1697866244,6
1697952644,6
1698039045,1
1711521045,1
