1653114753,24
1653201159,13
1653287558,28
1653373954,20
1653460234,19
1653546755,23
1653633154,24
1653719553,33
1653805957,21
1653892236,21
1653978755,20
1654065033,20
1654151553,19
1654237831,20
1654324351,16
1654410631,1
