1698474646,1
1698561046,1
1698647445,1
1698733843,1
1698993045,3
1699079441,1
1699165843,1
1699252253,6
1699338639,1
1699425038,1
1699597838,1
1699684239,1
1699770639,1
1699857040,1
1699943446,1
1700116239,1
1700202637,2
1700548240,1
1700721041,1
1700807441,2
1700893840,1
1700980240,1
1701066641,1
1701239442,1
1701412240,2
1702017040,2
1702621850,1
1703226640,1
1703831442,1
1704436239,1
1704609039,1
1705041045,1
1705645846,1
1708410644,1
1708583454,1
1712122273,1
