1677133857,12
1677220262,19
1677306660,17
1677393061,6
1677479458,33
1677565859,34
1677652257,14
1677738657,14
1677825057,30
1677911460,24
1677997847,23
1678084257,27
1678170666,25
1678257055,23
1678343445,34
