1649140351,3
1649226751,16
1649313029,15
1649399549,25
1649485949,8
1649572354,8
1649658750,17
1649745150,13
1649831565,12
1649917950,11
1650004228,12
1650090628,15
1650177150,20
1650263549,10
1650349831,13
1650436229,14
