1660199441,36
1660228849,36
1660285970,4
1660315250,4
1660372250,10
1660401521,10
1660458761,123
1660488049,123
1660631564,1
1660660730,1
1661409162,108
1661438449,108
1661495561,2
1661524735,2
1661581964,3
1661611239,3
1661668363,186
1661697647,186
1661700049,186
1661870448,3
1661927560,29
1661956724,29
