1659249159,116
1659278470,116
1659335565,104
1659364847,104
1659421963,387
1659451128,387
1659508368,382
1659537519,382
1659594767,104
1659624049,104
1659681160,242
1659710444,242
1659767561,246
1659796845,246
1659853840,418
1659883130,418
1659940369,150
1659969638,150
1660026647,141
1660056049,141
1660113163,117
1660142439,117
1660199441,177
1660228849,177
1660285970,102
1660315250,102
1660372250,266
1660401521,266
1660458761,103
1660488049,103
1660545162,65
1660574449,65
