1720935328,5
1721021712,12
1721108139,5
1721194539,3
1721280942,50
1721367339,48
1721453736,46
1721540139,5
1721626512,5
1721712930,46
1721799317,6
1721885729,48
1721972116,3
1722058513,3
1722144941,86
1722231340,40
