1685544777,12
1685597496,13
1685683902,9
1685770303,7
1685856701,6
1685943100,5
1686029502,7
1686115904,11
1686202306,15
1686288711,12
1686375108,10
1686461512,8
1686547909,10
1686634309,12
1686720704,10
1686807105,10
1686893562,10
1686979954,11
1687066360,6
1687152774,12
1687239150,9
1687411953,10
1687498393,11
1687584774,3
