1658039438,18
1658068726,18
1658125843,28
1658155247,28
1658212362,44
1658241661,44
1658298758,49
1658328052,49
1658385041,41
1658414447,41
1658471560,38
1658500847,38
1658557962,34
1658587247,34
1658644360,21
1658673645,21
1658730762,27
1658760045,27
1658817160,31
1658846453,31
1658903439,34
1658932848,34
1658989840,37
1659019246,37
1659076365,33
1659105646,33
1659162770,37
1659192044,37
1659249159,34
1659278470,34
1659335565,27
1659364847,27
1659421963,43
1659451128,43
1659508368,20
1659537519,20
1659594767,20
1659624049,20
1659681160,10
1659710444,10
1659767561,24
1659796845,24
1659853840,27
1659883130,27
1659940369,29
1659969638,29
1660026647,34
1660056049,34
1660113163,18
1660142439,18
1660199441,24
1660228849,24
1660285970,48
1660315250,48
1660372250,39
1660401521,39
1660458761,53
1660488049,53
1660545162,22
1660574449,22
1660631564,28
1660660730,28
1660717841,16
1660747248,16
1660804362,11
1660833647,11
1660890760,18
1660920046,18
1660977162,25
1661006455,25
1661063442,11
1661092854,11
1661149842,16
1661179125,16
1661236366,24
1661265647,24
1661322641,15
1661352051,15
1661409162,15
1661438449,15
1661495561,12
1661524735,12
1661581964,1
1661611239,1
