1679584314,1
1679589759,1
1679596397,1
1679602819,1
1679607852,1
1679639432,1
1680240629,1
1680845434,1
1682573432,1
1683437432,1
1686202233,6
1688967042,1
1689053441,1
1689139840,1
1689226241,1
1689312653,1
1689831044,1
1689917446,1
1690003846,1
1690522245,1
1690867847,1
1691127048,1
1691213447,11
1691645448,1
1691731846,1
1691991040,1
1692077440,1
1692163831,1
1692250233,1
1692336633,1
1692423035,1
1692509432,1
1698474646,1
1698561046,1
1698647445,1
1698733843,1
1698993045,1
1699079441,1
1699165843,1
1699252253,6
1704436239,1
1705041045,1
1731393053,1
