1662359559,2
1662388727,2
1662445958,4
1662475124,4
1662532358,4
1662561643,4
1662618758,4
1662647931,4
1662705164,4
1662734437,4
1662791558,4
1662820724,4
1662877847,4
1662907237,4
1662964357,4
1662993645,4
1663050638,6
1663080057,6
1663137169,6
1663166448,6
1663223564,6
1663252844,6
1663309969,6
1663339237,6
1663396358,8
1663425653,8
1663482759,4
1663512042,4
1663569159,4
1663598447,4
1663655565,4
1663684725,4
1663741840,4
1663771124,4
1663828239,4
1663857524,4
1663914640,4
1663943934,4
1664001039,4
1664030318,4
1664087438,4
1664116722,4
1664173842,4
1664203127,4
1664260251,4
1664289537,4
1664346641,4
1664375951,4
1664433041,4
1664462320,4
1664519554,4
1664548711,4
1664605833,4
1664635111,4
1668560577,2
1668646979,2
1673516775,2
1674367285,2
1674455475,2
1674541884,2
1674628285,2
1674714694,2
1674801082,2
1674887480,2
1674973872,2
1675060281,2
1675146682,2
1675233071,2
1675319481,2
1675405883,2
1675492281,2
1675578681,2
1675837863,2
1676442661,2
1676615450,2
1676701857,2
1676788249,2
1676874662,2
1676961061,2
1677047454,2
1677133857,2
1677220262,2
1677306660,2
1677393061,2
1677479458,2
1677565859,2
1677738657,2
1677825057,2
1677911460,2
1677997847,2
1678084257,2
1678170666,2
1678257055,2
1678343445,10
1679569142,4
1679584407,4
1679589867,4
1679596494,4
1679602915,4
1679607956,4
1679639532,18
1679722309,2
1679808717,2
1679895117,2
1679981518,2
1680067912,2
1680154308,2
1680240714,2
1680327097,2
1680413504,2
1680499902,2
1680586299,2
1680672702,2
1680759104,2
1680845523,2
1680931899,2
1681018301,2
1681104713,2
1681191117,2
1681277516,2
1681363906,2
1681450306,2
1681536706,2
1681623105,2
1681709528,2
1681795909,2
1681882326,2
1681968706,2
1682055103,2
1682141505,2
1682227910,2
1682314324,2
1682400707,2
1682487105,2
