1659076365,3
1659105646,3
1659162770,16
1659192044,16
1659249159,33
1659278470,33
1659335565,24
1659364847,24
1659421963,30
1659451128,30
1659508368,22
1659537519,22
1659594767,12
1659624049,12
1659681160,12
1659710444,12
1659767561,19
1659796845,19
1659853840,28
1659883130,28
1659940369,20
1659969638,20
1660026647,26
1660056049,26
1660113163,5
1660142439,5
1660199441,24
1660228849,24
1660285970,35
1660315250,35
1660372250,33
1660401521,33
