1649140351,111
1649226751,118
1649313029,158
1649399549,257
1649485949,235
1649572354,134
1649658750,317
1649745150,353
1649831565,218
1649917950,295
1650004228,273
1650090628,218
1650177150,297
1650263549,264
1650349831,248
1650436229,120
