1662877847,3
1662907237,3
1662964357,3
1662993645,3
1663050638,5
1663080057,5
1663137169,2
1663166448,2
1663223564,6
1663252844,6
1663309969,3
1663339237,3
1663396358,5
1663425653,5
1663482759,2
1663512042,2
1663569159,7
1663598447,7
1663655565,19
1663684725,19
1663741840,4
1663771124,4
1663828239,8
1663857524,8
1663914640,4
1663943934,4
1664001039,5
1664030318,5
1664087438,7
1664116722,7
1664173842,5
1664203127,5
1664260251,6
1664289537,6
1664346641,21
1664375951,21
1664433041,6
1664462320,6
1664519554,6
1664548711,6
1664605833,11
1664635111,11
