1681795909,71
1681882326,220
1681968706,122
1682055103,130
1682141505,122
1682227910,209
1682314324,52
1682400707,131
1682487105,354
1682573524,325
1682659898,230
1682746309,139
1682832700,159
1682919107,128
1683005499,64
1683091901,150
1683178309,120
1683264713,273
1683351101,140
1698384826,46
1698474862,32
