1673516775,6
1675146682,2
1675233071,3
1675578681,2
1675665075,8
1675751474,8
1676615450,7
1676788249,6
1676874662,2
1677133857,2
1677393061,5
1677652257,4
1677911460,6
1678257055,2
1679722309,7
1680327097,2
1680586299,2
1680759104,7
1680845523,4
1680931899,4
1681018301,4
1681104713,4
1681191117,5
1681277516,5
1681363906,5
1681450306,5
1681536706,4
1681709528,2
1681968706,15
1682055103,8
1682487105,8
1682573524,14
1682659898,3
1682746309,1
1682832700,16
1682919107,5
1683005499,3
1683091901,2
1683264713,5
1683351101,3
1683437506,1
1683523904,1
1683610328,1
1683783116,1
1683869508,3
1683955918,1
1684042308,2
1685544777,6
1685597496,13
1685683902,9
1685770303,8
1685856701,10
1685943100,11
1686029502,21
1686115904,11
1686202306,6
1686288711,9
1686375108,13
1686461512,17
1686547909,11
1686634309,11
1686720704,15
1686807105,11
1686893562,10
1686979954,3
1687066360,3
1687152774,2
1687411953,1
1687584774,4
1687671173,1
1687757568,4
1687930377,1
1688016807,3
1688103218,13
1688189597,4
1688275996,1
1688535215,1
1688621614,8
1688708029,6
1688794420,10
1688880821,11
1688967219,4
1689053626,18
1689140028,4
1689226424,5
1689312837,8
1689399195,4
1689485597,1
1689572000,3
1689658397,2
1689744807,5
1689831241,3
1689917640,2
1690004042,1
1690176817,1
1690263240,3
1690349617,3
1690436012,1
1690522443,1
1690608808,4
1690695212,16
1690781617,2
1690868047,8
1690954421,2
1691040818,1
1691127250,2
1691213630,2
1691300015,4
1691386395,3
1691472821,2
1691559206,1
1691645653,5
1691732035,4
1691818443,4
1691991184,14
1692077570,2
1692163972,3
1692250382,1
1692336773,3
1692423180,3
1692509573,1
1692595944,2
1692682368,16
1692768764,1
1692941568,1
1693027980,1
1693114356,2
1693200777,4
1693287141,1
1693373568,1
1693459952,1
1693546364,7
1693632754,3
1693719144,1
1693805540,12
1693978362,1
1694064749,8
1694151151,2
1694237547,3
1694323959,1
1694496769,2
1694583178,2
1694755972,2
1694842363,4
1695015165,2
1695360784,2
1695447164,1
1695706406,2
1695792808,1
1695879218,3
1695965624,1
1696052011,19
1696224807,1
1696311219,17
1696397621,1
1696484041,4
1696570435,3
1696656841,9
1696743237,5
1696829644,20
1696916048,2
1697002439,14
1697088838,3
1697175238,14
1697261644,2
1697348050,6
1697434425,2
1697520844,1
1697607247,1
1697693651,7
1697780021,2
1697866447,2
1697952848,3
1698039229,1
1698125641,5
1698212053,1
1698298423,2
1698384826,5
1698474862,11
1698561261,3
1698647660,5
1698734051,1
1698820440,6
1698906836,1
1698993260,17
1699079643,11
1699252467,2
1699338847,2
1699425254,6
1699511642,7
1699598052,20
1699684453,2
1699770845,6
1699857241,8
1699943653,6
1700030030,17
1700116443,5
1700202865,8
1700289223,6
1700375637,1
1700462021,14
1700548451,11
1700634836,6
1700721246,8
1700807657,27
1700894058,12
1700980458,19
1701066868,6
1701239661,8
1701412459,5
1701498834,1
1701585234,5
1701671642,3
1701758036,2
1701930831,1
1702017289,3
1702103633,2
1702190033,1
1702276447,2
1702362833,5
1702535641,17
1702622071,3
1702708433,9
1702881239,2
1702967665,16
1703054037,1
1703140439,1
1703226865,1
1703313245,10
1703399641,20
1703572441,1
1703745239,2
1703831661,2
1703918046,1
1704004443,1
1704090847,11
1704177241,36
1704263638,36
1704350037,31
1704436450,28
1704522832,11
1704609231,15
1704695681,14
1704782089,19
1704868474,25
1704954878,14
1705041294,15
1705127674,15
1705300477,8
1705386877,6
1705473291,1
1705559692,4
1705646097,15
1705732479,7
1705818877,1
1705905294,6
1705991686,16
1706078101,6
1706250972,2
1706337342,1
1706423747,2
1706510148,2
1706596552,2
1706682956,1
1706769366,4
1706855781,3
1706942169,11
1707028569,1
1707114964,3
1707201363,1
1707287760,3
1707374158,10
1707460602,3
1707546967,9
1707633370,1
1707719770,10
1707806171,12
1707892577,10
1707978960,15
1708065403,12
1708151763,9
1708238171,11
1708324568,10
1708410859,8
1708497318,7
1708583778,11
1708670174,34
1708756568,15
1708842965,17
1708929366,11
1709015768,19
1709102173,10
1709188566,9
1709275007,17
1709361374,12
1709447776,9
1709534155,14
1709620564,21
1709706962,3
1709793367,3
1709966169,19
1710052561,8
1710138969,3
1710225362,15
1710311773,17
1710398159,9
1710484595,5
1710570954,9
1710657364,13
1710743767,11
1710830176,9
1710916554,12
1711002952,16
1711089395,11
1711175767,15
1711262153,11
1711348567,18
1711434966,5
1711607758,8
1711694155,13
1711776969,12
1711863379,13
1711949767,12
1712036181,12
1712122595,13
1712209001,15
1712295387,7
1712381761,7
1712468183,12
1712554571,4
1712640970,6
1712727387,8
1712813813,9
1712900232,3
1712986589,16
1713073014,7
1713159410,6
1713245803,18
1713332196,7
1713418604,7
1713505010,10
1713591405,3
1713677807,1
1713764197,6
1713850601,5
1713937016,2
1714023425,2
1714109816,9
1714196216,2
1714282602,7
1714369033,25
1714455398,25
1714541804,14
1714714600,26
1714801009,47
1714887409,47
1714973810,39
1715060210,44
1715146632,16
1715233058,9
1715319563,8
1715405851,14
1715492244,18
1718022496,90
1718084230,90
1718170636,67
1718257047,34
1718343427,114
1718429818,24
1718516215,20
1718602645,11
1718689022,8
1718775431,69
1718861831,71
1718948217,16
1719034629,40
1719121031,30
1719207304,61
1719293732,46
1719380130,35
1719466523,30
1719552933,79
1719639300,66
1719725705,116
1719812104,36
1719898511,29
1719984907,34
1720071331,32
1720157731,32
1720244127,75
1720330509,24
1720416929,15
1720503328,59
1720589730,6
1720676127,69
1720762554,27
1720935328,77
1721021712,26
1721108139,18
1721194539,62
1721280942,17
1721367339,11
1721453736,49
1721540139,8
1721626512,50
1721712930,62
1721799317,61
1721885729,20
1721972116,19
1722058513,12
1722144941,5
1722231340,45
1722317737,6
1722404147,3
1722490541,6
1722576933,82
1722663315,2
1722749743,3
1722836105,7
1722922512,4
1723008910,3
1723181712,9
1723268105,3
1723354509,2
1723440921,1
1723527316,3
1723613721,2
1723700119,49
1723786513,3
1723872909,26
1723959316,45
1724045707,11
1724132118,4
1724218520,44
1724304925,18
1724391319,48
1724477730,3
1724564111,4
1724650531,24
1724736906,7
1724823316,2
1724909717,4
1724996108,12
1725082506,46
1725168909,6
1725255319,54
1725341717,39
1725428109,61
1725514506,2
1725600914,7
1725687306,22
1725773707,53
1725860113,149
1725946519,66
1726032920,12
1726119315,28
1726205705,49
1726292115,48
1726378512,4
1726464916,74
1726551329,95
1726637718,50
1726724132,7
1726810515,5
1726896925,6
1726983322,11
1727069719,3
1727156114,46
1727242538,56
1727328917,3
1727415326,48
1727501713,20
1727588116,116
1727674524,97
1727760922,14
1727847333,15
1727933723,1
1728020122,50
1728106547,7
1728192945,4
1728279336,15
1728365743,10
1728452151,47
1728538537,10
1728624938,64
1728711328,96
1728797737,2
1728884126,2
1728970539,10
1729056925,45
1729143336,4
1729229724,52
1729316123,24
1729402521,50
1729488952,7
1729575323,2
1729661730,2
1729748135,22
1729834546,5
1729924541,6
1730010943,4
1730097332,58
1730183730,25
1730270141,16
1730356536,46
1730442925,17
1730529338,6
1730615759,46
1730702128,93
1730788525,25
1730874965,4
1730961326,49
1731047722,46
1731134141,3
1731220531,101
1731306938,9
1731393338,52
1731479747,42
1731566125,2
1731652532,7
1731738930,51
1731825326,7
1731911726,75
1731998131,49
1732084532,3
1732170946,6
1732257343,82
1732343726,67
1732430128,123
1732516530,17
1732602931,27
1732689332,69
1732775733,98
1732862185,49
1732948585,7
1733034986,6
1733121412,2
1733207816,10
1733294214,48
