1646548229,9
1646634751,16
1646721161,12
1646807431,18
1646893952,19
1646980230,19
1647066751,21
1647153150,17
1647239550,24
1647325952,13
1647412352,22
1647498752,22
1647585151,24
1647757954,12
1647844355,21
1647930752,13
1648017150,28
1648103550,14
1648189831,12
1648276229,12
1648362752,13
1648449033,13
1648535442,10
1648621952,13
1648708231,20
1648794750,24
1648881149,13
1648967561,15
1649053832,11
1649140351,3
