1687411953,26
1687498393,25
1687584774,27
1687671173,28
1687757568,29
1687843969,27
1687930377,14
1688016807,12
1688103218,17
1688189597,20
1688275996,22
1688362412,14
1688535215,14
1688621614,26
1688708029,27
1688794420,26
1688880821,29
1688967219,21
1689053626,18
1689140028,31
1689226424,11
1689312837,22
1689399195,18
1689485597,11
