1646548229,2
1646634751,11
1646721161,14
1646807431,23
1646893952,16
1646980230,17
1647066751,14
1647153150,12
1647239550,20
1647325952,15
1647412352,30
1647498752,16
1647585151,21
1647757954,17
1647844355,15
1647930752,11
1648017150,12
1648103550,15
1648189831,12
1648276229,9
1648362752,13
1648449033,24
1648535442,10
1648621952,21
1648708231,12
1648794750,11
1648881149,12
1648967561,6
1649053832,23
1649140351,11
1649226751,14
