1646548229,2
1646634751,3
1646721161,4
1646807431,2
1646893952,2
1646980230,4
1647066751,7
1647153150,12
1647239550,3
1647325952,5
1647412352,4
1647498752,4
1647585151,6
1647757954,5
1647844355,7
1647930752,2
1648017150,1
1648103550,3
1648189831,4
1648276229,8
1648362752,7
1648449033,4
1648535442,3
1648621952,4
1648708231,6
1648794750,7
1648881149,3
1648967561,4
1649053832,4
1649140351,3
1649226751,7
