1642824017,1
1642855092,1
1642996821,1
1643428818,1
1644120017,1
1644321017,1
1644407418,1
1644493816,1
1645425017,1
1645467072,3
1645470791,3
1645511417,1
1646289021,1
1646375417,2
1648189818,6
1649658616,6
1649917817,1
1650263417,1
1650349817,6
1650695416,6
1650954617,6
1652337017,1
1653287417,1
1653460218,1
1654324218,7
1654583418,294
1654669819,324
1654756220,295
1654842619,350
1654929020,328
1655015420,268
1655101820,350
1655188220,397
1655274620,350
1655361020,249
1655447420,250
1655533820,300
1655620219,291
1655706620,288
1655793020,312
1655879419,278
1655965820,262
1656052220,295
1656138620,282
1656225021,357
1656311420,362
1656397820,375
1656484219,310
1656570620,433
1656743420,392
1656829825,300
1656916221,262
1657002620,319
1657089026,254
1657175421,282
1657261820,269
1657348220,313
1657434621,362
1657521020,350
1657607420,310
1657693820,374
1657780221,328
1657802862,328
1657804268,328
1657809502,328
1657866623,340
1657895901,340
1657953021,348
1657982299,348
1658039421,380
1658068700,380
1658125821,267
1658155101,267
1658212225,324
1658241501,324
1658298621,288
1658327901,288
1658385022,283
1658414301,283
1658471422,309
1658500701,309
1658557821,301
1658587100,301
1658644222,298
1658673501,298
1658730621,329
1658759902,329
1658817021,287
1658846302,287
1658903422,342
1658932705,342
1658989823,350
1659019101,350
1659076222,301
1659105502,301
1659162627,381
1659191900,381
1659249022,189
1659278322,189
1659335422,318
1659364701,318
1659421824,329
1659451103,329
1659508224,288
1659537501,288
1659594623,276
1659623905,276
1659681021,427
1659710300,427
1659767422,334
1659796701,334
1659853823,300
1659883102,300
1659940222,266
1659969502,266
1660026622,289
1660055909,289
1660113023,324
1660142301,324
1660199423,326
1660228702,326
1660285827,400
1660315101,400
1660372222,250
1660401503,250
1660458622,297
1660487902,297
1660545024,329
1660574303,329
1660631425,304
1660660703,304
1660717823,240
1660747103,240
1660804224,268
1660833502,268
1660890621,252
1660919901,252
1660977024,340
1661006307,340
1661063424,140
1661092702,140
1661149822,285
1661179101,285
1661236224,230
1661265501,230
1661322622,338
1661351904,338
1661409023,231
1661438302,231
1661495422,343
1661524710,343
1661581822,302
1661611101,302
1661668224,286
1661697464,286
1661699946,286
1661754643,204
1661783901,204
1661870301,247
1661927420,269
1661956700,269
1662013821,351
1662043102,351
1662100220,329
1662129500,329
1662186621,220
1662215902,220
1662273020,359
1662302302,359
1662359420,252
1662388701,252
1662445820,328
1662475100,328
1662532221,172
1662561500,172
1662618621,241
1662647901,241
1662705021,301
1662734301,301
1662791421,137
1662820700,137
1662877820,346
1662907100,346
1662964220,308
1662993501,308
1663050620,252
1663079900,252
1663137032,241
1663166301,191
1663223426,213
1663252701,213
1663309821,257
1663339101,257
1663396221,260
1663425502,260
1663482622,267
1663511901,247
1663569021,358
1663598303,358
1663655421,245
1663684703,245
1663741822,250
1663771101,250
1663828220,293
1663857500,293
1663914621,236
1663943902,236
1664001021,239
1664030301,239
1664087421,303
1664116701,303
1664173822,299
1664203101,299
1664260231,252
1664289502,252
1664346622,300
1664375912,300
1664433023,261
1664462299,261
1664519418,52
1664548696,54
1664605817,61
1664635096,62
1668350508,99
1668355650,99
1668356487,99
1668360366,99
1679584314,109
1679589759,109
1679596397,109
1679602819,109
1679607852,109
1679639432,150
1679722230,300
1679808631,300
1679981431,55
1680067829,309
1680154230,218
1680240629,130
1680327029,350
1680413427,352
1680499830,301
1680586231,285
1680672631,349
1680759032,343
1680845434,307
1680931831,193
1681018231,218
1681104631,322
1681191033,371
1681277433,367
1681363834,101
1681450235,301
1681536635,300
1681623032,300
1681709434,254
1681795835,150
1681882234,341
1681968635,178
1682055034,300
1682141433,231
1682227834,300
1682314235,212
1682400635,151
1682487032,325
1682573432,116
1682659832,268
1682746233,210
1682832633,290
1682919034,312
1683005434,150
1683091833,378
1683264631,303
1683351031,318
1683437432,201
1683523832,303
1683610233,394
1683696632,184
1683783032,28
1683869438,21
1683955833,23
1684042234,20
1685544705,4
1685597429,7
1685683833,3
1685770233,1
1685856632,1
1685943031,5
1686029431,2
1686115831,1
1686202233,4
1686288634,3
1686375033,1
1686461431,1
1686547832,1
1686634231,1
1686720636,2
1686893441,1
1686979840,1
1687066239,2
1687498241,1
1687757437,3
1687843838,2
1687930240,1
1688189452,39
1688275841,3
1688535044,4
1689312653,1
1689399039,1
1689485439,1
1689658239,1
1689744640,25
1690090245,2
1690176650,1
1690263047,1
1690349447,3
1690435846,2
1690522245,1
1690781448,11
1690867847,2
1690954248,1
1691040648,43
1691127048,2
1691299847,1
1691645448,2
1691818247,1
1691904646,2
1692077440,2
1692509432,2
1693114233,1
1693459835,34
1693546239,25
1693632645,28
1693719037,43
1693805431,30
1693891835,32
1693978232,29
1694064634,18
1694151031,15
1694237434,15
1694323834,10
1694410234,13
1694496634,11
1694583036,13
1694669436,13
1694755834,9
1694842234,8
1694928634,10
1695015035,14
1695187834,24
1695274234,20
1695360634,29
1695447034,23
1695533434,22
1695619839,26
1695706241,1
1696311044,30
1696570241,5
1696743043,4
1696915841,1
1697088641,3
1697347842,68
1697520642,48
1697607044,45
1697693444,2
1697779843,67
1697866244,60
1697952644,58
1698211845,1
1698993045,2
1699079441,2
1699425038,1
1699770639,3
1699943446,1
1700202637,1
1700289040,3
1700375440,1
1700461838,1
1700721041,3
1700807441,1
1700893840,1
1700980240,2
1701066641,1
1701239442,5
1701412240,8
1701498639,1
1701671441,1
1702017040,1
1702449040,1
1702621850,4
1702794640,3
1702881040,1
1703226640,1
1703313041,1
1703572241,22
1703658641,4
1703745040,1
1703831442,1
1703917841,1
1704090642,1
1704177040,3
1704349840,1
1704522640,1
1704609039,1
1704695446,7
1704781855,4
1704868244,2
1704954645,4
1705127446,51
1705300246,1
1705386645,3
1705473046,1
1705645846,9
1705732246,9
1705905046,4
1706077848,6
1706250646,32
1706337052,2
1706596254,4
1706769066,1
1706855451,1
1706941851,2
1707114652,4
1707201051,1
1707373846,1
1707546652,1
1707633051,1
1707719451,1
1707978650,2
1708237849,1
1708324253,1
1708410644,5
1708583454,1
1708756257,1
1708929053,2
1709015454,1
1709274654,1
1709620251,1
1710052251,4
1710225056,1
1710397854,10
1710657050,1
1710743450,18
1710829851,1
1710916249,5
1711002651,13
1711089048,1
1711261844,5
1711348246,1
1711434657,3
1711607445,25
1711776649,16
1712035850,1
1712122273,1
1712295052,20
1712381450,1
1712554251,18
1712640649,1
1712727049,6
1712813449,6
1713072653,2
1713245451,2
1713331852,4
1713418260,2
1713504653,8
1713591051,1
1713677452,8
1713763854,1
1713850252,3
1713936654,7
1714023055,3
1714109453,2
1714195863,2
1714282254,2
1714368659,3
1714714252,1
1714800655,1
1714887055,1
1714973453,56
1715059856,5
1715232665,7
1715405462,8
1715491864,2
1718083857,6
1718343064,5
1718602257,2
1718688659,2
1718775058,1
1718861458,4
1719034258,2
1719120657,1
1719207047,5
1719293448,50
1719552647,8
1719639047,1
1719725446,19
1719984647,2
1720503049,2
1720675849,6
1721021447,1
1721280649,3
1721453448,1
1721539849,16
1721626248,1
1721712651,55
1721799049,1
1721885449,4
1721971847,2
1722058248,3
1722144650,3
1722317451,5
1722403851,7
1722576648,5
1722835849,6
1722922247,1
1723354248,11
1723872647,14
1724045446,1
1724391048,1
1724477449,2
1724650249,1
1724736648,1
1724823048,16
1724995846,1
1725168647,9
1725427848,2
1725514248,2
1725600651,1
1725687049,1
1725859849,1
1726205448,2
1726291851,4
1726378249,1
1726464648,5
1726551051,5
1726637450,2
1726723852,1
1726810249,1
1727069449,1
1727155849,3
1727415052,2
1727501449,1
1727587850,1
1727674250,22
1727847052,18
1727933451,1
1728106253,18
1728192652,1
1728365452,18
1728451854,1
1728538253,6
1728624654,1
1728797453,18
1729229452,6
1729402253,1
1729575053,3
1729661454,2
1730097050,1
1730183452,5
1730442652,1
1730615453,7
1730701851,2
1730788251,11
1730874652,7
1731133849,2
1731393053,2
1731565854,53
1731825055,4
1732170653,1
1732257053,2
1732516250,6
1732602651,1
1732689052,4
1732948260,5
1733121060,5
1733293861,1
