1702449238,2
1702535641,90
1702622071,117
1702708433,54
1702794843,68
1702881239,66
1702967665,101
1703054037,92
1703140439,110
1703226865,116
1703313245,70
1703399641,204
1703572441,120
1703658841,70
1703745239,12
