1649313029,3
1649399549,8
1649485949,6
1653978755,2
1654065033,21
1654151553,15
1654237831,18
1654324351,18
1654410631,16
1654497153,20
1654583555,17
1654669837,27
1654756356,5
1654842756,12
1654929156,8
1655015436,2
1655101838,7
1655274636,10
