1642910490,6
1642924655,6
1642934565,6
1642937864,6
1642996892,26
1643083292,19
1643169628,22
1643256090,29
1643342487,21
1643428827,16
1643515288,10
1643601634,12
1643622207,12
1643688028,12
1643708607,12
1643774489,10
1643860889,12
1643947288,14
1644033629,21
1644120088,9
1644206493,10
1644292831,7
1644321030,7
1644388289,8
1644407490,8
1644474692,5
1644493888,5
1644561030,5
1644647492,10
1644733834,10
1644770508,10
1644820292,14
1644906689,21
1644993090,14
1645079499,7
1645165829,8
