1691645653,5
1691732035,34
1691818443,26
1691904834,24
1691991184,23
1692077570,24
1692163972,41
1692250382,20
1692336773,9
1692423180,9
1692509573,17
1692595944,3
1692682368,6
1692768764,3
1692855167,14
1692941568,10
1693027980,16
1693114356,4
