1646289033,5
1646375551,17
1646461951,10
1646548229,15
1646634751,16
1646721161,24
1646807431,24
1646893952,17
1646980230,15
1647066751,22
1647153150,11
1647239550,20
1647325952,3
1647412352,25
1647498752,12
1647585151,15
