1644033618,1
1644561017,2
1644733822,1
1644770413,1
1644993017,1
1645252217,1
1645511417,1
1645597817,1
1645684217,1
1645770616,2
1645857016,7
1646029817,1
1647930618,2
1648967418,1
1649140217,1
1649658616,1
1649745017,1
1650349817,1
1650436217,1
1650522617,1
1650609029,1
1650695416,8
1650781820,1
1650868217,1
1650954617,2
1651041017,2
1651127418,1
1651213817,1
1651300219,1
1651386622,1
1651473017,2
1651559421,2
1651645827,1
1651818617,1
1651905018,1
1651991417,1
1652077818,1
1652164218,1
1652250621,1
1652423417,1
1652509817,1
1652596217,1
1652769018,1
1652855418,1
1653028217,1
1653201018,2
1653546617,2
1653633018,1
1653719418,1
1653805821,1
1653892219,1
1654065018,3
1654151419,1
1654237818,1
1654324218,2
1654410618,1
1654497019,1
1654669819,1
1654756220,1
1654842619,1
1654929020,1
1655015420,1
1655101820,2
1655188220,1
1655361020,1
1655533820,1
1655620219,1
1655706620,1
1655879419,1
1658903422,1
1658932705,1
1660804224,2
1660833502,2
1661236224,1
1661265501,1
1661870301,2
1662359420,1
1662388701,1
1662532221,1
1662561500,1
1664173822,1
1664203101,1
1680499830,1
1680759032,1
1681018231,1
1681968635,1
1682400635,1
1682573432,1
1685544705,1
1685856632,1
1686029431,1
1686720636,1
1693373437,1
1694323834,1
1694842234,1
1695533434,1
1696656645,1
1700721041,1
1701930638,1
1702449040,1
1704177040,1
1704349840,4
1705300246,1
1710052251,1
1710311452,2
1712813449,1
1713331852,1
1718515859,1
1718602257,1
1718688659,1
1719293448,1
1720503049,5
1721971847,1
1727069449,2
1727587850,1
1728711053,1
1731306649,1
1732084253,1
1732516250,1
