1650349831,3
1650436229,14
1650522756,11
1650609163,11
1650695550,14
1650781953,12
1650868349,18
1650954630,23
1651041030,29
1651127552,30
1651213951,26
1651300352,25
1651386755,35
1651473034,23
1651559564,17
1651645850,34
