1679639432,2
1679981431,1
1680240629,1
1680845434,2
1683437432,2
1683610233,2
1688707844,2
1688794245,2
1688880644,2
1688967042,2
1689053441,2
1689139840,2
1689226241,2
1689312653,2
1689744640,1
1689831044,2
1689917446,2
1690003846,2
1690263047,2
1690522245,2
1690867847,2
1691127048,2
1691645448,2
1691731846,2
1691818247,1
1691991040,2
1692077440,1
1692163831,1
1692250233,1
1692336633,1
1692423035,1
1692509432,1
1704436239,2
1705041045,1
