1692595944,1
1692682368,5
1692768764,3
1692855167,25
1692941568,3
1693027980,3
1693114356,4
1693200777,2
1693287141,2
1693373568,6
1693459952,2
1693546364,1
1693632754,6
1693719144,18
1693805540,24
1693891949,3
1693978362,4
1694064749,9
1694151151,4
1694237547,3
1694323959,20
1694410362,5
1694496769,3
1694583178,19
1694669562,8
1694755972,7
1694842363,6
1694928766,1
1695015165,4
1695187975,11
1695274380,2
1695360784,3
1695447164,1
1695533586,1
1695619990,9
1695706406,3
1695792808,11
1695879218,2
1695965624,19
1696052011,1
1696138408,2
1696224807,8
1696311219,14
1696397621,3
1696484041,3
1696570435,4
1696656841,5
1696743237,1
1696829644,19
1697002439,8
1697088838,4
