1646548229,8
1646634751,102
1646721161,119
1646807431,253
1646893952,126
1646980230,242
1647066751,104
1647153150,157
1647239550,259
1647325952,139
1647412352,155
1647498752,171
1647585151,276
1647757954,153
1647844355,135
1647930752,158
1648017150,350
1648103550,152
1648189831,209
1648276229,162
1648362752,245
1648449033,181
1648535442,179
1648621952,160
1648708231,162
1648794750,282
1648881149,317
1648967561,189
1649053832,56
