1642769464,2
1642771512,2
1642805117,2
1642805834,2
1642824017,2
1642855092,3
1642910419,2
1642924636,2
1642934533,2
1642937831,2
1642996821,2
1643083221,2
1643169617,2
1643256019,2
1643342418,2
1643428818,2
1643515217,2
1643601623,2
1643622136,2
1643688017,2
1643708536,2
1643774418,2
1643860818,2
1643947216,2
1644033618,2
1644120017,2
1644206423,2
1644292820,2
1644321017,2
1644388216,2
1644407418,2
1644474619,2
1644493816,2
1644561017,4
1644647419,2
1644733822,2
1644770413,2
1644820219,2
1644906616,2
1644993017,2
1645079416,2
1645165816,2
1645252217,2
1645338616,4
1645425017,3
1645467072,3
1645470791,3
1645511417,2
1645597817,6
1645684217,2
1645770616,2
1645857016,10
1645943421,2
1646029817,2
1646116216,2
1646202626,2
1646289021,2
1646375417,2
1646461818,2
1646548217,2
1646634617,2
1646721028,2
1646807418,2
1646893818,2
1646980217,2
1647066619,2
1647153018,2
1647239417,2
1647325819,2
1647412220,2
1647498618,2
1647585017,3
1647757818,2
1647844218,2
1647930618,2
1648017017,2
1648103417,2
1648189818,2
1648276217,2
1648362619,1
1648449020,1
1648535417,2
1648621818,1
1648708217,1
1648794617,1
1649140217,1
1649485817,6
1650349817,1
1650436217,1
1650522617,1
1650609029,1
1650695416,8
1650781820,1
1650868217,1
1650954617,6
1651041017,7
1651127418,1
1651213817,2
1651300219,1
1651386622,1
1651473017,1
1651559421,1
1651645827,1
1651818617,1
1651905018,1
1651991417,1
1652077818,1
1652164218,1
1652250621,1
1652423417,2
1652509817,1
1652596217,1
1652769018,2
1652855418,1
1653028217,1
1653201018,1
1653546617,1
1653633018,1
1653719418,2
1653805821,1
1653892219,1
1654065018,2
1654151419,2
1654237818,1
1654324218,2
1654410618,1
1654497019,1
1654669819,1
1654756220,1
1654842619,1
1654929020,1
1655015420,1
1655101820,1
1655188220,1
1655361020,1
1655533820,1
1655620219,1
1655706620,1
1655879419,1
1657348220,1
1659767422,1
1659796701,1
1661236224,1
1661265501,1
1662791421,1
1662820700,1
1663914621,1
1663943902,1
1664548696,1
1664605817,1
1664635096,1
1682227834,3
1685544705,1
1686202233,4
1686720636,3
1687066239,1
1688967042,2
1689831044,1
1694064634,1
1697866244,1
1704349840,2
1706250646,2
1707633051,3
1710397854,1
1711693844,1
1712295052,1
1714023055,1
1718256669,1
1719293448,2
1720503049,1
1721971847,1
1725168647,2
1726378249,1
1726723852,1
1726810249,1
1728279054,2
1728538253,1
1730874652,1
1731652254,1
