1650004228,7
1650090628,9
1650177150,7
1650263549,8
1650349831,2
1650436229,5
1650522756,10
1650609163,11
1650695550,14
1650781953,12
1650868349,12
1650954630,18
1651041030,20
1651127552,18
1651213951,25
1651300352,13
1651386755,14
1651473034,17
1651559564,13
1651645850,22
1651732362,21
1651818753,21
1651905153,19
1651991564,6
1652077954,13
1652164360,14
1652250764,9
1652337032,4
1652423553,9
1652509832,8
1652596232,13
1652682759,5
