1685544777,152
1685597496,108
1685683902,97
1685770303,433
1685856701,89
1685943100,237
1686029502,228
1686115904,322
1686202306,108
1686288711,168
1686375108,93
1686461512,728
1686547909,117
1686634309,120
1686720704,92
1686807105,94
1686893562,98
1686979954,166
1687066360,651
1687152774,71
1687239150,93
1687411953,56
1687498393,124
1687584774,589
1687671173,190
1687757568,17
1687843969,82
1687930377,439
1688016807,149
1688103218,127
1688189597,209
1688275996,167
1688362412,489
1688535215,239
1688621614,465
1688708029,261
1688794420,67
1688880821,106
1688967219,435
1689053626,4
