1637208446,4
1637294806,10
1638245235,2
1638331638,10
1642392088,2
1642408942,2
1642910490,2
1642924655,2
1642934565,2
1642937864,2
1642996892,2
1648449033,2
1648535442,4
1654842756,2
1655015436,1
1661149842,2
1661179125,2
1683696716,2
1685544777,5
