1682487105,16
1682573524,26
1682659898,36
1682746309,33
1682832700,31
1682919107,28
1683005499,30
1683091901,31
1683178309,26
1683264713,32
1683351101,26
1683437506,32
1683523904,33
1683610328,26
1683696716,5
