1649745150,66
1653978755,49
1654151553,51
1654237831,40
1654756356,369
1654842756,83
1655101838,133
1655188357,307
1655361158,1466
1655447555,1458
1655706645,136
1655793158,17
1655879557,851
1655965955,225
1656311556,209
1656397956,210
1656484356,138
1656570758,2739
1656916357,86
1657002637,72
1657089163,48
1657175559,176
1657261838,270
1657521164,190
1657607566,346
1657693957,291
1657780357,270
1657803090,270
1657804447,270
1657809517,270
1657866760,235
1657896040,235
1658125843,92
1658155247,92
1658212362,92
1658241661,92
1658298758,47
1658328052,47
1658385041,101
1658414447,101
1658471560,58
1658500847,58
1658730762,94
1658760045,94
1658817160,99
1658846453,99
1658903439,58
1658932848,58
1658989840,246
1659019246,246
1659076365,99
1659105646,99
1659335565,100
1659364847,100
1659421963,153
1659451128,153
1659508368,270
1659537519,270
1659594767,128
1659624049,128
1659681160,64
1659710444,64
1659940369,245
1659969638,245
1660026647,606
1660056049,606
1660113163,217
1660142439,217
1660199441,470
1660228849,470
1660285970,364
1660315250,364
1660545162,327
1660574449,327
1660631564,154
1660660730,154
1660717841,219
1660747248,219
1660804362,212
1660833647,212
1660890760,57
1660920046,57
1661149842,820
1661179125,820
1661236366,415
1661265647,415
1661322641,57
1661352051,57
1661409162,59
1661438449,59
1661495561,66
1661524735,66
1661754784,115
1661784048,115
1661870448,173
1661927560,151
1661956724,151
1662100359,37
1662129642,37
1662273039,58
1662302447,58
1662359559,190
1662388727,190
1662532358,361
1662561643,361
1662705164,58
1662734437,58
1662964357,471
1662993645,471
1663050638,478
1663080057,478
1663137169,328
1663166448,328
1663223564,248
1663252844,248
1663396358,121
1663425653,121
1663569159,175
1663598447,175
1671629111,410
1671630664,410
1671632450,410
1671634011,410
1674455475,58
1674714694,4
1675751474,28
1678343445,28
