1679584314,2
1679589759,2
1679596397,2
1679602819,2
1679607852,2
1679639432,2
1679981431,2
1680240629,2
1680845434,2
1683610233,1
1687066239,1
1688016640,1
1688103041,1
1688362240,1
1688535044,1
1688621445,1
1688707844,1
1688794245,1
1688880644,1
1688967042,1
1690867847,2
1691127048,2
1691818247,1
1691904646,1
1691991040,1
1692077440,1
1692163831,1
1692250233,1
1692336633,1
1692423035,1
1692509432,1
1692682233,1
1693027839,1
1693114233,1
1693200633,1
1693978232,2
1694323834,2
1694410234,1
1694496634,1
1694583036,1
1694669436,1
1694755834,1
1694842234,1
1694928634,1
1695965441,1
1697866244,1
1697952644,1
1698211845,1
1698474646,1
1698561046,1
1698647445,1
1698733843,1
1698993045,2
1699079441,1
1699165843,1
1699252253,4
1699425038,1
1699597838,4
1699684239,2
1699770639,2
1699943446,1
1700116239,1
1700202637,2
1700548240,1
1700634640,1
1700721041,1
1700807441,2
1700893840,1
1700980240,1
1701239442,1
1701412240,2
1702017040,1
1702621850,1
1703226640,1
1703831442,1
1704436239,6
1705041045,1
1706077848,1
1706941851,1
