1692682233,1
1692768633,1
1692855035,1
1692941433,1
1693027839,1
1693200633,1
1693978232,1
1694583036,1
1694755834,1
1694842234,1
1694928634,1
1695274234,1
1695360634,1
1695533434,1
1695619839,1
1695965441,1
1696483842,1
1696570241,1
1696743043,1
1696829444,1
1696915841,1
1697002242,1
1697088641,1
1697175042,1
1697261447,1
1697347842,1
1697520642,1
1697607044,1
1697693444,1
1697866244,1
1697952644,1
1698211845,1
1698474646,1
1698561046,1
1698647445,1
1698733843,2
1698993045,1
1699079441,1
1699165843,1
1699252253,6
1699338639,1
1699425038,1
1699597838,2
1699684239,1
1699770639,1
1699857040,1
1699943446,1
1700116239,1
1700202637,2
1700548240,1
1700721041,1
1700807441,2
1700893840,1
1700980240,1
1701066641,1
1701239442,1
1701412240,2
1701671441,1
1702017040,1
1702621850,1
1703226640,1
1703831442,1
1704436239,1
1705041045,1
1705645846,1
1708410644,2
1708583454,1
1725168647,2
1726551051,1
1729056653,1
1730874652,1
