1648535442,7
1648621952,1
1648708231,1
1648794750,1
1648881149,1
1648967561,1
1649053832,1
1649140351,1
1649226751,1
1649313029,1
1649399549,1
1649485949,1
1649572354,1
1649658750,1
1649745150,1
1649831565,1
1649917950,1
1650004228,1
1650090628,1
1650177150,1
1650263549,1
1650349831,1
1650436229,1
1650522756,1
1650609163,1
1650695550,1
1650781953,1
1650868349,1
1650954630,1
1651041030,1
1651127552,1
1651213951,1
1651300352,1
1651386755,1
1651473034,1
1651559564,1
1651645850,1
1651732362,1
1651818753,1
1651905153,1
1651991564,1
1652077954,1
1652164360,1
1652250764,1
1652337032,1
1652423553,1
1652509832,1
1652596232,1
1652682759,1
1652769160,1
1652855561,1
1652941964,1
1653028353,1
1653114753,1
1653201159,1
1653287558,1
1653373954,1
1653460234,1
1653546755,1
1653633154,1
1653719553,1
1653805957,1
1653892236,1
1653978755,1
1654065033,1
1654151553,1
1654237831,1
1654324351,1
1654410631,1
1654497153,1
1654583555,1
1654669837,1
1654756356,1
1654842756,1
1654929156,1
1655015436,1
1655101838,1
1655274636,1
1655361158,1
1655447555,1
1655533836,1
1655620256,1
1655706645,1
1655793158,1
1655879557,1
1655965955,1
1656052365,1
1656138754,1
1656225155,1
1656311556,1
1656397956,1
1656484356,1
1656570758,1
1656829841,1
1656916357,1
1657002637,1
1657089163,1
1657175559,1
1657261838,1
1657348240,1
1657434758,1
1657521164,1
1657607566,1
1657693957,1
1657780357,1
1657803090,1
1657804447,1
1657809517,1
1657866760,5
1657896040,5
1657953158,2
1657982325,2
1658039438,2
1658068726,2
1658125843,2
1658155247,2
1658212362,2
1658241661,2
1658298758,2
1658328052,2
1658385041,2
1658414447,2
1658471560,2
1658500847,2
1658557962,2
1658587247,2
1658644360,2
1658673645,2
1658730762,2
1658760045,2
1658817160,2
1658846453,2
1658903439,2
1658932848,2
1658989840,2
1659019246,2
1659076365,2
1659105646,2
1659162770,2
1659192044,2
1659249159,2
1659278470,2
1659335565,2
1659364847,2
1659421963,2
1659451128,2
1659508368,2
1659537519,2
1659594767,2
1659624049,2
1659681160,2
1659710444,2
1659767561,2
1659796845,2
1659853840,2
1659883130,2
1659940369,2
1659969638,2
1660026647,2
1660056049,2
1660113163,2
1660142439,2
1660199441,2
1660228849,2
1660285970,2
1660315250,2
1660372250,2
1660401521,2
1660458761,2
1660488049,2
1660545162,2
1660574449,2
1660631564,2
1660660730,2
1660717841,2
1660747248,2
1660804362,2
1660833647,2
1660890760,2
1660920046,2
1660977162,2
1661006455,2
1661063442,2
1661092854,2
1661149842,2
1661179125,2
1661236366,2
1661265647,2
1661322641,2
1661352051,2
1661409162,2
1661438449,2
1661495561,2
1661524735,2
1661581964,2
1661611239,2
1661668363,2
1661697647,2
1661700049,2
1661754784,3
1661784048,3
1661870448,2
1661927560,2
1661956724,2
1662013964,2
1662043246,2
1662100359,1
1662129642,1
1668560577,2
1668646979,2
