1659076365,1
1659105646,1
1659162770,7
1659192044,7
1659249159,3
1659278470,3
1659335565,15
1659364847,15
1659421963,4
1659451128,4
1659508368,7
1659537519,7
1659594767,12
1659624049,12
1659681160,6
1659710444,6
1659767561,10
1659796845,10
1659853840,6
1659883130,6
1659940369,11
1659969638,11
1660026647,7
1660056049,7
1660113163,10
1660142439,10
1660199441,7
1660228849,7
1660285970,7
1660315250,7
1660372250,11
1660401521,11
