1724304925,462
1724391319,123
1724477730,880
1724564111,106
1724650531,479
1724736906,362
1724823316,228
1724909717,7028
1724996108,14636
1725082506,14949
1725168909,146
1725255319,150
1725341717,128
1725428109,135
1725514506,198
1725600914,18
