1685544777,197
1685597496,120
1685683902,455
1685770303,80
1685856701,68
1685943100,163
1686029502,435
1686115904,177
1686202306,79
1686288711,126
1686375108,717
1686461512,186
1686547909,102
1686634309,99
1686720704,98
1686807105,88
1686893562,118
1686979954,67
1687066360,551
1687152774,376
1687239150,97
1687411953,87
1687498393,330
1687584774,565
1687671173,67
1687757568,75
1687843969,432
1687930377,271
1688016807,44
