1656743558,8
1656829841,10
1656916357,13
1657002637,11
1657089163,5
1657175559,12
1657261838,14
1657348240,9
1657434758,8
1657521164,12
1657607566,9
1657693957,9
1657780357,17
1657803090,17
1657804447,17
1657809517,17
1657866760,8
1657896040,8
1657953158,2
1657982325,2
