1648621952,1
1648708231,5
1648794750,5
1648881149,4
1648967561,2
1649053832,2
1649140351,3
1649226751,13
1649313029,2
1649399549,4
1649485949,5
1649572354,1
1649658750,8
1649745150,2
1649831565,6
1649917950,4
1650004228,2
1650090628,5
1650177150,4
1650263549,3
1650349831,7
1650436229,10
1650522756,9
1650609163,7
1650695550,11
1650781953,9
1650868349,16
1650954630,19
1651041030,20
1651127552,18
1651213951,20
1651300352,22
1651386755,9
