1655361158,21
1655447555,53
1655706645,4
1655879557,4
1656570758,69
1657607566,5
1657693957,10
1657780357,8
1657803090,8
1657804447,8
1657809517,8
1657866760,11
1657896040,11
1658471560,5
1658500847,5
1658903439,5
1658932848,5
1658989840,5
1659019246,5
1659508368,19
1659537519,19
1659594767,4
1659624049,4
1660285970,10
1660315250,10
1662359559,5
1662388727,5
