1680931899,34
1681018301,30
1681104713,27
1681191117,26
1681277516,29
1681363906,24
1681450306,33
1681536706,31
1681623105,10
1681709528,22
1681795909,29
1681882326,28
1681968706,31
1682055103,33
1682141505,32
1682227910,37
1682314324,13
1682400707,25
1682487105,27
1682573524,28
1682659898,29
1682746309,24
1682832700,25
1682919107,25
1683005499,15
1683091901,30
1683178309,27
1683264713,29
1683351101,23
