1698211845,1
1698474646,1
1698561046,1
1698647445,1
1698733843,1
1698993045,2
1699165843,1
1699425038,1
1699597838,2
1699684239,1
1699770639,1
1699943446,1
1700116239,1
1700202637,2
1700548240,1
1700807441,2
1700893840,1
1700980240,1
1701066641,1
1701239442,1
1701412240,2
1701671441,1
1702017040,2
1702621850,1
1703226640,1
1703831442,1
1712813449,5
