1708756568,1
1708842965,2
1708929366,2
1709015768,3
1709102173,3
1709188566,7
1709275007,7
1709361374,9
1709447776,1
1709534155,22
1709620564,2
1709706962,3
1709793367,2
1709966169,1
1710052561,14
1710138969,3
1710225362,5
1710311773,13
1710398159,3
