1687498241,1
1690867847,1
1691127048,1
1691213447,11
1691645448,1
1691818247,1
1691904646,1
1691991040,1
1692077440,1
1692163831,1
1692250233,1
1692336633,1
1692423035,1
1692509432,1
1695187834,1
1695274234,1
1695360634,1
1695533434,1
1695619839,2
1697261447,1
1697347842,1
1697520642,1
1697607044,1
