1688794420,2
1688880821,3
1688967219,11
1689053626,8
1689140028,6
1689226424,17
1689312837,4
1689399195,1
1689485597,4
1689572000,19
1689658397,4
1689744807,2
1689831241,1
1690004042,1
1690176817,14
1690263240,1
1690349617,2
1690522443,4
1690608808,2
1690695212,5
1690781617,2
1690868047,5
1690954421,5
1691040818,17
1691127250,2
1691213630,4
1691300015,4
1691386395,2
