1679569142,138
1679584407,138
1679589867,138
1679596494,138
1679602915,138
1679607956,138
1679639532,155
1679722309,267
1679808717,144
1679895117,96
1679981518,94
1680067912,540
1680154308,219
1680240714,23
