1653114753,13
1653201159,29
1653287558,32
1653373954,39
1653460234,29
1653546755,28
1653633154,26
1653719553,31
1653805957,27
1653892236,41
1653978755,27
1654065033,29
1654151553,31
1654237831,37
1654324351,35
1654410631,2
