1702535641,27
1702622071,24
1702708433,29
1702794843,24
1702881239,28
1702967665,29
1703054037,26
1703140439,32
1703226865,27
1703313245,24
1703399641,21
1703572441,23
1703658841,22
1703745239,19
1703831661,35
1703918046,28
1704004443,27
1704090847,30
1704177241,22
1704263638,21
1704350037,32
1704436450,27
1704522832,23
1704609231,40
1704695681,25
1704782089,31
1704868474,17
