1657866760,13
1657896040,13
1657953158,34
1657982325,34
1658039438,25
1658068726,25
1658125843,31
1658155247,31
1658212362,40
1658241661,40
1658298758,55
1658328052,55
1658385041,41
1658414447,41
1658471560,35
1658500847,35
1658557962,31
1658587247,31
1658644360,23
1658673645,23
1658730762,34
1658760045,34
1658817160,38
1658846453,38
1658903439,33
1658932848,33
1658989840,28
1659019246,28
1659076365,31
1659105646,31
1659162770,38
1659192044,38
