1711863050,1
1712122273,1
1712467850,1
1712554251,1
1712640649,1
1712727049,1
1712813449,1
1712899850,1
1713072653,1
1713245451,1
1713331852,1
1713677452,1
1713936654,1
1714023055,1
1714195863,1
1714282254,1
1714800655,1
1715059856,1
1715146260,1
1718170259,1
1718256669,1
1718343064,1
1718429457,1
1718688659,1
1718861458,1
1719120657,1
1719207047,1
1719293448,1
1719466247,1
1719552647,1
1719725446,1
1719811846,1
1720157449,1
1720503049,1
1720675849,1
1721194248,1
1722490250,1
1722749450,1
1722922247,1
1723354248,1
1723613452,1
1723959048,1
1724131846,1
1724736648,1
1724909448,1
1725255050,1
1725946251,1
1726119049,1
1726378249,1
