1651559564,4
1651645850,24
1651732362,27
1651818753,27
1651905153,13
1651991564,6
1652077954,9
1652164360,8
1652250764,3
1652337032,4
1652423553,10
1652509832,4
1652596232,5
1652682759,13
1652769160,23
1652855561,18
1715405851,55
