1690436012,61
1690522443,167
1690608808,512
1690695212,201
1690781617,183
1690868047,376
1690954421,150
1691040818,1323
1691127250,308
1691213630,175
1691300015,191
1691386395,357
1691472821,345
1691559206,791
1691645653,229
1691732035,351
1691818443,695
1691904834,95
1691991184,134
1692077570,225
1692163972,132
1692250382,152
1692336773,104
1692423180,207
1692509573,113
1692595944,27
