1637381227,18
1640404823,12
1640491284,57
1640577691,56
1640664024,37
1640750484,123
1640836884,148
1640923223,69
1641009626,125
1641096084,48
1641268824,12
1641355224,24
1641441684,28
1641700884,4
1641787224,2
1642996892,14
1643169628,23
1643256090,18
1643342487,21
1643515288,23
1644733834,9
1644770508,9
1645425030,42
1645467113,42
1645470826,42
1646548229,9
1647066751,47
1648103550,1
1651041030,20
1651127552,33
1651213951,21
1651818753,2
1652855561,1
1656397956,1
1657693957,21
1658039438,7
1658068726,7
1658125843,5
1658155247,5
1658212362,2
1658241661,2
1658298758,4
1658328052,4
1661754784,23
1661784048,23
1677911460,12
1681277516,2
1681536706,13
1681623105,6
1681882326,13
1682746309,2
1682832700,1
1686720704,3
1687152774,13
1687671173,2
1687757568,2
1689053626,1
1691127250,13
1692509573,4
1692768764,2
1692855167,2
1700462021,1
1703831661,1
1704522832,2
1704609231,2
1705991686,3
1708842965,1
1709793367,3
1718170636,6
1718257047,1
1718516215,1
1719207304,4
1721367339,2
1731393338,2
1731738930,2
1731911726,5
