1636895594,10
1636898490,11
1636900709,11
1637070326,5
1637070818,5
1637072812,17
1637122028,20
1637208446,15
1637294806,18
1637381227,17
1637467621,18
1637554087,15
1637589848,15
1637640464,8283
1637726914,10
1637813369,19
1637899638,20
