1658471560,64
1658500847,64
1658557962,319
1658587247,319
1658644360,116
1658673645,116
1658730762,336
1658760045,336
1658817160,120
1658846453,120
1658903439,223
1658932848,223
1658989840,269
1659019246,269
1659076365,142
1659105646,142
1659162770,93
1659192044,93
1659249159,108
1659278470,108
1659335565,104
1659364847,104
1659421963,335
1659451128,335
1659508368,393
1659537519,393
1659594767,112
1659624049,112
1659681160,241
1659710444,241
1659767561,21
1659796845,21
