1673516775,125
1674367285,143
1674455475,146
1674541884,91
1674628285,124
1674714694,96
1674801082,88
1674887480,127
1674973872,500
1675060281,131
1675146682,115
1675233071,156
1675319481,131
1675405883,201
1675492281,81
