1663655565,4
1663684725,4
1663741840,4
1663771124,4
1663828239,4
1663857524,4
1663914640,4
1663943934,4
1664001039,4
1664030318,4
1664087438,4
1664116722,4
1664173842,4
1664203127,4
1664260251,4
1664289537,4
1664346641,4
1664375951,4
1664433041,4
1664462320,4
1664519554,4
1664548711,4
1664605833,4
1664635111,4
1668560577,2
1668646979,2
