1649745150,10
1651559564,5
1653978755,21
1654151553,10
1654669837,8
1654756356,40
1654842756,10
1655101838,10
1655188357,41
1655361158,154
1655447555,50
1655706645,3
1655879557,11
1655965955,4
1656484356,1
1656570758,1
1657002637,1
1657175559,2
1657261838,1
1657434758,1
1657607566,1
1657693957,1
1657780357,2
1657803090,2
1657804447,2
1657809517,2
1658212362,1
1658241661,1
1659940369,4
1659969638,4
1661236366,1
1661265647,1
1661409162,1
1661438449,1
1661495561,3
1661524735,3
1661870448,1
1661927560,1
1661956724,1
1662013964,2
1662043246,2
1662100359,1
1662129642,1
1662532358,1
1662561643,1
1663482759,2
1663512042,2
1689226424,2
1714196216,25
1720935328,1
1721021712,4
1721194539,2
1721367339,2
1721453736,3
1721540139,2
1721626512,3
1721712930,2
1721799317,3
1721885729,2
1722144941,3
1722317737,3
1722490541,2
1722663315,2
1722922512,2
1723181712,2
1727069719,2
1728711328,2
1733294214,2
