1713159052,2
1713677452,3
1719293448,26
1719898247,1
1720157449,1
1720243849,1
1720935048,1
1723008649,1
1723440651,1
1725427848,1
1726119049,4
1727760651,1
1728106253,1
1728192652,1
1728365452,1
1728451854,1
1730442652,2
1730615453,4
1730701851,1
1730874652,10
1731220250,2
