1678170666,116
1678257055,134
1678343445,163
1679569142,48
1679584407,48
1679589867,48
1679596494,48
1679602915,48
1679607956,48
1679639532,265
1679722309,111
1679808717,106
1679895117,158
1679981518,588
1680067912,31
