1657780357,6
1657803090,6
1657804447,6
1657809517,6
1657866760,44
1657896040,44
1657953158,34
1657982325,34
1658039438,40
1658068726,40
1658125843,37
1658155247,37
1658212362,41
1658241661,41
1658298758,45
1658328052,45
1658385041,48
1658414447,48
1658471560,36
1658500847,36
1658557962,32
1658587247,32
1658644360,24
1658673645,24
1658730762,26
1658760045,26
1658817160,31
1658846453,31
1658903439,31
1658932848,31
1658989840,32
1659019246,32
1659076365,28
1659105646,28
1659162770,15
1659192044,15
1659249159,19
1659278470,19
1659335565,27
1659364847,27
1659421963,36
1659451128,36
1659508368,36
1659537519,36
1659594767,10
1659624049,10
1659681160,19
1659710444,19
1659767561,32
1659796845,32
1659853840,34
1659883130,34
1659940369,25
1659969638,25
1660026647,31
1660056049,31
1660113163,16
1660142439,16
1660199441,23
1660228849,23
1660285970,43
1660315250,43
1660372250,35
1660401521,35
1660458761,38
1660488049,38
1660545162,10
1660574449,10
