1657002637,3
1657089163,24
1657175559,25
1657261838,24
1657348240,29
1657434758,37
1657521164,38
1657607566,35
1657693957,35
1657780357,33
1657803090,33
1657804447,33
1657809517,33
1657866760,36
1657896040,36
1657953158,25
1657982325,25
1658039438,32
1658068726,32
1658125843,27
1658155247,27
1658212362,38
1658241661,38
1658298758,17
1658328052,17
