1660372250,1
1660401521,1
1660458761,6
1660488049,6
1660545162,6
1660574449,6
1660631564,8
1660660730,8
1660717841,5
1660747248,5
1660804362,5
1660833647,5
1660890760,4
1660920046,4
1660977162,4
1661006455,4
1661063442,10
1661092854,10
1661149842,7
1661179125,7
1661236366,6
1661265647,6
1661322641,10
1661352051,10
1661409162,22
1661438449,22
1661495561,7
1661524735,7
1661581964,17
1661611239,17
1661668363,5
1661697647,5
1661700049,5
