1647153150,12
1647239550,2
1647325952,2
1647412352,5
1647498752,8
1647585151,2
1647757954,5
1647844355,4
1647930752,2
1648017150,4
1648103550,4
1648189831,7
1648276229,2
1648362752,4
1648449033,4
1648535442,10
1648621952,2
1648708231,2
