1706250646,5
1706855451,5
1707460251,4
1708065054,5
1708669850,5
1709274654,6
1710484249,5
1711089048,5
1711434657,1
1713850252,1
1714541454,2
1719379849,1
1719725446,1
1720762249,2
1723786250,1
1723872647,4
1727933451,1
1728019853,1
1733121060,1
