1729924541,21
1730010943,115
1730097332,53
1730183730,57
1730270141,19
1730356536,115
1730442925,108
1730529338,16
1730615759,17
1730702128,62
1730788525,18
1730874965,60
1730961326,67
1731047722,147
1731134141,27
1731220531,53
1731306938,273
1731393338,137
1731479747,117
1731566125,304
1731652532,153
1731738930,384
1731825326,136
1731911726,422
1731998131,197
1732084532,154
1732170946,333
1732257343,92
