1655361158,4
1655706645,1
1655879557,2
1656138754,2
1656484356,2
1656829841,4
1656916357,1
1657089163,1
1657261838,13
1657348240,3
1657434758,54
1657521164,23
1657607566,14
1657693957,40
1657780357,52
1657803090,52
1657804447,52
1657809517,52
1657866760,19
1657896040,19
