1649313029,63
1649399549,253
1649485949,87
1653978755,149
1654065033,134
1654151553,106
1654237831,124
1654324351,232
1654410631,244
1654497153,172
1654583555,152
1654669837,209
1654756356,225
1654842756,241
1654929156,196
1655015436,138
1655101838,72
1655274636,259
