1642855092,1
1644321017,1
1644561017,2
1644733822,1
1644770413,1
1644993017,7
1645252217,1
1645467072,1
1645470791,1
1645511417,1
1645857016,7
1646029817,1
1646116216,1
1648362619,1
1649485817,6
1649658616,1
1650263417,1
1650349817,1
1650436217,1
1650522617,1
1650609029,1
1650695416,8
1650781820,1
1650868217,1
1650954617,2
1651041017,7
1651127418,1
1651213817,1
1651300219,1
1651386622,1
1651473017,1
1651559421,2
1651645827,1
1651818617,2
1651991417,1
1652077818,2
1652164218,1
1652250621,1
1652423417,1
1652509817,1
1652596217,1
1652769018,1
1652855418,1
1653028217,1
1653201018,1
1653546617,2
1653633018,1
1653719418,2
1653805821,1
1653892219,1
1653978618,1
1654065018,1
1654151419,1
1654237818,1
1654324218,2
1654410618,2
1654497019,1
1654669819,1
1654756220,1
1654842619,1
1654929020,1
1655015420,1
1655101820,1
1655188220,1
1655361020,1
1655533820,1
1655620219,1
1655706620,1
1655879419,1
1657089026,1
1658298621,1
1658327901,1
1658385022,1
1658414301,1
1661236224,1
1661265501,1
1661409023,1
1661438302,1
1661495422,1
1661524710,1
1661754643,1
1661783901,1
1661870301,2
1662359420,1
1662388701,1
1663223426,1
1663252701,1
1668350508,1
1668355650,1
1668356487,1
1668360366,1
1679639432,1
1680759032,1
1681018231,1
1681968635,1
1685856632,2
1686202233,1
1692250233,1
1694323834,1
1696397445,1
1700721041,1
1702103440,1
1709101860,1
1709533851,1
1711863050,1
1712813449,1
1713331852,1
1714109453,1
1718861458,1
1719293448,2
1721539849,1
1724045446,1
1726378249,1
1727069449,1
1727415052,1
1731306649,1
