1636895594,19
1636898490,19
1636900709,19
1637070326,2
1637070818,3
1637072812,3
1637122028,5
1637208446,11
1637294806,1
1637381227,1
1637467621,1
1637554087,3
1637589848,3
1637813369,1
1638158887,8
1638245235,3
1638331638,1
1639980923,10
1639983233,10
1639985995,10
1640059226,3
1640080313,3
1640145685,3
1640232083,1
1640318424,1
1640404823,1
1640491284,1
1640577691,1
1640664024,5
1640750484,1
1640836884,1
1640923223,1
1641009626,1
1641096084,1
1641182484,3
1641268824,1
1641355224,1
1641441684,1
1641528084,1
1641700884,1
1641787224,1
1641873686,1
1642392088,4
1642408942,4
1642478484,2
1642564885,1
1642651226,1
1642676514,1
1642805851,2
1642824026,3
1642855125,3
1642910490,4
1642924655,4
1642934565,4
1642937864,4
1642996892,8
1643083292,1
1643169628,1
1643256090,1
1643342487,1
1643428827,1
1643515288,1
1643601634,1
1643622207,1
1643688028,2
1643708607,2
1643774489,2
1643860889,9
1643947288,1
1644033629,1
1644120088,1
1644206493,1
1644292831,1
1644321030,1
1644388289,2
1644407490,2
1644474692,2
1644493888,2
1644561030,2
1644647492,1
1644733834,1
1644770508,1
1644820292,7
1644906689,1
1644993090,1
1645079499,1
1645165829,1
1645252290,1
1645338629,1
1645425030,1
1645467113,1
1645470826,1
1645511492,3
1645597892,1
1645684232,1
1645770629,1
1645857150,1
1645943553,1
1646029893,1
1646116237,1
1646202760,1
1646289033,1
1646375551,1
1646461951,1
1646548229,1
1646634751,1
1646721161,1
1646807431,1
1646893952,1
1646980230,1
1647066751,1
1647153150,1
1647239550,1
1647325952,1
1647412352,1
1647498752,1
1647585151,1
1647757954,1
1647844355,8
1647930752,1
1648017150,1
1648103550,1
1648189831,1
1648276229,1
1648362752,1
1648449033,1
1648535442,5
1648621952,1
1648708231,1
1648794750,1
1648881149,1
1648967561,1
1649053832,1
1649140351,1
1649226751,1
1649313029,1
1649399549,1
1649485949,1
1649572354,1
1649658750,1
1649745150,1
1649831565,1
1649917950,1
1650004228,1
1650090628,1
1650177150,1
1650263549,1
1650349831,1
1650436229,1
1650522756,1
1650609163,1
1650695550,1
1650781953,1
1650868349,1
1650954630,1
1651041030,1
1651127552,5
1651213951,1
1651300352,1
1651386755,1
1651473034,1
1651559564,1
1651645850,1
1651732362,1
1651818753,1
1651905153,1
1651991564,1
1652077954,1
1652164360,1
1652250764,1
1652337032,1
1652423553,1
1652509832,1
1652596232,1
1652682759,1
1652769160,1
1652855561,1
1652941964,1
1653028353,1
1653114753,1
1653201159,1
1653287558,1
1653373954,1
1653460234,1
1653546755,1
1653633154,1
1653719553,1
1653805957,1
1653892236,1
1653978755,1
1654065033,1
1654151553,1
1654237831,1
1654324351,1
1654410631,1
1654497153,1
1654583555,1
1654669837,1
1654756356,1
1654842756,1
1654929156,1
1655015436,1
1655101838,1
1655188357,1
1655274636,1
1655361158,1
1655447555,1
1655533836,1
1655620256,1
1655706645,1
1655793158,1
1655879557,1
1655965955,1
1656052365,1
1656138754,1
1656225155,1
1656311556,5
1656397956,1
1656484356,1
1656570758,1
1656829841,1
1656916357,1
1657002637,1
1657089163,2
1657175559,1
1657261838,1
1657348240,1
1657434758,1
1657521164,1
1657607566,1
1657693957,1
1657780357,1
1657803090,1
1657804447,1
1657809517,1
1657866760,5
1657896040,5
1657953158,2
1657982325,2
1658039438,2
1658068726,2
1658125843,2
1658155247,2
1658212362,2
1658241661,2
1658298758,2
1658328052,2
1658385041,2
1658414447,2
1658471560,2
1658500847,2
1658557962,2
1658587247,2
1658644360,2
1658673645,2
1658730762,2
1658760045,2
1658817160,2
1658846453,2
1658903439,2
1658932848,2
1658989840,2
1659019246,2
1659076365,2
1659105646,2
1659162770,2
1659192044,2
1659249159,2
1659278470,2
1659335565,2
1659364847,2
1659421963,2
1659451128,2
1659508368,2
1659537519,2
1659594767,2
1659624049,2
1659681160,2
1659710444,2
1659767561,2
1659796845,2
1659853840,2
1659883130,2
1659940369,2
1659969638,2
1660026647,2
1660056049,2
1660113163,2
1660142439,2
1660199441,2
1660228849,2
1660285970,2
1660315250,2
1660372250,2
1660401521,2
1660458761,2
1660488049,2
1660545162,2
1660574449,2
1660631564,2
1660660730,2
1660717841,2
1660747248,2
1660804362,2
1660833647,2
1660890760,2
1660920046,2
1660977162,2
1661006455,2
1661063442,2
1661092854,2
1661149842,2
1661179125,2
1661236366,2
1661265647,2
1661322641,2
1661352051,2
1661409162,2
1661438449,2
1661495561,2
1661524735,2
1661581964,2
1661611239,2
1661668363,2
1661697647,2
1661700049,2
1661754784,3
1661784048,3
1661870448,2
1661927560,2
1661956724,2
1662013964,2
1662043246,2
1662100359,2
1662129642,2
1662186760,2
1662216045,2
1662273039,2
1662302447,2
1662359559,2
1662388727,2
1662445958,2
1662475124,2
1662532358,2
1662561643,2
1662618758,2
1662647931,2
1662705164,2
1662734437,2
1662791558,2
1662820724,2
1662877847,2
1662907237,2
1662964357,2
1662993645,2
1663050638,2
1663080057,2
1663137169,2
1663166448,2
1663223564,2
1663252844,2
1663309969,2
1663339237,2
1663396358,2
1663425653,2
1663482759,2
1663512042,2
1663569159,2
1663598447,2
1663655565,2
1663684725,2
1663741840,2
1663771124,2
1663828239,2
1663857524,2
1663914640,2
1663943934,2
1664001039,2
1664030318,2
1664087438,2
1664116722,2
1664173842,2
1664203127,2
1664260251,2
1664289537,2
1664346641,2
1664375951,2
1664433041,2
1664462320,2
1664519554,2
1664548711,2
1664605833,2
1664635111,2
1668474184,3
1668560577,1
1668646979,1
1673516775,15
1675233071,5
1675751474,8
1677738657,6
1680759104,9
1682573524,1
1682659898,1
1682746309,1
1682832700,1
1682919107,1
1683351101,1
1683437506,1
1683783116,1
1683869508,1
1683955918,1
1684042308,1
1685597496,1
1685683902,1
1685770303,1
1685856701,1
1685943100,4
1686288711,1
1686375108,1
1687411953,1
1687498393,1
1687584774,1
1687671173,1
1687843969,1
1687930377,1
1688621614,1
1688708029,1
1688880821,1
1688967219,1
1689053626,1
1689312837,1
1689399195,1
1689572000,1
1690004042,1
1690954421,1
1691732035,1
1691904834,1
1692163972,1
1692250382,1
1692423180,1
1692509573,1
1692595944,1
1693114356,1
1695447164,1
1695792808,1
1695879218,22
1695965624,1
1696138408,1
1696224807,1
1696311219,1
1696743237,1
1698298423,2
1699079643,1
1699770845,1
1700894058,1
1700980458,1
1701412459,1
1701498834,1
1702017289,1
1702103633,1
1702190033,1
1702535641,1
1702881239,1
1703140439,1
1703226865,1
1703313245,1
1705300477,1
1705386877,1
1705559692,1
1706078101,1
1706510148,1
1706682956,1
1708065403,1
1708324568,1
1708410859,1
1708497318,1
1709275007,1
1709447776,1
1710052561,1
1711348567,8
1725082506,1
1731998131,130
