1632865270,9.6
1632865706,9.6
1632895227,9.6
1632895496,9.6
1632896518,9.6
1632896813,9.6
1632899446,9.7
1632899805,9.7
1632900551,9.7
1632901290,9.7
1632905378,9.7
1632905787,9.7
1632905973,9.7
1632906150,9.7
1632908729,9.7
1632910215,9.7
1632911482,9.7
1633002171,9.8
1633002624,9.8
1633003074,9.8
1633003785,9.8
1633003919,9.8
1633004024,9.8
1633004126,9.8
1633004432,9.8
1633004610,9.8
1633011572,9.8
1633012152,9.8
1633424830,11
1633425232,11
1633426237,11
1633438271,11
1633447160,11
1633447591,11
1633450030,11
1633450308,11
1633451471,11
1633453837,11
1633455935,11
1633465263,11
1633470133,11
1633493196,11
1633579858,11
1633586552,11
1633666014,11
1633752964,11
1633838814,11
1633925182,11
1634011729,11
1634098101,11
1634184358,11
1636369190,12
1636370471,12
1636372842,12
1636981061,13
1636981172,13
1636981695,13
1636984812,13
1637156675,16
1637157168,16
1637159134,18
1637208356,18
1637294748,18
1637381132,15
1637467552,15
1637553943,15
1637640398,15
1637676139,15
1637726786,15
1637813233,15
1637899685,16
1637985957,16
1638072331,16
1638158846,16
1638245205,16
1639994343,26.8
1640067313,26.8
1640069482,26.8
1642090405,27.5
1642133003,27.5
1642146502,27.6
1642219217,27.6
1642232714,27.7
1642305617,27.7
1642319114,27.7
1642392018,27.7
1642405514,27.8
1642408999,27.8
1642478419,28.3
1642495215,28.3
1642564815,28.3
1642651216,28.4
1642737616,28.4
1642762883,28.5
1642855862,29.0
1642857911,29.0
1642891515,29.0
1642892233,29.0
1642910415,29.0
1642941490,29.1
1642996817,29.1
1643011033,29.2
1643020931,29.2
1643024229,29.2
1643083219,29.2
1643169619,29.2
1643256016,29.3
1643342417,29.8
1643428816,31.2
1643515216,31.2
1643601615,31.3
1643688016,35.2
1643708534,35.3
1643774416,35.3
1643794934,35.4
1643860816,36.8
1643947216,36.8
1644033615,36.9
1644120017,37.0
1644206416,37.1
1644292816,40.0
1644379218,40.1
1644407415,40.2
1644474615,40.2
1644493817,40.3
1644561017,40.3
1644580215,40.3
1644647415,40.3
1644733817,40.4
1644820220,40.5
1644856812,40.6
1644906617,40.6
1644993014,40.6
1645079415,40.7
1645165814,40.8
1645252215,40.9
1645338615,40.9
1645425015,41.0
1645511415,41.1
1645553471,41.2
1645557189,41.2
1645597815,41.2
1645684216,41.3
1645770616,41.3
1645857015,41.4
1645943415,41.5
1646029819,41.6
1646116216,41.7
1646202615,41.7
1646289024,43.3
1646375419,43.4
1646461815,43.5
1646548216,43.5
1646634616,43.6
1646721016,44.0
1646807426,44.0
1646893816,44.1
1646980216,44.2
1647066615,44.3
1647153018,44.3
1647239416,44.4
1647325815,44.5
1647412217,44.6
1647498618,44.7
1647585016,44.7
1647671415,44.8
1647844216,45.0
1647930616,45.1
1648017016,45.1
1648103415,45.2
1648189815,45.2
1648276216,45.3
1648362616,45.4
1648449017,45.5
1648535419,45.6
1648621816,45.7
1648708217,45.7
1648794615,45.8
1648881015,45.9
1648967414,46.0
1649053816,46.1
1649140217,46.2
1649226615,46.2
1649313017,47.1
1649399415,47.1
1649485815,47.2
1649572215,47.3
1649658620,47.4
1649745015,47.5
1649831415,47.6
1649917829,48.2
1650004215,48.3
1650090615,48.4
1650177015,48.5
1650263417,48.5
1650349816,48.6
1650436215,48.7
1650522615,48.8
1650609015,48.9
1650695416,48.9
1650781815,49.0
1650868218,49.1
1650954615,49.2
1651041015,49.3
1651127415,49.4
1651213816,49.8
1651300215,50.7
1651386617,50.8
1651473015,50.8
1651559416,51.5
1651645819,51.6
1651732220,51.6
1651818619,52.3
1651905015,52.4
1651991416,52.5
1652077815,52.5
1652164216,52.6
1652250616,52.7
1652337019,52.8
1652423415,52.9
1652509815,53.2
1652596215,53.2
1652682615,53.3
1652769016,51.2
1652855416,50.9
1652941816,51.0
1653028216,51.1
1653114615,51.2
1653201016,51.3
1653287416,51.4
1653373815,52.0
1653460216,52.1
1653546616,52.2
1653633015,52.3
1653719416,52.3
1653805816,52.3
1653892219,52.4
1653978617,52.4
1654065016,52.5
1654151416,52.6
1654237817,52.7
1654324215,52.8
1654410616,52.8
1654497016,52.9
1654583417,53.0
1654669816,53.2
1654756216,53.2
1654842617,53.3
1654929016,53.4
1655015418,53.5
1655101817,53.5
1655188217,53.6
1655274617,53.7
1655361016,53.7
1655447417,53.8
1655533816,54.9
1655620217,55.0
1655706615,55.1
1655793016,55.1
1655879417,55.2
1655965816,55.3
1656052215,55.3
1656138615,55.4
1656225016,55.5
1656311416,55.5
1656397816,55.6
1656484216,55.7
1656570615,55.7
1656657016,55.8
1656829816,55.9
1656916221,56.0
1657002616,56.1
1657089016,56.1
1657175416,56.2
1657261817,56.3
1657348216,56.3
1657434616,56.4
1657521016,56.5
1657607416,56.5
1657693815,56.6
1657780216,56.7
1657866616,56.8
1657889258,56.9
1657890664,56.9
1657895897,56.9
1657953018,56.9
1657982296,57.0
1658039416,57.0
1658068695,57.0
1658125816,57.0
1658155096,57.1
1658212217,57.1
1658241496,57.2
1658298620,57.2
1658327897,57.2
1658385017,57.2
1658414297,57.3
1658471417,57.3
1658500696,57.4
1658557817,57.4
1658587097,57.4
1658644217,57.4
1658673496,57.5
1658730618,57.5
1658759896,57.6
1658817016,57.6
1658846296,57.7
1658903417,57.7
1658932697,57.7
1658989818,57.7
1659019099,57.8
1659076218,57.8
1659105496,57.9
1659162617,57.9
1659191897,57.9
1659249022,57.9
1659278296,58.0
1659335417,58.0
1659364702,58.1
1659421817,58.1
1659451097,58.1
1659508219,58.1
1659537497,58.2
1659594620,58.2
1659623896,58.3
1659681018,58.3
1659710300,58.3
1659767416,58.3
1659796696,58.4
1659853817,58.4
1659883096,58.5
1659940217,58.5
1659969497,58.5
1660026618,58.5
1660055897,58.6
1660113018,58.6
1660142303,58.7
1660199418,58.7
1660228697,58.7
1660285818,58.7
1660315097,58.8
1660372223,58.8
1660401497,58.9
1660458617,58.9
1660487898,59.0
1660545018,59.0
1660574297,59.0
1660631418,59.0
1660660698,59.1
1660717819,59.1
1660747097,60.8
1660804218,60.8
1660833497,60.9
1660890618,60.9
1660919897,60.5
1660977017,60.5
1661006297,60.6
1661063420,60.6
1661092702,60.7
1661149820,60.7
1661179098,60.7
1661236218,60.7
1661265497,60.8
1661322619,60.8
1661351896,60.9
1661409018,60.9
1661438298,60.9
1661495419,60.9
1661524697,61.0
1661581818,61.0
1661611100,61.1
1661668218,61.1
1661697497,61.1
1661754619,61.1
1661783858,61.2
1661786342,61.2
1661841038,61.2
1661870296,61.3
1661956697,61.3
1662013816,61.3
1662043095,61.4
1662100216,61.4
1662129496,61.5
1662186616,61.5
1662215896,61.5
1662273016,61.5
1662302297,61.6
1662359416,61.6
1662388697,61.7
1662445816,61.7
1662475095,61.7
1662532216,61.7
1662561495,61.8
1662618616,61.8
1662647895,61.9
1662705016,61.9
1662734295,61.9
1662791416,61.9
1662820695,62.0
1662877816,62.0
1662907096,62.1
1662964216,62.1
1662993496,62.1
1663050616,62.1
1663079895,62.2
1663137015,62.2
1663166296,62.3
1663223417,62.3
1663252696,62.3
1663309816,62.3
1663339096,62.4
1663396216,62.4
1663425496,62.5
1663482616,62.5
1663511896,62.6
1663569017,62.6
1663598296,62.9
1663655416,62.9
1663684698,70.9
1663741816,70.9
1663771098,71.0
1663828217,71.0
1663857496,71.1
1663914616,71.1
1663943896,71.1
1664001016,71.1
1664030297,71.2
1664087416,71.2
1664116696,71.3
1664173816,71.3
1664203096,71.4
1664260217,71.4
1664289496,71.4
1664346616,71.4
1664375897,71.5
1664433017,71.5
1664462307,71.6
1664519417,71.6
1668167895,78.9
1668436897,79.1
1668442039,79.1
1668442875,79.1
1668446756,79.1
1668560415,79.2
1668646813,79.2
1668733217,79.3
1671620818,80.8
1671622024,80.8
1671622467,80.8
1671624406,80.8
1671628435,80.8
1671632931,80.8
1671635118,80.8
1671670823,80.8
1671695298,80.9
1671699417,80.9
1671715472,80.9
1671717015,80.9
1671718801,80.9
1671720354,80.9
1673603124,85.3
1674453627,85.9
1674541823,86.0
1674628224,86.1
1674714624,86.1
1674801029,86.2
1674887423,86.3
1674973823,86.3
1675060223,86.4
1675146623,86.5
1675233024,86.5
1675319423,86.6
1675405824,89.3
1675492223,89.3
1675578624,89.4
1675665024,89.5
1675751421,89.5
1675837820,89.6
1675924222,89.7
1676010620,89.7
1676097022,89.8
1676183419,89.9
1676269819,89.9
1676356230,90.0
1676442623,90.1
1676529019,90.3
1676615420,90.3
1676701819,90.4
1676788218,90.5
1676874619,90.5
1676961020,90.6
1677047420,90.7
1677133818,90.7
1677220219,91.7
1677306620,91.8
1677393020,91.9
1677479420,91.9
1677565819,92.0
1677652219,92.1
1677738620,93.7
1677825020,93.7
1677911420,93.8
1677997819,93.9
1678084221,94.0
1678170619,94.0
1678257030,92.7
1678343418,92.8
1678429820,93.8
1678465510,93.9
1678516319,93.9
1678602620,93.9
1678689019,94.0
1678775420,95.5
1678809865,95.5
1678811768,95.5
1678861820,95.5
1678948229,95.6
1679000779,95.7
1679034716,95.7
1679121020,95.7
1679293820,95.9
1679380219,95.9
1679466619,96.0
1679553019,96.0
1679584861,96.1
1679639420,96.1
1679649237,96.2
1679654372,96.2
1679655516,96.2
1679670707,96.3
1679676149,96.3
1679682786,96.3
1679689209,96.3
1679694242,96.3
1679725822,96.3
1679808621,96.4
1679895020,96.5
1679981427,96.6
1680067819,97.4
1680154218,97.5
1680240620,97.6
1680327018,97.7
1680413418,97.8
1680499817,97.9
1680586218,97.9
1680672618,98.0
1680759019,98.1
1680845418,98.2
1680931819,98.3
1681018218,98.3
1681104619,98.4
1681191018,98.5
1681277419,98.6
1681363819,98.7
1681450220,99.4
1681536620,100.6
1681623020,100.7
1681709418,100.8
1681795820,100.9
1681882220,101.0
1681968619,101.1
1682055020,101.5
1682141419,101.5
1682227819,101.6
1682314220,101.7
1682400621,100.4
1682487021,100.5
1682573419,100.6
1682659818,100.7
1682746218,100.8
1682832619,100.9
1682919019,100.9
1683005420,101.0
1683091819,101.1
1683178219,101.2
1683264620,107.7
1683351019,107.8
1683437419,107.9
1683523820,107.9
1683610219,113.6
1683696621,115.1
1683783019,116.2
1683869419,116.3
1683955820,116.4
1684042220,116.5
1684128619,116.6
1685631076,117.9
1685683816,117.9
1685770218,118.0
1685856615,118.1
1685943018,118.2
1686029416,118.3
1686115815,118.4
1686202216,118.5
1686288616,118.5
1686375017,118.6
1686461417,118.7
1686547817,118.8
1686634216,118.9
1686720615,118.9
1686807017,119.0
1686893416,119.1
1686979824,119.3
1687066222,119.4
1687152622,119.4
1687239022,120.7
1687325422,121.8
1687498222,121.0
1687584623,121.0
1687671022,121.1
1687757423,121.2
1687843821,121.3
1687930222,121.4
1688016622,121.4
1688103023,121.5
1688189424,121.6
1688275833,121.7
1688362223,121.8
1688448622,121.8
1688621423,122.2
1688707823,122.4
1688794223,123.0
1688880624,123.1
1688967022,123.2
1689053423,123.3
1689139823,123.3
1689226224,124.3
1689312623,124.3
1689399033,124.4
1689485422,124.5
1689571823,124.6
1689658224,124.7
1689744623,124.8
1689831023,124.8
1689917424,124.9
1690003824,125.0
1690090224,125.1
1690176623,125.2
1690263024,125.3
1690349424,125.4
1690435824,125.4
1690522224,125.5
1690608624,125.6
1690695024,125.7
1690781424,125.8
1690867825,125.9
1690954224,126.0
1691040625,126.1
1691127025,126.1
1691213424,126.2
1691299824,126.3
1691386224,126.4
1691472623,126.5
1691559025,126.6
1691645423,126.6
1691731826,126.7
1691818225,126.8
1691904626,126.9
1691991025,127.0
1692077419,127.1
1692163820,127.2
1692250218,127.2
1692336618,127.3
1692423018,127.4
1692509419,127.5
1692595817,127.6
1692682220,127.7
1692768618,127.8
1692855018,127.9
1692941420,127.9
1693027818,128.0
1693114224,128.1
1693200618,128.2
1693287018,128.3
1693373418,128.4
1693459822,128.5
1693546217,128.5
1693632619,128.6
1693719026,128.7
1693805423,128.8
1693891815,128.9
1693978217,129.0
1694064617,129.0
1694151018,129.1
1694237416,129.2
1694323817,129.3
1694410218,129.4
1694496618,129.5
1694583018,129.6
1694669418,129.6
1694755821,129.7
1694842219,129.8
1694928619,129.9
1695015017,130.0
1695101419,130.1
1695274218,130.2
1695360619,130.3
1695447019,130.4
1695533418,130.4
1695619817,130.5
1695706222,130.6
1695792623,130.7
1695879022,130.8
1695965433,130.9
1696051822,131.0
1696138222,131.0
1696224623,131.1
1696311023,132.2
1696397423,132.2
1696483824,132.3
1696570223,132.4
1696656623,132.5
1696743023,132.6
1696829423,132.7
1696915823,132.8
1697002222,132.8
1697088623,132.9
1697175022,133.0
1697261423,133.1
1697347828,133.2
1697434224,133.3
1697520623,133.4
1697607023,133.4
1697693424,133.5
1697779824,133.6
1697866223,133.7
1697952624,133.8
1698039024,133.9
1698125424,134.0
1698211824,134.0
1698298224,134.1
1698384624,134.2
1698471023,134.3
1698561023,134.3
1698647424,134.4
1698733823,134.5
1698820222,134.6
1698906628,134.7
1698993024,134.8
1699079424,134.9
1699165823,135.0
1699252223,135.0
1699338638,135.1
1699425024,135.2
1699511424,135.3
1699597823,135.4
1699684223,135.5
1699770624,135.5
1699857023,135.6
1699943424,135.7
1700029829,135.8
1700116230,135.9
1700202624,136.0
1700289024,136.1
1700375424,136.1
1700461825,136.2
1700548224,136.3
1700634624,136.4
1700721024,136.5
1700807425,138.4
1700893825,138.4
1700980224,138.5
1701066624,138.6
1701153025,138.7
1701325825,138.8
1701412225,138.9
1701498623,139.0
1701585023,139.1
1701671424,139.2
1701757824,140.9
1701844224,141.0
1702017023,141.2
1702103424,141.4
1702189824,141.5
1702276225,141.6
1702362634,141.7
1702449023,141.7
1702535424,141.8
1702621827,141.9
1702708234,141.9
1702794625,142.0
1702881023,142.1
1702967423,142.2
1703053833,142.3
1703140224,142.4
1703226625,142.5
1703313024,142.6
1703399424,142.6
1703485825,142.7
1703658625,142.9
1703745025,143.0
1703831424,143.1
1703917825,143.1
1704004225,143.2
1704090625,143.3
1704177025,143.4
1704263424,143.5
1704349824,143.6
1704436224,143.7
1704522623,143.8
1704609024,143.9
1704695424,143.9
1704781829,144.0
1704868238,144.1
1704954627,144.2
1705041027,145.4
1705127428,145.5
1705213829,145.6
1705386630,147.4
1705473028,153.0
1705559430,153.1
1705645829,153.2
1705732229,153.3
1705818629,153.4
1705905029,153.4
1705991429,153.5
1706077828,153.6
1706164229,153.7
1706250630,153.8
1706337029,153.9
1706423430,154.0
1706509831,154.1
1706596230,154.2
1706682635,154.3
1706769030,154.4
1706855437,154.5
1706941829,154.6
1707028230,154.7
1707114638,154.8
1707201030,154.9
1707287430,155.0
1707373829,155.1
1707460229,155.2
1707546631,155.3
1707633030,155.4
1707719429,155.5
1707805829,155.6
1707892230,155.7
1707978631,155.8
1708065029,155.9
1708151430,156.0
1708237830,156.1
1708324231,156.2
1708410631,156.3
1708497022,156.4
1708583427,156.5
1708669832,156.6
1708756231,156.7
1708842632,156.8
1708929031,156.9
1709015431,157.0
1709101831,157.2
1709188236,157.3
1709274631,157.4
1709361031,157.5
1709447430,157.6
1709533829,157.7
1709620231,151.0
1709706631,151.1
1709793031,151.2
1709879432,151.3
1710052231,151.5
1710138631,151.6
1710225031,151.7
1710311431,151.8
1710397831,151.9
1710484234,152.3
1710570629,152.4
1710657029,152.5
1710743430,152.6
1710829829,152.7
1710916230,152.8
1711002628,153.4
1711089030,153.5
1711175428,153.6
1711261830,153.7
1711348229,153.8
1711434630,154.2
1711521040,154.2
1711607430,154.4
1711693829,154.5
1711780229,154.6
1711863029,154.7
1711949430,154.8
1712035830,154.9
1712122230,155.0
1712208652,156.2
1712295041,156.3
1712381431,156.4
1712467830,156.5
1712554232,156.6
1712640632,156.7
1712727030,156.8
1712813430,156.9
1712899830,157.0
1712986231,157.1
1713072632,157.2
1713159033,157.3
1713245432,157.4
1713331832,157.5
1713418232,157.6
1713504630,157.7
1713591033,157.8
1713677431,157.9
1713763832,158.0
1713850232,158.1
1713936632,158.2
1714023033,158.3
1714109434,158.4
1714195833,158.5
1714282242,158.6
1714368633,158.8
1714455033,158.9
1714541431,159.0
1714627833,159.1
1714800631,159.2
1714887034,159.3
1714973434,159.4
1715059832,159.5
1715146233,159.6
1715232634,160.0
1715319043,160.1
1715405493,160.2
1715491838,160.3
1715578240,160.4
1718108493,164.0
1718170234,164.0
1718256634,164.1
1718343045,164.2
1718429439,164.3
1718515832,164.4
1718602232,164.5
1718688633,146.0
1718775033,146.1
1718861434,146.2
1718947833,146.3
1719034234,146.3
1719120633,146.4
1719207032,146.5
1719293423,146.6
1719379826,146.7
1719466224,146.8
1719552623,146.9
1719639025,147.0
1719725424,147.1
1719811824,147.2
1719898223,147.3
1719984623,147.3
1720071024,147.4
1720157426,147.5
1720243826,147.6
1720330226,147.7
1720416623,147.8
1720503026,147.9
1720589426,148.0
1720675826,148.1
1720762227,148.2
1720848626,148.3
1721021425,148.4
1721107824,148.5
1721194226,148.6
1721280626,148.7
1721367025,148.8
1721453427,148.9
1721539825,149.0
1721626225,149.1
1721712624,149.2
1721799027,149.3
1721885425,149.4
1721971825,149.5
1722058224,149.6
1722144625,149.7
1722231027,149.7
1722317426,149.8
1722403827,149.9
1722490227,150.0
1722576626,150.1
1722663025,150.2
1722749426,150.3
1722835826,150.4
1722922225,150.5
1723008624,150.6
1723095025,150.7
1723181425,150.8
1723267825,150.9
1723354226,151.0
1723440625,151.1
1723527026,151.2
1723613425,151.3
1723699826,151.4
1723786223,151.4
1723872625,151.5
1723959025,151.6
1724045426,151.7
1724131824,151.8
1724218223,151.9
1724304626,152.0
1724391026,152.1
1724477424,152.2
1724563826,152.3
1724650224,152.4
1724736626,152.5
1724823026,152.6
1724909426,152.7
1724995826,152.8
1725082224,152.9
1725168624,153.0
1725255025,153.1
1725341425,153.2
1725427823,153.3
1725514224,153.4
1725600624,153.5
1725687024,153.6
1725773425,153.7
1725859826,153.8
1725946223,153.8
1726032627,153.9
1726119027,154.0
1726205424,154.1
1726291824,154.2
1726378226,154.3
1726464624,154.4
1726551024,154.5
1726637425,154.6
1726723825,154.8
1726810227,154.9
1726896624,155.0
1726983026,155.1
1727069426,155.2
1727155825,155.3
1727242225,155.4
1727328626,155.5
1727415027,155.6
1727501428,155.7
1727587825,155.8
1727674225,155.9
1727760625,156.0
1727847025,156.1
1727933427,156.2
1728019824,156.6
1728106226,156.7
1728192626,156.8
1728279026,156.9
1728365427,157.0
1728451826,157.8
1728538226,157.9
1728624625,158.0
1728711027,158.1
1728797426,158.2
1728883826,158.3
1728970229,158.4
1729056626,158.5
1729143026,158.6
1729229426,158.7
1729315825,158.8
1729402225,158.9
1729488625,159.0
1729575025,159.1
1729661425,159.1
1729747827,159.2
1729834225,159.3
1729920625,159.4
1730010626,159.5
1730097024,159.6
1730183427,159.7
1730269827,159.8
1730356226,159.9
1730442627,160.0
1730529026,160.1
1730615427,160.2
1730701827,160.3
1730788227,160.4
1730874626,160.5
1730961027,160.6
1731047427,161.3
1731133827,161.4
1731220226,161.5
1731306627,161.6
1731393026,161.7
1731479427,161.8
1731565827,161.9
1731652227,162.0
1731738626,162.1
1731825024,162.2
1731911427,162.3
1731997824,162.4
1732084228,162.5
1732170626,162.6
1732257026,162.7
1732343427,162.8
1732429825,162.9
1732516225,163.0
1732602624,163.1
1732689025,163.6
1732775425,163.7
1732861827,163.8
1732948231,163.9
1733034631,164.0
1733121030,164.1
1733207432,164.2
1733293833,164.3
1733380233,164.4
