1659421963,1
1659451128,1
1659508368,12
1659537519,12
1659594767,4
1659624049,4
1659681160,6
1659710444,6
1659767561,10
1659796845,10
1659853840,11
1659883130,11
1659940369,10
1659969638,10
1660026647,6
1660056049,6
1660113163,9
1660142439,9
1660199441,7
1660228849,7
1660285970,8
1660315250,8
1660372250,12
1660401521,12
1660458761,5
1660488049,5
1660545162,11
1660574449,11
1660631564,4
1660660730,4
1660717841,8
1660747248,8
1660804362,1
1660833647,1
