1679569142,137
1679584407,137
1679589867,137
1679596494,137
1679602915,137
1679607956,137
1679639532,295
1679722309,290
1679808717,141
1679895117,97
1679981518,170
1680067912,553
1680154308,510
1680240714,150
1680327097,150
1680413504,167
