1645165829,1
1645252290,1
1645338629,3
1645425030,3
1645467113,3
1645470826,3
1645511492,1
1645597892,5
1645684232,2
1645770629,3
1645857150,6
1645943553,2
1646029893,4
1646116237,13
1646202760,4
1646289033,7
1646375551,3
1646461951,5
