1649399549,1
1649485949,1
1649572354,49
1649745150,2
1649917950,7
1650004228,13
1650263549,1
1650436229,11
1650522756,2
1650609163,28
1650781953,5
1650954630,4
1651041030,11
1651127552,1
1651213951,114
1651300352,2
1651386755,22
1651645850,7
