1694842234,2
1694928634,2
1695187834,1
1695274234,2
1695360634,2
1695533434,4
1695619839,4
1695965441,1
1697261447,1
1697347842,1
1697520642,1
1697607044,1
1697693444,1
1697866244,3
1697952644,3
1698211845,3
1698474646,6
1698561046,3
1698647445,3
1699597838,2
1699684239,1
1699770639,1
1699943446,1
1700116239,1
1700202637,2
1705041045,1
