1675405883,35
1675665075,12
1675751474,121
1676356254,5
1676442661,28
1676529061,15
1676615450,29
1676874662,17
1676961061,6
1677047454,3
1677133857,12
1677479458,9
1677565859,9
1677652257,11
1677738657,3
1678084257,3
1678257055,21
1678343445,32
1679569142,159
1679584407,159
1679589867,159
1679596494,159
1679602915,159
1679607956,159
1679639532,69
1679722309,32
1679808717,36
1679895117,33
1679981518,107
1680067912,53
1680154308,44
1680240714,37
1680327097,15
1680413504,22
1680499902,68
1680586299,109
1680672702,51
1680759104,20
1680845523,18
1680931899,18
1681018301,32
1681104713,71
1681191117,66
1681277516,64
1681363906,88
1681450306,51
1681536706,44
1681623105,16
1681709528,89
1681795909,44
1681882326,91
1681968706,92
1682055103,37
1682141505,21
1682227910,42
1682314324,110
1682400707,44
1682487105,44
1682573524,85
1682659898,69
1682746309,17
1682832700,23
1682919107,30
1683005499,104
1683091901,319
1683178309,43
1683264713,46
1683351101,20
1683437506,18
1683523904,44
1683610328,174
1683696716,45
1683783116,72
1683869508,29
1683955918,25
1684042308,34
1685544777,33
1685597496,93
1685683902,48
1685770303,19
1685856701,19
1685943100,20
1686029502,10
1686115904,100
1686202306,54
1686288711,53
1686375108,34
1686461512,18
1686547909,52
1686634309,61
1686720704,55
1686807105,86
1686893562,59
1686979954,22
1687066360,14
1687152774,68
1687239150,33
1687411953,4
1687498393,19
1687584774,28
1687671173,5
1687757568,44
1687843969,30
1687930377,65
1688016807,346
1688103218,260
1688189597,29
1688275996,55
1688362412,71
1688535215,25
1688621614,26
1688708029,17
1688794420,21
1688880821,17
1688967219,26
1689053626,15
1689140028,31
1689226424,154
1689312837,67
1689399195,22
1689485597,22
1689572000,51
1689658397,28
1689744807,6
1689831241,30
1689917640,13
1690004042,19
1690090404,31
1690176817,32
1690263240,22
1690349617,18
1690436012,26
1690522443,50
1690608808,16
1690695212,14
1690781617,24
1690868047,17
1690954421,14
1691040818,20
1691127250,4
1691213630,13
1691300015,15
1691386395,78
1691472821,12
1691559206,74
1691645653,41
1691732035,41
1691818443,8
1691904834,19
1691991184,45
1692077570,22
1692163972,71
1692250382,14
1692336773,17
1692423180,41
1692509573,22
1692595944,2
1692682368,47
1692768764,16
1692855167,48
1692941568,29
1693027980,34
1693114356,19
1693200777,31
1693287141,34
1693373568,35
1693459952,40
1693546364,17
1693632754,34
1693719144,12
1693805540,124
1693891949,22
1693978362,19
1694064749,41
1694151151,40
1694237547,27
1694323959,15
1694410362,56
1694496769,38
1694583178,57
1694669562,268
1694755972,244
1694842363,51
1694928766,36
1695015165,197
1695187975,104
1695274380,104
1695360784,105
1695447164,32
1695533586,44
1695619990,89
1695706406,69
1695792808,120
1695879218,89
1695965624,39
1696052011,17
1696138408,25
1696224807,22
1696311219,47
1696397621,42
1696484041,34
1696570435,66
1696656841,31
1696743237,18
1696829644,26
1696916048,36
1697002439,34
1697088838,79
1697175238,44
1697261644,23
1697348050,23
1697434425,51
1697520844,37
1697607247,53
1697693651,16
1697780021,45
1697866447,37
1697952848,11
1698039229,68
1698125641,47
1698212053,29
1698298423,35
1698384826,75
1698474862,13
1698561261,45
1698647660,56
1698734051,71
1698820440,85
1698906836,50
1698993260,43
1699079643,33
1699166057,42
1699252467,50
1699338847,55
1699425254,36
1699511642,39
1699598052,55
1699684453,32
1699770845,14
1699857241,22
1699943653,34
1700030030,34
1700116443,42
1700202865,41
1700289223,44
1700375637,39
1700462021,69
1700548451,27
1700634836,48
1700721246,14
1700807657,45
1700894058,9
1700980458,8
1701066868,51
1701239661,29
1701326039,66
1701412459,33
1701498834,28
1701585234,13
1701671642,37
1701758036,38
1701930831,61
1702017289,70
1702103633,32
1702190033,25
1702276447,46
1702362833,71
1702449238,54
1702535641,46
1702622071,39
1702708433,10
1702794843,15
1702881239,80
1702967665,54
1703054037,52
1703140439,41
1703226865,25
1703313245,40
1703399641,17
1703572441,30
1703658841,24
1703745239,13
1703831661,38
1703918046,34
1704004443,14
1704090847,10
1704177241,39
1704263638,44
1704350037,53
1704436450,31
1704522832,18
1704609231,9
1704695681,44
1704782089,61
1704868474,43
1704954878,31
1705041294,61
1705127674,21
1705300477,67
1705386877,29
1705473291,21
1705559692,43
1705646097,42
1705732479,16
1705818877,15
1705905294,41
1705991686,28
1706078101,32
1706164491,28
1706250972,42
1706337342,8
1706423747,47
1706510148,38
1706596552,17
1706682956,42
1706769366,46
1706855781,68
1706942169,19
1707028569,17
1707114964,42
1707201363,70
1707287760,39
1707374158,52
1707460602,65
1707546967,22
1707633370,11
1707719770,100
1707806171,82
1707892577,81
1707978960,68
1708065403,59
1708151763,12
1708238171,5
1708324568,41
1708410859,42
1708497318,93
1708583778,53
1708670174,74
1708756568,20
1708842965,21
1708929366,45
1709015768,49
1709102173,47
1709188566,36
1709275007,17
1709361374,11
1709447776,6
1709534155,32
1709620564,22
1709706962,16
1709793367,14
1709966169,22
1710052561,7
1710138969,38
1710225362,36
1710311773,49
1710398159,37
1710484595,24
1710570954,12
1710657364,7
1710743767,39
1710830176,26
1710916554,7
1711002952,14
1711089395,40
1711175767,18
1711262153,19
1711348567,42
1711434966,12
1711521368,38
1711607758,27
1711694155,12
1711776969,23
1711863379,11
1711949767,10
1712036181,23
1712122595,4
1712209001,42
1712295387,30
1712381761,21
1712468183,24
1712554571,28
1712640970,35
1712727387,59
1712813813,6
1712900232,26
1712986589,9
1713073014,8
1713159410,24
1713245803,32
1713332196,42
1713418604,10
1713505010,10
1713591405,14
1713677807,7
1713764197,9
1713850601,12
1713937016,36
1714023425,35
1714109816,6
1714196216,5
1714282602,9
1714369033,19
1714455398,17
1714541804,7
1714714600,35
1714801009,5
1714887409,9
1714973810,19
1715060210,26
1715146632,33
1715233058,31
1715319563,15
1715405851,3
1715492244,12
1718022496,52
1718084230,42
1718170636,11
1718257047,27
1718343427,11
1718429818,13
1718516215,22
1718602645,19
1718689022,32
1718775431,16
1718861831,17
1718948217,16
1719034629,26
1719121031,14
1719207304,8
1719293732,34
1719380130,32
1719466523,23
1719552933,14
1719639300,13
1719725705,6
1719812104,27
1719898511,27
1719984907,26
1720071331,9
1720157731,7
1720244127,13
1720330509,13
1720416929,32
1720503328,10
1720589730,24
1720676127,22
1720762554,11
1721021712,6
1721108139,6
1721194539,38
1721280942,16
1721367339,10
1721453736,27
1721540139,9
1721626512,3
1721712930,11
1721799317,7
1721885729,3
1721972116,8
1722058513,10
1722144941,6
1722231340,13
1722317737,10
1722404147,31
1722490541,5
1722576933,12
1722663315,31
1722749743,3
1722836105,14
1722922512,28
1723008910,16
1723095317,18
1723181712,23
1723268105,25
1723354509,3
1723440921,27
1723527316,9
1723613721,67
1723700119,21
1723786513,3
1723872909,3
1723959316,14
1724045707,28
1724132118,19
1724218520,61
1724304925,32
1724391319,11
1724477730,6
1724564111,10
1724650531,9
1724736906,24
1724823316,31
1724909717,18
1724996108,3
1725082506,10
1725168909,5
1725255319,29
1725341717,41
1725428109,28
1725514506,12
1725600914,20
1725687306,6
1725773707,10
1725860113,26
1725946519,10
1726032920,38
1726119315,15
1726205705,15
1726292115,16
1726378512,21
1726464916,34
1726551329,16
1726637718,3
1726724132,13
1726810515,9
1726896925,6
1726983322,21
1727069719,21
1727156114,59
1727242538,13
1727328917,88
1727415326,35
1727501713,12
1727588116,4
1727674524,38
1727760922,14
1727847333,35
1727933723,20
1728020122,10
1728106547,6
1728192945,3
1728279336,25
1728365743,23
1728452151,51
1728538537,24
1728624938,17
1728711328,13
1728797737,5
1728884126,13
1728970539,13
1729056925,12
1729143336,16
1729229724,5
1729316123,7
1729402521,16
1729488952,40
1729575323,20
1729661730,18
1729748135,10
1729834546,27
1729924541,13
1730010943,3
1730097332,22
1730183730,28
1730270141,9
1730356536,41
1730442925,3
1730529338,12
1730615759,3
1730702128,18
1730788525,17
1730874965,30
1730961326,16
1731047722,4
1731134141,7
1731220531,5
1731306938,25
1731393338,3
1731479747,15
1731566125,53
1731652532,19
1731738930,6
1731825326,7
1731911726,49
1731998131,243
1732084532,38
1732170946,44
1732257343,19
1732343726,9
1732430128,11
1732516530,18
1732602931,25
1732689332,3
1732775733,15
1732862185,10
1732948585,12
1733034986,8
1733121412,17
1733207816,28
1733294214,20
