1655274636,7
1655361158,15
1655447555,11
1655533836,12
1655620256,8
1655706645,8
1655793158,11
1655879557,16
1655965955,18
1656052365,8
1656138754,16
1656225155,8
1656311556,10
1656397956,10
1656484356,4
1656570758,7
1656743558,14
1656829841,11
1656916357,11
1657002637,9
1657089163,9
1657175559,13
1657261838,13
1657348240,11
1657434758,17
1657521164,11
1657607566,9
1657693957,12
1657780357,14
1657803090,14
1657804447,14
1657809517,14
1657866760,9
1657896040,9
