1712209001,8
1712295387,6
1712381761,7
1712468183,13
1712554571,12
1712640970,12
1712727387,8
1712813813,9
1712900232,16
1712986589,6
1713073014,5
1713159410,3
1713245803,10
1713332196,10
1713418604,10
1713505010,7
1713591405,6
