1636895594,61
1636898490,68
1636900709,70
1637070326,70
1637070818,70
1637072812,98
1637122028,105
1637208446,125
1637294806,116
1637381227,98
1637467621,171
1637554087,198
1637589848,198
1637640464,51
1637726914,74
1637813369,89
1637899638,59
