1656052365,2
1656138754,17
1656484356,4
1657002637,195
1657175559,8
1657261838,14
1657348240,1
1657434758,65
1657521164,23
1657607566,14
1657693957,38
1657780357,20
1657803090,20
1657804447,20
1657809517,20
