1691818443,1
1691904834,3
1691991184,4
1692077570,3
1692163972,11
1692250382,6
1692336773,4
1692423180,13
1692509573,9
1692595944,1
1692682368,2
1692768764,4
1692855167,2
1692941568,2
1693027980,3
1693114356,9
1693200777,5
1693287141,1
1693373568,4
1693459952,20
1693546364,1
1693632754,2
