1697175042,1
1697261447,1
1697347842,1
1698211845,1
1698474646,2
1698561046,1
1698647445,1
1698993045,2
1699079441,1
1699165843,1
1699252253,6
1699857040,1
1701239442,1
1701412240,2
1702017040,2
1702621850,1
1702967450,1
1703226640,1
1703831442,1
