1687152641,1
1688621445,1
1688707844,1
1688794245,1
1688880644,1
1688967042,1
1689053441,1
1689139840,1
1689226241,1
1689312653,1
1689744640,1
1689831044,1
1689917446,1
1690003846,1
1690263047,1
1701239442,1
1701412240,2
1702017040,1
1702621850,1
1703226640,1
1703831442,1
