1654237831,2
1654324351,10
1654410631,15
1654497153,19
1654583555,21
1654669837,22
1654756356,5
1654842756,4
1654929156,4
1655015436,2
1655101838,5
1655274636,10
1655361158,16
1655447555,23
1655533836,11
1655620256,9
1655706645,23
1655793158,10
1655879557,11
1655965955,7
1656052365,10
1656138754,10
1656225155,8
1656311556,12
1656397956,16
1656484356,14
1656570758,11
1656743558,10
1656829841,11
1656916357,7
