1648708231,6
1648794750,8
1648881149,6
1648967561,12
1649053832,5
1649140351,1
1649226751,3
1649313029,9
1649399549,11
1649485949,7
1649572354,7
1649658750,12
1649745150,5
1649831565,13
1649917950,2
1650004228,10
1650090628,3
1650177150,3
1650349831,10
1650436229,9
1650522756,2
1657348240,1
1659335565,1
1659364847,1
1659421963,1
1659451128,1
1659594767,1
1659624049,1
1659681160,1
1659710444,1
1659940369,1
1659969638,1
1660026647,1
1660056049,1
1660199441,1
1660228849,1
1660285970,1
1660315250,1
1682746309,34
1692509573,8
1714109816,11
