1649485949,28
1649572354,233
1649658750,375
1649745150,139
1649831565,144
1649917950,297
1650004228,182
1650090628,336
1650177150,146
1650263549,146
1650349831,151
1650436229,281
1650522756,140
1650609163,234
1650695550,160
1650781953,20
