1642392088,10
1642408942,10
1642478484,17
1642564885,18
1642651226,18
1642676514,18
1642769502,16
1642771604,16
1642805136,16
1642805851,16
1642824026,18
1642855125,18
1642910490,13
1642924655,13
1642934565,13
1642937864,13
1642996892,15
1643083292,15
1643169628,13
1643256090,14
1643342487,17
1643428827,4
1643515288,2
1643601634,4
1643622207,4
1643688028,4
1643708607,4
1643774489,3
1643860889,3
1643947288,3
1644033629,12
1644120088,4
1644206493,17
1644292831,10
1644321030,10
1644388289,1
1644407490,1
1644474692,3
1644493888,3
1644561030,12
1644647492,6
1644733834,1
1644770508,1
1644820292,6
1644906689,5
1644993090,2
1645079499,1
1645165829,4
1645252290,1
1645338629,5
1645425030,5
1645467113,5
1645470826,5
1645511492,3
