1679584314,1
1679589759,1
1679596397,1
1679602819,1
1679607852,1
1679639432,3
1679981431,1
1680240629,3
1680845434,3
1683610233,3
1687066239,2
1687152641,2
1687498241,16
1688016640,16
1688103041,16
1688275841,1
1688362240,16
1688535044,14
1688621445,16
1688707844,16
1688794245,16
1688880644,12
1688967042,16
1689053441,15
1689139840,15
1689226241,15
1689312653,15
1689744640,3
1689831044,14
1689917446,14
1690003846,14
1690263047,8
1690867847,1
1691127048,1
1691645448,1
1691991040,1
1692077440,1
1692163831,1
1692250233,1
1692336633,1
1692423035,1
1692509432,1
1692682233,1
1692768633,1
1692855035,1
1692941433,1
1693027839,1
1693200633,1
1693978232,1
1694151031,1
1694410234,1
1694583036,1
1694669436,1
1694755834,1
1694842234,1
1694928634,1
1695274234,2
1695360634,1
1695533434,1
1695619839,1
1695965441,1
1696483842,1
1696570241,1
1696656645,1
1696743043,1
1696829444,1
1696915841,1
1697002242,1
1697088641,2
1697261447,1
1697347842,1
1697520642,1
1697607044,1
1697693444,1
1697866244,1
1697952644,1
1698211845,1
1698474646,1
1698561046,1
1698647445,1
1698733843,1
1698993045,1
1699079441,1
1699165843,1
1699252253,4
1699338639,1
1699425038,1
1699597838,2
1699684239,2
1699770639,1
1699857040,1
1699943446,1
1700116239,1
1700202637,2
1700548240,1
1700634640,1
1700721041,1
1700807441,2
1700893840,1
1700980240,1
1701066641,2
1701239442,1
1701412240,2
1702017040,1
1702621850,1
1703226640,1
1703831442,1
1704349840,5
1711089048,1
1714109453,1
1726291851,1
