1654583555,14
1654669837,263
1654756356,162
1654842756,153
1654929156,433
1655015436,110
1655101838,148
1655188357,263
1655274636,419
1655361158,132
1655447555,122
1655533836,163
1655620256,111
1655706645,124
1655793158,228
1655879557,326
1655965955,245
1656052365,224
1656138754,248
1656225155,143
1656311556,152
1656397956,142
1656484356,153
1656570758,603
1656743558,194
1656829841,252
1656916357,122
1657002637,118
1657089163,156
1657175559,236
1657261838,298
1657348240,120
1657434758,236
1657521164,197
1657607566,397
1657693957,153
1657780357,85
1657803090,85
1657804447,85
1657809517,85
