1671629111,171
1671630664,171
1671632450,171
1671634011,171
1673516775,126
1674367285,135
1674455475,285
1674541884,125
1674628285,73
1674714694,131
1674801082,392
1674887480,286
1674973872,384
1675060281,152
1675146682,80
