1679569142,7
1679584407,7
1679589867,7
1679596494,7
1679602915,7
1679607956,7
1679895117,7
1680672702,11
1682573524,1
1682659898,1
1682746309,1
1682832700,1
1682919107,1
1683178309,1
1683264713,1
1683351101,1
1683437506,1
1683523904,1
1683610328,1
1683783116,1
1683869508,1
1683955918,1
1684042308,1
1685597496,1
1685683902,1
1685770303,1
1685856701,1
1685943100,1
1686288711,1
1686375108,1
1686720704,1
1686807105,1
1687239150,1
1687411953,1
1687498393,1
1687584774,1
1687671173,1
1687757568,1
1687843969,1
1687930377,1
1688621614,1
1688708029,1
1688880821,1
1688967219,1
1689053626,1
1689312837,1
1689399195,1
1689485597,1
1689572000,1
1689658397,1
1690004042,1
1690090404,1
1690176817,1
1690695212,1
1690954421,1
1691300015,1
1691732035,1
1691818443,1
1691904834,1
1692077570,1
1692163972,1
1692250382,1
1692423180,1
1692509573,1
1692595944,1
1692682368,1
1692855167,1
1692941568,1
1693027980,1
1693114356,1
1693287141,1
1694842363,1
1694928766,1
1695187975,1
1695447164,1
1695706406,1
1695792808,1
1695879218,1
1695965624,1
1696138408,1
1696224807,1
1696311219,1
1696484041,1
1696656841,1
1696743237,1
1697434425,1
1698298423,2
1699079643,1
1699598052,2
1699684453,1
1699770845,1
1699857241,1
1700116443,1
1700202865,1
1700289223,1
1700375637,1
1700548451,1
1700807657,1
1700894058,1
1700980458,1
1701412459,1
1701498834,1
1701585234,1
1701671642,1
1701758036,1
1702017289,1
1702103633,1
1702190033,1
1702276447,1
1702535641,1
1702708433,1
1702881239,1
1702967665,1
1703140439,1
1703226865,1
1703313245,1
1703399641,1
1703572441,1
1704004443,1
1704090847,1
1704263638,1
1705127674,1
1705300477,1
1705386877,1
1705559692,1
1706078101,1
1706164491,1
1706337342,1
1706423747,1
1706510148,1
1706596552,1
1706682956,1
1706769366,1
1706942169,1
1707028569,1
1707201363,1
1707633370,1
1708065403,1
1708238171,1
1708324568,1
1708410859,1
1708497318,1
1708583778,1
1708842965,1
1708929366,1
1709102173,1
1709188566,1
1709275007,1
1709361374,1
1709447776,1
1710052561,1
1710138969,1
1710657364,1
1710743767,1
1710916554,1
1711262153,1
1711434966,1
1711521368,1
1712295387,1
1712381761,1
1712468183,1
1712727387,1
1713073014,1
1713677807,1
1714282602,1
1714455398,1
1714541804,1
1714801009,1
1714887409,1
1721453736,1
1723959316,1
1724823316,1
1725082506,1
1725168909,1
1731998131,132
1732775733,8
