1679639432,3
1679981431,3
1680240629,2
1680845434,3
1682314235,3
1683437432,2
1683610233,3
1686807032,1
1688016640,2
1688103041,3
1688189452,1
1688275841,1
1688362240,2
1688535044,2
1688621445,2
1688707844,2
1688794245,2
1688880644,2
1688967042,2
1689053441,2
1689139840,2
1689226241,2
1689312653,3
1689831044,2
1689917446,2
1690003846,2
1690263047,2
1690522245,3
1690867847,4
1691127048,4
1691645448,4
1691731846,3
1691818247,3
1691904646,2
1691991040,4
1692077440,4
1692163831,4
1692250233,4
1692336633,4
1692423035,4
1692509432,4
1692682233,3
1692768633,3
1692855035,3
1692941433,3
1693027839,3
1693114233,1
1693200633,3
1693978232,3
1694151031,1
1694323834,1
1694583036,3
1694669436,3
1694755834,3
1694842234,3
1694928634,3
1695187834,2
1695274234,3
1695360634,3
1695533434,4
1695619839,4
1695965441,4
1696483842,4
1696570241,4
1696656645,3
1696743043,4
1696829444,4
1696915841,4
1697002242,4
1697088641,4
1697175042,4
1697261447,4
1697347842,4
1697520642,5
1697607044,4
1697693444,4
1697866244,4
1697952644,4
1698211845,2
1698474646,3
1698561046,2
1698647445,2
1698733843,2
1698993045,2
1699079441,2
1699165843,2
1699252253,12
1699338639,1
1699425038,2
1699597838,4
1699684239,2
1699770639,3
1699857040,2
1699943446,2
1700116239,2
1700202637,4
1700548240,2
1700721041,2
1700807441,4
1700893840,2
1700980240,2
1701066641,2
1701239442,2
1701412240,4
1702017040,2
1702621850,2
1703226640,2
1703831442,2
1704436239,4
1704781855,1
1705041045,4
1705645846,4
1708410644,8
1708583454,4
1720935048,1
1729575053,1
1732084253,1
