1663569159,1
1663598447,1
1663655565,7
1663684725,7
1663741840,20
1663771124,20
1663828239,8
1663857524,8
1663914640,10
1663943934,10
1664001039,3
1664030318,3
1664087438,15
1664116722,15
1664173842,5
1664203127,5
