1700548240,1
1700721041,1
1700807441,2
1700893840,1
1700980240,1
1701066641,1
1701239442,1
1701412240,2
1702017040,1
1702621850,1
1703226640,1
1703831442,1
1704436239,1
1705041045,1
1708237849,1
1712813449,3
