1696570241,1
1696656645,1
1696743043,1
1696829444,1
1696915841,1
1697002242,1
1697088641,1
1697175042,1
1697261447,1
1697347842,1
1697520642,1
1697607044,1
1697866244,1
1697952644,1
1698211845,1
1698474646,2
1698561046,1
1698647445,1
1699425038,1
1699597838,4
1699684239,3
1699770639,3
1699857040,2
1699943446,3
1700116239,3
1700202637,6
1700548240,3
1700721041,3
1700807441,6
1700893840,3
1700980240,3
1701066641,1
1701239442,1
1701412240,2
1702017040,2
1702621850,1
1703226640,1
1703831442,1
1704436239,1
1704609039,1
