1662186760,6
1662216045,6
1662273039,6
1662302447,6
1662445958,4
1662475124,4
1662532358,66
1662561643,66
1662618758,51
1662647931,51
1662791558,2
1662820724,2
1662964357,4
1662993645,4
1663223564,2
1663252844,2
1663309969,2
1663339237,2
