1696484041,22
1696570435,4
1696656841,5
1696743237,2
1696829644,1
1696916048,25
1697002439,3
1697088838,18
1697175238,1
1697261644,3
1697348050,4
1697434425,4
1697520844,3
1697607247,5
1697693651,5
1697780021,3
1697866447,3
1697952848,2
1698039229,4
1698125641,4
1698212053,1
1698298423,5
1698384826,2
1698474862,9
1698561261,6
1698647660,9
1698734051,13
1698820440,3
1698906836,5
1698993260,19
1699079643,3
1699166057,5
1699252467,5
1699338847,1
1699425254,5
1699511642,2
1699598052,8
1699684453,2
1699770845,5
1699857241,4
1699943653,4
1700030030,8
1700116443,2
1700202865,2
1700289223,3
1700375637,5
1700462021,2
1700548451,2
1700634836,3
1700721246,2
1700807657,4
1700894058,3
1700980458,7
1701066868,3
1701239661,4
