1712209001,222
1712295387,228
1712381761,134
1712468183,102
1712554571,155
1712640970,186
1712727387,147
1712813813,1086
1712900232,169
1712986589,130
1713073014,126
1713159410,138
1713245803,669
1713332196,166
1713418604,100
1713505010,135
1713591405,113
