1652596232,103
1652682759,132
1652769160,124
1652855561,122
1652941964,113
1653028353,236
1653114753,349
1653201159,199
1653287558,228
1653373954,110
1653460234,285
1653546755,130
1653633154,122
1653719553,134
1653805957,178
1653892236,12
