1641700884,4
1641787224,23
1641873686,31
1642305627,41
1642319122,41
1642392088,20
1642408942,20
1642478484,34
1642564885,15
1642651226,37
1642676514,37
1642769502,25
1642771604,25
1642805136,25
1642805851,25
1642824026,133
1642855125,133
1642910490,33
1642924655,33
1642934565,33
1642937864,33
1642996892,28
1643083292,43
1643169628,11
