1693632754,347
1693719144,230
1693805540,127
1693891949,372
1693978362,125
1694064749,184
1694151151,438
1694237547,252
1694323959,315
1694410362,130
1694496769,284
1694583178,1120
1694669562,222
1694755972,272
1694842363,177
1694928766,140
1695015165,268
1695187975,853
1695274380,350
1695360784,497
1695447164,198
1695533586,425
