1632865308.0641682,81
1632865749.173578,81
1632895280.784555,81
1632895536.606379,81
1632896556.1956952,81
1632896850.5004485,81
1632899491.304822,81
1632899879.0966103,81
1632900592.555823,81
1632901443.3593616,81
1632905835.4255302,81
1632906019.4406266,81
1632906196.472091,81
1632908774.4472816,81
1632910399.8208637,81
1632911526.0943942,81
1633002272.3882627,81
1633002673.3506546,81
1633003119.474327,81
1633003835.5070448,81
1633003966.3277757,81
1633004078.9578943,81
1633004191.885855,81
1633004501.7416294,81
1633004676.4676483,81
1633011638.54712,81
1633012214.9681804,81
1633424943.33429,80
1633425493.1169825,80
1633426478.3143084,80
1633438642.5865374,328
1633447325.055278,328
1633447629.764246,328
1633450067.4985604,328
1633450373.2471435,328
1633451647.7087314,328
1633454007.2955327,328
1633457339.536741,328
1633465539.505468,328
1633470330.8973372,328
1633493372.3536453,328
1633580033.2926786,328
1633586717.5619512,328
1633666179.7257118,328
1633753203.091806,328
1633838993.9085202,328
1633925354.7495933,328
1634011938.5370657,328
1634098267.2879703,328
1634184544.3414013,328
1634271082.7234018,328
1634357519.7539048,328
1634443761.5139048,328
1634530219.560717,328
1634616532.9491198,328
1634789793.8658426,328
1634875816.9400954,328
1634962141.7485313,328
1635048587.1407797,328
1635134934.9314373,328
1635221404.6687243,328
1635307793.0768614,328
1635394173.1168666,328
1635501355.2740676,329
1635502712.6749732,329
1635504830.1218412,329
1635505635.951093,329
1635506100.3945103,329
1635566903.548621,329
1635653314.9274743,329
1635739809.2791133,329
1635826110.6264627,329
1635912779.1420777,329
1635999067.9597867,329
1636085522.471245,329
1636171859.529959,329
1636258140.1215904,329
1636344469.9635408,329
1636369390.5833075,329
1636370532.529991,329
1636372905.434394,329
1636430991.9807904,329
1636517297.6670315,329
1636603695.257822,329
1636690115.0795488,329
1636776602.6276057,329
1636863063.3243234,329
1636949308.6965327,329
1636982021.8130662,329
1636984909.5972054,331
1637156773.6156456,332
1637157253.2462914,332
1637159400.2104428,332
1637208628.6680393,332
1637295053.1289213,332
1637381443.9167826,332
1637467839.3369582,332
1637554238.1292922,332
1637640704.1480865,332
1637676503.456398,332
1637726992.3441923,332
1637813544.4511993,332
1637900000.092484,332
1637986143.0258741,332
1638072510.7060363,332
1638159144.3358736,332
1638245525.0543602,332
1638331873.8519788,332
1638418288.2041667,332
1638504825.9751997,332
1638591180.1650324,332
1638677566.0286717,332
1638763903.4786792,332
1638850442.8589349,332
1638936712.8549926,332
1639023050.4818184,332
1639109842.7136536,332
1639148395.9381013,332
1639149806.8158574,332
1639195977.3131466,332
1639236173.597206,332
1639282585.7908497,332
1639322509.394125,332
1639368875.1561346,332
1639408970.321559,332
1639455166.2717187,332
1639495369.0408394,332
1639541578.4954903,332
1639581770.6156282,332
1639628064.5137305,332
1639665257.4701872,332
1639667650.174536,332
1639714447.048458,332
1639800867.4474206,332
1639990983.0214145,332
1639994380.4111922,332
1640067362.1524596,332
1640069762.8123167,332
