1691645653,6
1691732035,206
1691818443,292
1691904834,669
1691991184,123
1692077570,126
1692163972,863
1692250382,120
1692336773,254
1692423180,313
1692509573,216
1692595944,94
1692682368,107
1692768764,122
1692855167,171
1692941568,153
1693027980,81
1693114356,33
