1646980230,2
1647066751,1
1647239550,1
1647325952,1
1647412352,1
1647585151,1
1647930752,2
1650349831,1
1650522756,1
1650609163,4
1650695550,1
1650954630,1
1651300352,5
1651559564,1
1654151553,3
1654237831,1
1654929156,2
1655101838,1
1655274636,2
1655447555,1
1655620256,1
1655706645,1
1656916357,1
1657089163,7
1657348240,4
1657434758,1
1657521164,1
1657607566,1
1663828239,2
1663857524,2
1663914640,1
1663943934,1
