1698993045,2
1699079441,1
1699165843,1
1699252253,6
1699338639,1
1699425038,2
1699597838,2
1699684239,1
1699770639,1
1699857040,1
1699943446,1
1700116239,1
1700202637,2
1700548240,1
1700807441,2
1700893840,1
1700980240,1
1704436239,1
1705645846,1
1708410644,2
1708583454,1
1729056653,1
