1692682233,3
1692768633,3
1692855035,3
1692941433,3
1693027839,3
1693114233,2
1693200633,3
1693978232,1
1694323834,1
1694496634,1
1694583036,1
1694755834,1
1694842234,1
1694928634,1
1695187834,3
1695274234,3
1695360634,3
