1652164360,6
1652250764,2
1652337032,2
1652423553,2
1652509832,2
1652596232,2
1652682759,2
1652769160,2
1652855561,2
1652941964,2
1653028353,2
1653114753,2
1653201159,2
1653287558,2
1653373954,2
1653460234,2
1653546755,2
1653633154,2
1653719553,2
1653805957,2
1653892236,2
1653978755,2
1654065033,2
1654151553,2
1654237831,3
1654324351,2
1654410631,2
1654497153,2
1654583555,2
1654669837,2
1654756356,2
1654842756,2
1654929156,2
1655015436,2
1655101838,2
1655188357,2
1655274636,2
1655361158,2
1655447555,2
1655533836,2
1655620256,2
1655706645,2
1655793158,2
1655879557,2
1655965955,2
1656052365,2
1656138754,2
1656225155,2
1656311556,2
1656397956,2
1656484356,2
1656570758,2
1656829841,4
1656916357,2
1657002637,2
1657089163,2
1657175559,2
1657261838,2
1657348240,2
1657434758,2
1657521164,2
1657607566,2
1657693957,2
1657780357,2
1657803090,2
1657804447,2
1657809517,2
1657866760,10
1657896040,10
1657953158,4
1657982325,4
1658039438,4
1658068726,4
1658125843,4
1658155247,4
1658212362,4
1658241661,4
1658298758,4
1658328052,4
1658385041,4
1658414447,4
1658471560,4
1658500847,4
1658557962,4
1658587247,4
1658644360,4
1658673645,4
1658730762,4
1658760045,4
1658817160,4
1658846453,4
1658903439,4
1658932848,4
1658989840,4
1659019246,4
1659076365,4
1659105646,4
1659162770,4
1659192044,4
1659249159,4
1659278470,4
1659335565,4
1659364847,4
1659421963,4
1659451128,4
1659508368,4
1659537519,4
1659594767,4
1659624049,4
1659681160,4
1659710444,4
1659767561,5
1659796845,5
1659853840,4
1659883130,4
1659940369,4
1659969638,4
1660026647,4
1660056049,4
1660113163,4
1660142439,4
1660199441,4
1660228849,4
1660285970,4
1660315250,4
1660372250,4
1660401521,4
1660458761,4
1660488049,4
1660545162,4
1660574449,4
1660631564,4
1660660730,4
1660717841,4
1660747248,4
1660804362,4
1660833647,4
1660890760,4
1660920046,4
1660977162,4
1661006455,4
1661063442,4
1661092854,4
1661149842,4
1661179125,4
1661236366,4
1661265647,4
1661322641,4
1661352051,4
1661409162,4
1661438449,4
1661495561,4
1661524735,4
1661581964,4
1661611239,4
1661668363,4
1661697647,4
1661700049,4
1661754784,6
1661784048,6
1661870448,4
1661927560,4
1661956724,4
1662013964,4
1662043246,4
1662100359,4
1662129642,4
1662186760,4
1662216045,4
1662273039,4
1662302447,4
1662359559,4
1662388727,4
1662445958,4
1662475124,4
1662532358,4
1662561643,4
1662618758,4
1662647931,4
1662705164,4
1662734437,4
1662791558,4
1662820724,4
1662877847,4
1662907237,4
1662964357,4
1662993645,4
1663050638,4
1663080057,4
1663137169,4
1663166448,4
1663223564,4
1663252844,4
1663309969,4
1663339237,4
1663396358,4
1663425653,4
1663482759,4
1663512042,4
1663569159,4
1663598447,4
1663655565,4
1663684725,4
1663741840,4
1663771124,4
1663828239,4
1663857524,4
1663914640,4
1663943934,4
1664001039,4
1664030318,4
1664087438,4
1664116722,4
1664173842,4
1664203127,4
1664260251,4
1664289537,4
1664346641,4
1664375951,4
1664433041,4
1664462320,4
1664519554,5
1664548711,5
1664605833,4
1664635111,4
1668560577,2
1668646979,2
1674541884,4
1674714694,3
1674801082,3
1674887480,3
1674973872,3
1675146682,3
1675492281,3
1675578681,4
1675751474,4
1676442661,6
1676874662,3
1677047454,3
1677393061,109
1677479458,114
1677565859,98
1677738657,102
1677825057,3
1677997847,3
1678084257,5
1678170666,5
1678257055,4
1678343445,16
1679569142,5
1679584407,5
1679589867,5
1679596494,5
1679602915,5
1679607956,5
1679722309,5
1679808717,3
1679895117,14
1680067912,3
1680327097,3
1680413504,3
1680586299,8
1680759104,3
1680845523,4
1680931899,5
1681104713,8
1681191117,3
1681277516,3
1681450306,6
1681623105,9
1681709528,10
1681795909,3
1681882326,13
1681968706,8
1682055103,11
1682227910,5
1682314324,3
1682487105,3
