1646202760,9
1646289033,3
1646375551,6
1646461951,3
1646548229,2
1646634751,1
1646721161,17
1646807431,6
1646893952,5
1646980230,5
1647066751,1
1647153150,5
1647239550,11
1647325952,21
1647412352,4
1647498752,15
1647585151,5
1647757954,6
1647844355,5
1647930752,6
1648017150,5
1648103550,11
1648189831,5
1648276229,4
1648362752,4
1648449033,2
1648535442,6
1648621952,6
