1698734051,13
1699079643,1
1699598052,2
1699684453,1
1699770845,1
1699857241,1
1700116443,1
1700202865,1
1700289223,1
1700375637,1
1700548451,1
1700807657,1
1700894058,1
1700980458,1
1701412459,1
1701498834,1
1701585234,1
1701671642,1
1701758036,1
1702017289,1
1702103633,1
1702190033,1
1702276447,1
1702535641,1
1702708433,1
1702881239,1
1703140439,1
1703226865,1
1703313245,1
1703399641,1
1704090847,1
1704263638,1
1704868474,2
1704954878,2
1705041294,2
1705127674,2
1705300477,2
1705386877,2
1705473291,2
1705559692,2
1705646097,2
1705732479,2
1705818877,2
1705905294,2
1705991686,2
1706078101,2
1706164491,2
1706250972,2
1706337342,2
1706423747,2
1706510148,2
1706596552,2
1706682956,2
1706769366,2
1706855781,2
1706942169,2
1707028569,2
1707114964,2
1707201363,2
1707287760,2
1707374158,2
1707460602,2
1707546967,2
1707633370,2
1707719770,2
1707806171,2
1707892577,2
1707978960,2
1708065403,2
1708151763,2
1708238171,2
1708324568,2
1708410859,2
1708497318,2
1708583778,2
1708670174,2
1708756568,2
1708842965,2
1708929366,2
1709015768,2
1709102173,2
1709188566,2
1709275007,2
1709361374,2
1709447776,2
1709534155,2
1709620564,2
1709706962,2
1709793367,2
1709966169,2
1710052561,2
1710138969,2
1710225362,2
1710311773,4
1710398159,2
1710484595,2
1710570954,2
1710657364,2
1710743767,4
1710830176,2
1710916554,2
1711002952,3
1711089395,2
1711175767,2
1711262153,2
1711348567,2
1711434966,2
1711521368,2
1711607758,2
1711694155,2
1711776969,2
1711863379,2
1711949767,2
1712036181,2
1712122595,2
1712209001,2
1712295387,2
1712381761,2
1712468183,2
1712554571,2
1712640970,2
1712727387,2
1712813813,2
1712900232,2
1712986589,2
1713073014,2
1713159410,2
1713245803,2
1713332196,2
1713418604,2
1713505010,2
1713591405,2
1713677807,2
1713764197,2
1713850601,2
1713937016,2
1714023425,2
1714109816,2
1714196216,2
1714282602,2
1714369033,2
1714455398,2
1714541804,2
1714714600,2
1714801009,2
1714887409,2
1714973810,2
1715060210,2
1715146632,2
1715233058,2
1715319563,2
1715405851,2
1715492244,2
1718022496,2
1718084230,4
1718170636,2
1718257047,2
1718343427,2
1718429818,2
1718516215,2
1718602645,2
1718689022,2
1718775431,2
1718861831,2
1718948217,2
1719034629,2
1719121031,2
1719207304,2
1719293732,2
1719380130,2
1719466523,2
1719552933,2
1719639300,2
1719725705,2
1719812104,2
1719898511,2
1719984907,2
1720071331,2
1720157731,2
1720244127,2
1720330509,2
1720416929,2
1720503328,2
1720589730,2
1720676127,2
1720762554,2
1721021712,2
1721108139,2
1721194539,2
1721280942,2
1721367339,2
1721453736,2
1721540139,2
1721626512,2
1721712930,2
1721799317,2
1721885729,2
1721972116,2
1722058513,2
1722144941,2
1722231340,2
1722317737,2
1722404147,2
1722490541,2
1722576933,2
1722663315,2
1722749743,2
1722836105,2
1722922512,2
1723008910,2
1723095317,2
1723181712,2
1723268105,2
1723354509,2
1723440921,2
1723527316,2
1723613721,2
1723700119,2
1723786513,2
1723872909,2
1723959316,2
1724045707,2
1724132118,2
1724218520,2
1724304925,2
1724391319,2
1724477730,2
1724564111,2
1724650531,2
1724736906,2
1724823316,2
1724909717,2
1724996108,2
1725082506,2
1725168909,2
1725255319,2
1725341717,2
1725428109,2
1725514506,2
1725600914,2
1725687306,2
1725773707,2
1725860113,2
1725946519,2
1726032920,2
1726637718,2
1726724132,2
1726810515,2
1726896925,2
1726983322,2
1727069719,2
1727156114,2
1727242538,2
1727328917,2
1727415326,2
1727501713,2
1727588116,2
1727674524,2
1727760922,2
1727847333,2
1727933723,2
1728020122,2
1728106547,2
1728192945,2
1728279336,2
1728365743,2
1728452151,2
1728538537,2
1728624938,2
1728711328,2
1728797737,2
1728884126,2
1728970539,2
1729056925,2
1729143336,2
1729229724,2
1729316123,2
1729402521,2
1729488952,2
1729575323,2
1729661730,2
1729748135,2
1729834546,2
1729924541,2
1730010943,2
1730097332,2
1730183730,2
1730270141,2
1730356536,2
1730442925,2
1730529338,2
1730615759,2
1730702128,2
1730788525,2
1730874965,2
1730961326,2
1731047722,2
1731134141,2
1731220531,2
1731306938,2
1731393338,2
1731479747,2
1731566125,2
1731652532,2
1731738930,2
1731825326,2
1731911726,2
1731998131,2
1732084532,2
1732170946,2
1732257343,2
1732343726,2
1732430128,2
1732516530,2
1732602931,2
1732689332,2
1732775733,2
1732862185,2
1732948585,2
1733034986,2
1733121412,2
1733207816,2
1733294214,2
