1656916357,3
1657002637,10
1657089163,7
1657175559,12
1657261838,13
1657348240,8
1657434758,11
1657521164,12
1657607566,11
1657693957,6
1657780357,15
1657803090,15
1657804447,15
1657809517,15
1657866760,8
1657896040,8
1657953158,9
1657982325,9
1658039438,10
1658068726,10
1658125843,10
1658155247,10
1658212362,1
1658241661,1
