1647066751,1
1647153150,1
1651905153,1
1651991564,1
1652077954,1
1652164360,1
1652423553,1
1652509832,2
1652769160,2
1652941964,1
1653201159,1
1653287558,2
1653719553,2
1653892236,1
1653978755,1
1654151553,2
1654237831,2
1654324351,1
1654497153,1
1654583555,2
1654842756,2
1655015436,1
1655447555,1
1655533836,2
1656916357,1
1657002637,1
1657089163,6
1657261838,1
1657521164,3
1657693957,1
