{
  "name": "arbetsformedlingen-angular",
  "$schema": "../../../../node_modules/nx/schemas/project-schema.json",
  "projectType": "library",
  "sourceRoot": "libs/arbetsformedlingen/angular/src",
  "prefix": "digi",
  "targets": {
    "build": {
      "executor": "@nx/angular:package",
      "outputs": ["{workspaceRoot}/dist/libs/arbetsformedlingen-angular"],
      "options": {
        "project": "{projectRoot}/ng-package.json",
        "tsConfig": "{projectRoot}/tsconfig.json"
      },
      "dependsOn": [
        {
          "target": "build",
          "projects": ["arbetsformedlingen"]
        }
      ]
    },
    "lint": {
      "executor": "@nx/linter:eslint",
      "options": {
        "lintFilePatterns": ["{projectRoot}/src/**/*.ts"]
      }
    },
    "publish": {
      "executor": "nx:run-commands",
      "options": {
        "commands": ["npm publish"],
        "cwd": "dist/libs/arbetsformedlingen-angular",
        "parallel": false
      }
    }
  }
}
