<?xml version="1.0" encoding="UTF-8"?>
<svg width="125.818773px" height="184.91365px" viewBox="0 0 125.818773 184.91365" version="1.1" xmlns="http://www.w3.org/2000/svg" xmlns:xlink="http://www.w3.org/1999/xlink">
    <title>armbrott</title>
    <defs>
        <polygon id="path-1" points="0 184.91365 125.819624 184.91365 125.819624 0 0 0"></polygon>
    </defs>
    <g id="Forts-matris-grovskisser---david" stroke="none" stroke-width="1" fill="none" fill-rule="evenodd">
        <g id="Matris-annas-linjer" transform="translate(-923.863233, -899.635836)">
            <g id="armbrott" transform="translate(923.862978, 899.635836)">
                <path d="M43.277104,89.550371 L42.7788421,89.5639458 C20.2983891,97.9693046 0.413829437,99.9206849 0.413829437,137.497483 L0.413829437,151.349738 L0.413829437,164.749782 C0.413829437,175.530734 9.2541513,184.351822 20.0594615,184.351822 L42.0620593,184.351822 L84.233209,184.351822 C84.233209,184.351822 87.3596747,183.15045 91.8108707,179.201874 C96.2620667,175.25245 96.0469468,164.743843 92.6084298,161.455343 C89.1690625,158.166843 85.7747598,157.103765 85.7747598,157.103765 L76.9709998,156.170496 L120.039191,113.139166 L115.046369,106.806512 L106.164384,98.0965685 L101.756552,95.796485 L40.2798803,157.139399 L28.5188596,157.139399 L28.5188596,95.796485" id="Fill-1" fill="#DDEBC1"></path>
                <mask id="mask-2" fill="white">
                    <use xlink:href="#path-1"></use>
                </mask>
                <g id="Clip-4"></g>
                <polygon id="Fill-3" fill="#333333" mask="url(#mask-2)" points="39.6398774 100.210168 41.765568 100.210168 41.765568 90.4685379 39.6398774 90.4685379"></polygon>
                <polygon id="Fill-5" fill="#333333" mask="url(#mask-2)" points="86.3446999 100.210168 88.4703905 100.210168 88.4703905 90.4685379 86.3446999 90.4685379"></polygon>
                <path d="M61.4316067,61.4493912 L64.3242464,61.4493912 L64.3242464,59.3283256 L61.4316067,59.3283256 C60.7598885,59.3283256 60.2097597,58.7972107 60.1800001,58.1337414 L60.687615,53.9756044 L58.5772294,53.7193797 L58.0611117,57.9504814 C58.0560101,57.9937511 58.0534592,58.0361724 58.0534592,58.0785937 C58.0534592,59.9374956 59.5695017,61.4493912 61.4316067,61.4493912" id="Fill-6" fill="#333333" mask="url(#mask-2)"></path>
                <path d="M75.4690719,155.396901 L43.1143611,155.396901 L101.773217,97.2737647 C108.09247,100.320463 114.545216,105.551011 118.798298,112.161948 L75.4690719,155.396901 Z M81.5255894,157.517966 C84.6478037,157.517966 87.5055821,158.657403 89.7163002,160.534122 L67.7417616,182.792584 L51.0202294,182.792584 L76.3491078,157.517966 L81.5255894,157.517966 Z M94.1896034,170.155275 C94.1896034,177.1234 88.5080577,182.792584 81.5255894,182.792584 L70.7253808,182.792584 L91.2170378,162.036685 C93.0689394,164.234108 94.1896034,167.065307 94.1896034,170.155275 L94.1896034,170.155275 Z M15.4659293,182.792584 L40.9733656,157.517966 L73.3433813,157.517966 L48.0136527,182.792584 L15.4659293,182.792584 Z M70.0791709,81.9359152 C67.1091561,83.6344646 58.5468745,83.6421004 55.7647707,81.9503385 C55.5156398,81.7984702 55.2061393,81.6186038 54.8473227,81.409891 C51.0083256,79.17853 40.8109628,73.2514243 40.8109628,63.9085546 L40.8109628,57.6760155 C40.8271181,57.5674169 40.8441236,57.4579699 40.8441236,57.3451292 L40.8441236,36.7207359 C40.8441236,36.4475426 40.8339203,36.1005363 40.8220164,35.6915949 C40.7641977,33.6401002 40.6587634,29.9536882 41.6654905,26.736456 C41.5319971,27.5993054 41.4648253,28.4757297 41.4648253,29.3589414 L41.4648253,34.9059522 C41.4648253,36.6324996 42.8728827,38.0357966 44.6023445,38.0357966 C46.3318064,38.0357966 47.7381632,36.6324996 47.7381632,34.9059522 L47.7381632,29.3589414 C47.7381632,23.3223888 52.6604123,18.4108493 58.7118281,18.4108493 L60.306096,18.4108493 C61.0840988,18.4108493 61.7949297,18.1274749 62.3442081,17.6582952 C62.6094943,17.8992483 62.9215457,18.0960832 63.2667578,18.2377704 C67.4118544,19.9286838 70.0902245,23.9086513 70.0902245,28.3773123 L70.0902245,31.5606075 C70.0902245,33.2863065 71.4982819,34.6904519 73.2277438,34.6904519 C74.9572056,34.6904519 76.3635625,33.2863065 76.3635625,31.5606075 L76.3635625,28.3773123 C76.3635625,27.1521848 76.2326199,25.9312995 75.9766868,24.740109 C78.0377563,27.4389529 79.1992337,30.779207 79.1992337,34.2441797 C79.1992337,35.9698787 80.6064408,37.3740241 82.3367529,37.3740241 C83.3171214,37.3740241 84.1937562,36.9218129 84.7693932,36.2167707 C84.8714263,37.0974371 84.9539031,38.1325171 85.0083208,39.3440698 L85.0083208,63.9085546 C85.0083208,72.4691753 74.5677791,79.367729 70.0791709,81.9359152 L70.0791709,81.9359152 Z M38.7184331,37.6489142 L38.6852723,37.6489142 L38.6852723,57.4155486 C38.6189508,57.4825743 38.4642005,57.4588184 38.441243,57.422336 C38.1861602,57.0278178 37.7015027,56.8479515 37.2474552,56.9786091 C36.7951083,57.1109636 36.4839072,57.525844 36.4839072,57.9958722 L36.4839072,60.3061368 C36.4839072,60.8694918 36.0239077,61.3284904 35.4593243,61.3284904 C34.8947409,61.3284904 34.4347415,60.8694918 34.4347415,60.3061368 L34.4355917,55.3886583 C34.4355917,54.8320907 34.0036514,54.3696984 33.4458702,54.3306708 C33.4203619,54.328974 33.3965542,54.3281255 33.3718962,54.3281255 C32.8455752,54.3281255 32.3932283,54.7150079 32.3192542,55.242729 C32.2469808,55.7679049 31.7886819,56.1649683 31.2547084,56.1649683 C30.6620659,56.1649683 30.1808095,55.6847591 30.1808095,55.0925576 L30.1808095,43.1059917 C30.1808095,42.5205776 29.7046549,42.0454589 29.1179643,42.0454589 C28.5304234,42.0454589 28.055119,42.5205776 28.055119,43.1059917 C28.055119,43.8738175 27.7014041,44.0307763 27.1699814,44.0307763 C26.8944919,44.0307763 26.3256572,43.9315105 26.3256572,43.6235317 L26.3256572,33.1200149 C26.3256572,16.0267716 40.2616844,2.12106559 57.3921994,2.12106559 L64.8261644,2.12106559 C81.9558292,2.12106559 95.8918564,16.0267716 95.8918564,33.1208634 L95.8995089,41.084192 C95.8995089,41.3497494 95.6342227,41.5915509 95.3442785,41.5915509 C94.757588,41.5915509 94.2814333,42.0666696 94.2814333,42.6520837 L94.2814333,52.7305389 C94.2814333,53.351587 93.7763692,53.8555521 93.153967,53.8555521 C93.0204736,53.8555521 92.8912316,53.8334931 92.7687919,53.7885265 C92.4431361,53.6688984 92.0792179,53.7155618 91.793525,53.9140935 C91.5086825,54.1126253 91.3394775,54.4375725 91.3394775,54.7837304 L91.3394775,60.1203315 C91.3394775,60.712533 90.8565206,61.1944391 90.2630278,61.1944391 C89.6703853,61.1944391 89.1874284,60.712533 89.1874284,60.1203315 L89.1874284,51.2822754 C89.1874284,50.6968613 88.712124,50.2217426 88.1245832,50.2217426 C87.616118,50.2217426 87.2011832,49.8094074 87.2011832,49.3012001 L87.2028837,43.3019782 C87.2122368,41.8486241 87.188429,40.5140496 87.1340114,39.2897705 L87.1340114,37.6489142 L87.0362296,37.6489142 C86.7301302,33.5705293 86.0039943,30.9870714 84.8374153,29.8221822 C84.5083584,29.4938412 84.0041446,29.4174829 83.5943114,29.6321347 C83.1827778,29.8467865 82.9583048,30.3023914 83.0399314,30.7579963 C83.2431474,31.9016749 83.3468811,33.0750484 83.3468811,34.2441797 C83.3468811,34.7998989 82.8936838,35.2529585 82.3367529,35.2529585 C81.7781214,35.2529585 81.3249242,34.7998989 81.3249242,34.2441797 C81.3249242,28.5987515 78.6065911,23.2417883 74.053362,19.9142606 C73.7192034,19.6690654 73.2566532,19.6495516 72.8944355,19.8506286 C72.3876709,20.1314577 72.2006101,20.7652321 72.4726985,21.2759847 C73.6273736,23.4437137 74.2378719,25.8990593 74.2378719,28.3773123 L74.2378719,31.5606075 C74.2378719,32.1171751 73.7846747,32.5693863 73.2277438,32.5693863 C72.6699626,32.5693863 72.2159151,32.1171751 72.2159151,31.5606075 L72.2159151,28.3773123 C72.2159151,23.044105 69.0197267,18.2929181 64.0711191,16.2736636 C63.6961473,16.1209469 63.448717,15.7713953 63.4410645,15.3904519 C63.4419147,15.3539696 63.442765,15.3174873 63.442765,15.2810049 C63.442765,14.7049235 62.9819153,14.2331985 62.4045778,14.2204721 L62.3790695,14.2204721 C61.8136358,14.2204721 61.3442833,14.6641991 61.3179247,15.2317962 C61.3162242,15.269127 61.3153739,15.3064577 61.3153739,15.3446369 C61.2822131,15.8715096 60.8417701,16.2897837 60.306096,16.2897837 L58.7118281,16.2897837 C51.4887316,16.2897837 45.6124727,22.152409 45.6124727,29.3589414 L45.6124727,34.9059522 C45.6124727,35.4625198 45.1592754,35.914731 44.6023445,35.914731 C44.0445633,35.914731 43.5905158,35.4625198 43.5905158,34.9059522 L43.5905158,29.3589414 C43.5905158,26.4191445 44.4424926,23.5684324 46.053766,21.1156321 C46.3182019,20.7126297 46.2765384,20.1815149 45.9534334,19.823479 C45.6277776,19.4654431 45.1031572,19.3721162 44.674618,19.5935555 C38.3307071,22.8837524 38.5883408,31.9008264 38.6971762,35.7518331 C38.70908,36.1370186 38.7184331,36.4636627 38.7184331,36.7207359 L38.7184331,37.6489142 Z M101.540241,94.826055 C91.8326378,90.524534 86.538818,89.3180719 81.4193049,88.1523343 C80.9244441,88.0394936 80.4287331,87.9275013 79.9304712,87.8112669 L79.9304712,77.4630121 C83.854496,73.8504132 87.1340114,69.2392166 87.1340114,63.9085546 L87.1340114,60.7863461 C87.4426616,62.2286707 88.7265787,63.3155047 90.2630278,63.3155047 C92.0282013,63.3155047 93.4651681,61.8816643 93.4651681,60.1203315 L93.4651681,55.9621945 C95.1138537,55.8052356 96.4071238,54.4163619 96.4071238,52.7305389 L96.4071238,43.4971162 C97.3585829,43.0932653 98.0251995,42.1633902 98.0251995,41.084192 L98.0251995,41.0833436 L98.017547,33.1200149 C98.017547,14.8576402 83.1275098,2.41137239e-14 64.8261644,2.41137239e-14 L57.3921994,2.41137239e-14 C39.0891535,2.41137239e-14 24.1999666,14.8576402 24.1999666,33.1200149 L24.1999666,43.6235317 C24.1999666,45.0879154 25.4481721,46.1518419 27.1699814,46.1518419 C27.4837334,46.1518419 27.7804798,46.1145112 28.055119,46.0432434 L28.055119,55.0925576 C28.055119,56.8538905 29.4903852,58.2860339 31.2547084,58.2860339 C31.6220277,58.2860339 31.9774432,58.2232504 32.3090509,58.1061676 L32.3090509,60.3061368 C32.3090509,62.0394716 33.72221,63.449556 35.4593243,63.449556 C37.1964386,63.449556 38.6095977,62.0394716 38.6095977,60.3061368 L38.6095977,59.6146694 C38.635106,59.6146694 38.6589137,59.607882 38.6852723,59.6061852 L38.6852723,63.9085546 C38.6852723,69.8305697 42.1322921,74.4349789 45.8888124,77.7616582 L45.8888124,87.8112669 C45.3905506,87.9275013 44.8948395,88.0394936 44.3991285,88.1523343 C39.2796154,89.3189203 33.9857956,90.524534 24.2790423,94.826055 C12.5851934,100.009939 0.000255082866,112.561557 0.000255082866,127.869712 L0.000255082866,171.205627 L2.12594563,171.205627 L2.12594563,127.869712 C2.12594563,113.508401 14.0570216,101.678794 25.1429229,96.7655574 C34.6600647,92.5471822 39.8518513,91.3636276 44.8727324,90.2207974 C45.6422323,90.0451732 46.4134329,89.869549 47.1973875,89.6837436 C47.6760931,89.5709029 48.014503,89.1432961 48.014503,88.6520573 L48.014503,79.4966898 C50.2558311,81.1935423 52.3985272,82.4407289 53.7776752,83.2424916 C54.1220371,83.4427202 54.4196338,83.6166476 54.6585614,83.7608801 C56.3829216,84.8103833 59.6029176,85.3347107 62.8467214,85.3347107 C66.0718191,85.3347107 69.319024,84.8154739 71.1369145,83.7753033 C73.0908493,82.6570775 75.4767244,81.1400914 77.8047807,79.282038 L77.8047807,88.6520573 C77.8047807,89.1432961 78.1431906,89.5709029 78.6218961,89.6837436 C79.4058508,89.869549 80.176201,90.0451732 80.945701,90.2207974 C85.7897246,91.3237515 90.8055041,92.4716722 99.7002436,96.3396474 L40.0975811,155.396901 L29.5813648,155.396901 L29.5813648,125.948875 L27.4556743,125.948875 L27.4556743,156.457434 C27.4556743,157.042848 27.9309787,157.517966 28.5185195,157.517966 L37.9565856,157.517966 L12.1379481,183.100563 C11.832699,183.403451 11.7400189,183.859904 11.9049724,184.257816 C12.0682255,184.654031 12.4559514,184.91365 12.8870415,184.91365 L81.5255894,184.91365 C89.6805886,184.91365 96.315294,178.292531 96.315294,170.155275 C96.315294,162.017171 89.6805886,155.396901 81.5255894,155.396901 L78.4747983,155.396901 L98.3312989,135.583603 L98.3312989,183.853117 L100.456989,183.853117 L100.456989,133.462537 L119.925764,114.036122 C122.258922,118.222257 123.693338,122.893692 123.693338,127.869712 L123.693338,183.853117 L125.819029,183.853117 L125.819029,127.869712 C125.819029,112.561557 113.23409,100.010788 101.540241,94.826055 L101.540241,94.826055 Z" id="Fill-7" fill="#333333" mask="url(#mask-2)"></path>
                <path d="M75.0518413,41.379614 C71.836947,41.379614 68.9536603,43.4107464 67.8797614,46.4336891 L70.1950636,46.4336891 C70.6992774,45.4792096 71.4755796,44.7113839 72.4015304,44.1989344 C72.3853751,44.3194109 72.3734712,44.4424327 72.3734712,44.5688483 C72.3734712,45.9797811 73.5196436,47.1234596 74.9345032,47.1234596 C76.3485126,47.1234596 77.4946849,45.9797811 77.4946849,44.5688483 C77.4946849,44.3898303 77.4708772,44.2167514 77.4360159,44.0470661 C78.3381589,44.4814603 79.1144611,45.1585045 79.6662904,46.0162634 C80.0327594,46.0162634 82.059818,46.0162634 82.059818,46.0162634 C80.8668804,43.1994883 78.1162368,41.379614 75.0518413,41.379614" id="Fill-8" fill="#333333" mask="url(#mask-2)"></path>
                <path d="M50.5741745,41.379614 C53.7890689,41.379614 56.6723556,43.4107464 57.7462544,46.4336891 L55.4309523,46.4336891 C54.9267385,45.4792096 54.1504363,44.7113839 53.2244855,44.1989344 C53.2406408,44.3194109 53.2525446,44.4424327 53.2525446,44.5688483 C53.2525446,45.9797811 52.1063723,47.1234596 50.6915126,47.1234596 C49.2775033,47.1234596 48.1313309,45.9797811 48.1313309,44.5688483 C48.1313309,44.3898303 48.1551387,44.2167514 48.19,44.0470661 C47.2878569,44.4814603 46.5115547,45.1585045 45.9597255,46.0162634 C45.5932564,46.0162634 43.5661979,46.0162634 43.5661979,46.0162634 C44.7591355,43.1994883 47.509779,41.379614 50.5741745,41.379614" id="Fill-9" fill="#333333" mask="url(#mask-2)"></path>
                <path d="M66.5535856,69.8159768 C66.4821624,70.7628205 65.6956569,71.5145261 64.7288928,71.5145261 L59.8882703,71.5145261 C58.9368112,71.5145261 58.160509,70.7874248 58.0678289,69.8617918 L60.5727427,69.8617918 C61.1016145,70.2308572 61.7316692,70.4310858 62.3855316,70.4310858 C63.0717045,70.4310858 63.7230161,70.2155855 64.2637917,69.8159768 L66.5535856,69.8159768 Z M63.1201702,68.0062836 C62.7383962,68.3880754 62.0717796,68.3999534 61.6730001,68.0283427 C61.4765863,67.8433858 61.2155515,67.7407262 60.9460139,67.7407262 L54.0145622,67.7407262 L54.0145622,69.8617918 L55.9421384,69.8617918 C56.0399201,71.9565562 57.7651306,73.6355917 59.8882703,73.6355917 L64.7288928,73.6355917 C66.8673375,73.6355917 68.6053021,71.9328002 68.6792761,69.8159768 L70.6009004,69.8159768 L70.6009004,67.6949112 L63.8726647,67.6949112 C63.590373,67.6949112 63.3199851,67.8069035 63.1201702,68.0062836 L63.1201702,68.0062836 Z" id="Fill-10" fill="#333333" mask="url(#mask-2)"></path>
            </g>
        </g>
    </g>
</svg>