{
  "name": "arbetsformedlingen-react",
  "$schema": "../../../../node_modules/nx/schemas/project-schema.json",
  "sourceRoot": "libs/arbetsformedlingen/package/react/src",
  "projectType": "library",
  "targets": {
    "build": {
      "executor": "@nx/js:tsc",
      "outputs": ["{options.outputPath}"],
      "options": {
        "main": "{projectRoot}/src/index.ts",
        "outputPath": "dist/libs/arbetsformedlingen-react",
        "tsConfig": "{projectRoot}/tsconfig.json"
      },
      "dependsOn": [
        {
          "target": "build",
          "projects": ["arbetsformedlingen"]
        }
      ]
    },
    "lint": {
      "executor": "@nx/linter:eslint",
      "outputs": ["{options.outputFile}"],
      "options": {
        "lintFilePatterns": [
          "{projectRoot}/**/*.{ts,tsx,js,jsx}"
        ]
      }
    },
    "publish": {
      "executor": "nx:run-commands",
      "options": {
        "commands": ["npm publish"],
        "cwd": "dist/libs/arbetsformedlingen-react",
        "parallel": false
      }
    }
  }
}
