{
  "name": "changelog-generator",
  "$schema": "../../../node_modules/nx/schemas/project-schema.json",
  "targets": {
    "build": {
      "executor": "@nx/js:tsc",
      "outputs": ["{options.outputPath}"],
      "options": {
        "main": "{projectRoot}/src/index.ts",
        "outputPath": "dist/tools/changelog-generator",
        "tsConfig": "{projectRoot}/tsconfig.json"
      }
    }
  }
}