<?xml version="1.0" encoding="UTF-8"?>
<svg width="127.320686px" height="207.580164px" viewBox="0 0 127.320686 207.580164" version="1.1" xmlns="http://www.w3.org/2000/svg" xmlns:xlink="http://www.w3.org/1999/xlink">
    <title>synskadad</title>
    <defs>
        <polygon id="path-1" points="0 207.580363 127.320771 207.580363 127.320771 0 0 0"></polygon>
    </defs>
    <g id="Forts-matris-grovskisser---david" stroke="none" stroke-width="1" fill="none" fill-rule="evenodd">
        <g id="Matris-annas-linjer" transform="translate(-654.335616, -1222.000199)">
            <g id="synskadad" transform="translate(654.335531, 1222.000000)">
                <path d="M49.5769079,79.4512107 L46.2926378,79.4512107 C42.2306934,79.4512107 38.9379148,76.1637677 38.9379148,72.1092547 L38.9379148,66.887572 C38.9379148,62.8322096 42.2306934,59.5447666 46.2926378,59.5447666 L54.0123742,59.5447666 C58.0530474,59.5447666 61.328809,62.8152202 61.328809,66.849346 L61.328809,67.7183522 C61.328809,74.1980977 56.0671701,79.4512107 49.5769079,79.4512107" id="Fill-1" fill="#DDEBC1"></path>
                <path d="M87.4415641,66.8878269 L87.4415641,72.112058 C87.4415641,75.5693946 84.6167514,78.38963 81.1538034,78.38963 L77.8695333,78.38963 C71.9731624,78.38963 67.1743844,73.5986278 67.1743844,67.720306 L67.1743844,66.8538481 C67.1743844,63.4050061 69.98218,60.6102549 73.4281111,60.6102549 L81.1538034,60.6102549 C84.6167514,60.6102549 87.4415641,63.4219955 87.4415641,66.8878269" id="Fill-3" fill="#DDEBC1"></path>
                <path d="M88.1223269,76.826608 C88.088293,76.8605867 88.0627676,76.9030601 88.0372422,76.9370389 L88.0372422,76.826608 L88.1223269,76.826608 Z" id="Fill-5" fill="#333333"></path>
                <path d="M39.4028177,76.826608 C39.4028177,76.826608 39.3517669,76.8605867 39.317733,76.826608 L39.4028177,76.826608 Z" id="Fill-7" fill="#333333"></path>
                <path d="M88.1223269,76.826608 C88.088293,76.8605867 88.0627676,76.9030601 88.0372422,76.9370389 L88.0372422,76.826608 L88.1223269,76.826608 Z" id="Fill-9" fill="#333333"></path>
                <path d="M63.4682643,92.5445779 C61.6950987,92.5445779 59.9151265,92.3976199 58.1793982,92.1088006 L58.5299473,90.0140113 C61.8924953,90.5746605 65.4167043,90.5534238 68.7775506,89.9494517 L69.1536251,92.0399936 C67.2885681,92.3746842 65.3758636,92.5445779 63.4682643,92.5445779" id="Fill-11" fill="#333333"></path>
                <polygon id="Fill-13" fill="#95C23E" points="47.8051037 66.4156923 46.3544093 64.8628639 53.0514274 58.6005824 54.5021218 60.1534107"></polygon>
                <polygon id="Fill-15" fill="#95C23E" points="44.4646777 73.9549798 43.0139833 72.4021514 56.9278871 59.4511552 58.3794324 61.0039835"></polygon>
                <polygon id="Fill-17" fill="#95C23E" points="77.4632538 65.1002904 76.0108577 63.547462 81.0257509 58.872837 82.4781471 60.4256654"></polygon>
                <polygon id="Fill-19" fill="#95C23E" points="74.8840808 71.9673935 73.4316847 70.4145651 84.5718267 60.0289636 86.0242228 61.581792"></polygon>
                <path d="M39.3176479,76.826608 C39.3516818,76.8605867 39.4027326,76.826608 39.4027326,76.826608 L39.3176479,76.826608 Z" id="Fill-21" fill="#333333"></path>
                <path d="M88.0373272,76.826608 L88.0373272,76.9370389 C88.0628527,76.9030601 88.0883781,76.8605867 88.122412,76.826608 L88.0373272,76.826608 Z" id="Fill-23" fill="#333333"></path>
                <mask id="mask-2" fill="white">
                    <use xlink:href="#path-1"></use>
                </mask>
                <g id="Clip-26"></g>
                <polygon id="Fill-25" fill="#DDEBC1" mask="url(#mask-2)" points="57.2875402 169.045075 89.5176312 169.045075 89.5176312 162.529652 57.2875402 162.529652"></polygon>
                <path d="M57.2875402,169.045075 L89.5176312,169.045075 L89.5176312,162.529652 L57.2875402,162.529652 L57.2875402,169.045075 Z M90.5811901,160.405981 L56.2239812,160.405981 C55.6368967,160.405981 55.1604223,160.881683 55.1604223,161.467816 L55.1604223,170.106911 C55.1604223,170.693044 55.6368967,171.168746 56.2239812,171.168746 L90.5811901,171.168746 C91.1682747,171.168746 91.6447491,170.693044 91.6447491,170.106911 L91.6447491,161.467816 C91.6447491,160.881683 91.1682747,160.405981 90.5811901,160.405981 L90.5811901,160.405981 Z" id="Fill-27" fill="#333333" mask="url(#mask-2)"></path>
                <polygon id="Fill-28" fill="#333333" mask="url(#mask-2)" points="26.6885233 207.580363 28.8156412 207.580363 28.8156412 181.90263 26.6885233 181.90263"></polygon>
                <polygon id="Fill-29" fill="#333333" mask="url(#mask-2)" points="98.5051299 207.580363 100.632248 207.580363 100.632248 181.90263 98.5051299 181.90263"></polygon>
                <path d="M63.6519622,132.832064 C50.5148818,132.832064 40.1855971,125.798465 39.8367498,116.726142 C44.4313245,115.647317 48.2516283,114.780859 48.3452215,114.755375 C48.8216959,114.653439 49.1535263,114.237199 49.1705433,113.753002 L49.4853567,103.041205 C53.5694231,105.751009 58.4617944,107.331021 63.7200299,107.331021 C68.9187062,107.331021 73.7770435,105.784988 77.8355845,103.117657 L78.150398,113.753002 C78.1589065,114.237199 78.4992453,114.653439 78.9757198,114.755375 C79.0693129,114.780859 82.8725998,115.638822 87.4501576,116.717647 C86.6758867,125.696529 76.3040596,132.832064 63.6519622,132.832064 L63.6519622,132.832064 Z M39.9984107,81.5241686 L39.9984107,77.6930658 C41.5469526,79.4174868 43.7931891,80.5133011 46.2946798,80.5133011 L49.5789499,80.5133011 C53.5268808,80.5133011 57.066405,78.7209227 59.4147432,75.9006873 L59.0914213,78.8228589 L59.0914213,78.9417845 C59.0914213,80.8276045 60.6229462,82.3651424 62.5203354,82.3651424 L64.2305382,82.3651424 L64.2305382,80.2414712 L62.5203354,80.2414712 C61.8141323,80.2414712 61.2440647,79.680822 61.2185392,78.9842579 L62.2225389,69.8269878 C62.3076236,69.2748333 62.3671829,68.7141841 62.3841999,68.1450402 L62.3841999,68.1365455 C62.7415557,67.7967581 63.2095216,67.6013804 63.7200299,67.6013804 C64.2220298,67.6013804 64.6985042,67.7882634 65.05586,68.1365455 C65.2770803,75.0002508 70.9437224,80.5133011 77.8696184,80.5133011 L81.1538885,80.5133011 C83.6468707,80.5133011 85.8931073,79.4174868 87.4416491,77.6930658 L87.4416491,81.5241686 C87.4416491,94.580499 76.797551,105.20735 63.7200299,105.20735 C50.6425089,105.20735 39.9984107,94.580499 39.9984107,81.5241686 L39.9984107,81.5241686 Z M37.8712928,61.5616596 L36.8843101,61.5616596 C35.3017343,61.5616596 33.8297687,62.0713406 32.6385827,62.9293038 C30.0264818,58.0108814 28.6566179,52.497831 28.6566179,46.8913391 C28.6566179,27.9736763 44.0739687,12.5898023 63.0223353,12.5898023 C67.3871813,12.5898023 71.6073832,13.379808 75.606365,14.9598193 C73.4707385,15.427027 71.2670444,15.6648782 69.0037909,15.6648782 C67.8211133,15.6648782 66.6384357,15.5969207 65.4727751,15.452511 L65.217521,17.5591928 C66.4682663,17.7120972 67.7360286,17.7885493 69.0037909,17.7885493 C80.42216,17.7885493 90.7429362,12.0716265 96.2734428,2.77844147 C97.8390016,4.35845282 99.2088656,6.09986319 100.349001,7.9771885 C95.9331039,16.1490752 87.5097169,21.6536309 77.7930422,22.7324558 L78.0227709,24.8391376 C87.9691744,23.7433233 96.656324,18.2897357 101.557204,10.1518278 C102.382526,11.7828072 103.037678,13.4902389 103.531169,15.2486386 C100.595746,20.6767421 95.7374091,25.0769888 89.8325297,27.6593729 L90.6833769,29.6131504 C96.2734428,27.1666812 100.995645,23.1911688 104.203338,18.2727464 C104.458593,19.8017896 104.58622,21.3563169 104.58622,22.9193389 L104.58622,24.4908556 C101.599746,28.8061554 97.3795441,32.2040293 92.3595458,34.3277004 L93.1848676,36.2814779 C97.6688322,34.3871632 101.548695,31.5499385 104.58622,27.982171 L104.58622,30.0463793 C104.58622,43.9946516 93.2189015,55.3435504 79.2394824,55.3435504 L70.4161972,55.3435504 C62.7330472,55.3435504 55.3051514,52.2175064 49.9363057,46.7384348 C50.1149836,46.0503653 50.2085768,45.3283171 50.2085768,44.5892795 L48.0814589,44.5892795 C48.0814589,48.0890896 45.2311208,50.9263143 41.734139,50.9263143 L32.8172606,50.9263143 L32.8172606,53.0499855 L37.8712928,53.0499855 L37.8712928,61.5616596 Z M37.8712928,76.6737036 C34.3913279,75.9601501 31.7537016,72.8765796 31.7537016,69.1983811 L31.7537016,68.7991309 C31.7537016,65.9788956 34.0594975,63.6853307 36.8843101,63.6853307 L37.8712928,63.6853307 L37.8712928,76.6737036 Z M94.7929687,62.9293038 C93.6017827,62.062846 92.1383255,61.5616596 90.5557498,61.5616596 L89.5687671,61.5616596 L89.5687671,55.4539813 C92.9976812,54.060853 96.0862564,51.9966446 98.6643234,49.4142605 C98.2814421,54.1797786 96.9456121,58.8518551 94.7929687,62.9293038 L94.7929687,62.9293038 Z M95.6863583,69.1983811 C95.6863583,72.8765796 93.0572405,75.9601501 89.5687671,76.6737036 L89.5687671,63.6853307 L90.5557498,63.6853307 C93.3890709,63.6853307 95.6863583,65.9788956 95.6863583,68.7991309 L95.6863583,69.1983811 Z M88.0372422,76.9370389 L88.0372422,76.826608 L88.1223269,76.826608 C88.088293,76.8605867 88.0627676,76.9030601 88.0372422,76.9370389 L88.0372422,76.9370389 Z M60.2655904,66.8538481 L60.2655904,67.720306 C60.2655904,73.5986278 55.4668123,78.38963 49.5789499,78.38963 L46.2946798,78.38963 C42.8232233,78.38963 39.9984107,75.5693946 39.9984107,72.112058 L39.9984107,66.8878269 C39.9984107,63.4219955 42.8232233,60.6102549 46.2946798,60.6102549 L54.0118637,60.6102549 C57.4577947,60.6102549 60.2655904,63.4050061 60.2655904,66.8538481 L60.2655904,66.8538481 Z M87.4416491,61.306819 C85.8931073,59.5739033 83.6468707,58.4865837 81.1538885,58.4865837 L73.4281962,58.4865837 C69.1909773,58.4865837 65.6769784,61.6381117 65.1239278,65.7240551 C64.6814872,65.5626561 64.2050128,65.4777092 63.7200299,65.4777092 C63.235047,65.4777092 62.7585726,65.5626561 62.3161321,65.7240551 C61.7630814,61.6381117 58.2490826,58.4865837 54.0118637,58.4865837 L46.2946798,58.4865837 C43.7931891,58.4865837 41.5469526,59.5739033 39.9984107,61.306819 L39.9984107,53.0499855 L41.734139,53.0499855 C44.8482396,53.0499855 47.579459,51.3680379 49.0429162,48.8536113 C54.7606092,54.3496723 62.4522676,57.4672215 70.4161972,57.4672215 L79.2394824,57.4672215 C82.0983289,57.4672215 84.8465653,57.0339926 87.4416491,56.2185029 L87.4416491,61.306819 Z M87.4416491,72.112058 C87.4416491,75.5693946 84.6168365,78.38963 81.1538885,78.38963 L77.8696184,78.38963 C71.9732475,78.38963 67.1744695,73.5986278 67.1744695,67.720306 L67.1744695,66.8538481 C67.1744695,63.4050061 69.9822651,60.6102549 73.4281962,60.6102549 L81.1538885,60.6102549 C84.6168365,60.6102549 87.4416491,63.4219955 87.4416491,66.8878269 L87.4416491,72.112058 Z M103.267407,118.501531 C99.6257807,117.303781 84.0382604,113.727518 80.2519905,112.869555 L79.9201601,101.605603 C85.7995141,96.8825585 89.5687671,89.6365925 89.5687671,81.5241686 L89.5687671,78.8313536 C94.2399181,78.092316 97.8134762,74.0573408 97.8134762,69.1983811 L97.8134762,68.7991309 C97.8134762,67.1851408 97.2774425,65.6815816 96.367036,64.4838311 C99.2514079,59.2680947 100.851001,53.0669749 100.902051,46.8828444 L100.902051,46.840371 C104.543677,42.1937785 106.713338,36.3919088 106.713338,30.0463793 L106.713338,22.9193389 C106.713338,14.3397073 103.08022,6.08287382 96.7414088,0.28100417 C96.5031715,0.051647683 96.1713411,-0.0417938487 95.8395107,0.0176689442 C95.5161888,0.0686370523 95.2354093,0.272509485 95.0822568,0.561328765 C91.6533427,7.00029976 85.8250395,11.7488285 78.8821266,14.0763721 C73.9131791,11.680871 68.5783673,10.4661311 63.0223353,10.4661311 C42.8997996,10.4661311 26.5295,26.8014098 26.5295,46.8913391 C26.5295,53.0584802 28.0950588,59.1236851 31.0645154,64.4838311 C30.1626174,65.6815816 29.6265837,67.1851408 29.6265837,68.7991309 L29.6265837,69.1983811 C29.6265837,74.0573408 33.2086503,78.092316 37.8712928,78.8313536 L37.8712928,81.5241686 C37.8712928,89.5771297 41.5894949,96.7806223 47.4007811,101.512162 L47.0689507,112.869555 C43.2826808,113.727518 27.6951606,117.303781 24.0620432,118.501531 C9.67421745,122.969735 8.50847174e-05,136.094023 8.50847174e-05,151.155099 L8.50847174e-05,207.576795 L2.12720302,207.576795 L2.12720302,151.155099 C2.12720302,137.028438 11.1972339,124.71964 24.7171955,120.523266 C26.674144,119.87767 32.4003455,118.484542 37.7266488,117.218834 C38.4073265,127.242562 49.544916,134.955735 63.6519622,134.955735 C77.2570085,134.955735 88.4626657,127.132131 89.5432417,117.210339 C94.8865619,118.467552 100.638289,119.87767 102.620763,120.523266 C116.123707,124.71964 125.193738,137.028438 125.193738,151.155099 L125.193738,207.576795 L127.320856,207.576795 L127.320856,151.155099 C127.320856,136.094023 117.646724,122.969735 103.267407,118.501531 L103.267407,118.501531 Z" id="Fill-30" fill="#333333" mask="url(#mask-2)"></path>
            </g>
        </g>
    </g>
</svg>