{
  "name": "arbetsformedlingen-playground-react",
  "$schema": "../../../../node_modules/nx/schemas/project-schema.json",
  "sourceRoot": "apps/arbetsformedlingen/playground/react/src",
  "projectType": "application",
  "targets": {
    "build": {
      "executor": "@nx/webpack:webpack",
      "outputs": ["{options.outputPath}"],
      "defaultConfiguration": "production",
      "options": {
        "compiler": "babel",
        "outputPath": "dist/apps/arbetsformedlingen/playground/react",
        "index": "{projectRoot}/src/index.html",
        "baseHref": "/",
        "main": "{projectRoot}/src/main.tsx",
        "polyfills": "{projectRoot}/src/polyfills.ts",
        "tsConfig": "{projectRoot}/tsconfig.json",
        "assets": [
          "{projectRoot}/src/favicon.ico",
          "{projectRoot}/src/assets"
        ],
        "styles": ["{projectRoot}/src/styles.scss"],
        "scripts": [],
        "webpackConfig": "@nx/react/plugins/webpack"
      },
      "configurations": {
        "production": {
          "fileReplacements": [
            {
              "replace": "{projectRoot}/src/environments/environment.ts",
              "with": "{projectRoot}/src/environments/environment.prod.ts"
            }
          ],
          "optimization": true,
          "outputHashing": "all",
          "sourceMap": false,
          "namedChunks": false,
          "extractLicenses": true,
          "vendorChunk": false
        },
        "development": {
          "extractLicenses": false,
          "optimization": false,
          "sourceMap": true,
          "vendorChunk": true
        }
      },
      "dependsOn": [
        {
          "projects": ["arbetsformedlingen-react"],
          "target": "build"
        },
        {
          "projects": ["arbetsformedlingen"],
          "target": "build"
        }
      ]
    },
    "serve": {
      "executor": "@nx/webpack:dev-server",
      "options": {
        "buildTarget": "arbetsformedlingen-playground-react:build",
        "hmr": true,
        "port": 4201
      },
      "configurations": {
        "production": {
          "buildTarget": "arbetsformedlingen-playground-react:build:production",
          "hmr": false
        },
        "development": {
          "buildTarget": "arbetsformedlingen-playground-react:build:development"
        }
      },
      "dependsOn": [
        {
          "projects": ["arbetsformedlingen-react"],
          "target": "build"
        },
        {
          "projects": ["arbetsformedlingen"],
          "target": "build"
        }
      ],
      "defaultConfiguration": "development"
    },
    "lint": {
      "executor": "@nx/linter:eslint",
      "outputs": ["{options.outputFile}"],
      "options": {
        "lintFilePatterns": [
          "{projectRoot}/**/*.{ts,tsx,js,jsx}"
        ]
      }
    }
  }
}
