<svg width="130" height="123" viewBox="0 0 130 123" fill="none" xmlns="http://www.w3.org/2000/svg">
<path d="M81.7867 8.37976C81.8311 8.48825 82.4081 8.48825 82.561 8.88278C82.8519 9.62253 82.6053 10.5004 83.2169 11.2746C83.3303 11.4177 86.1019 13.1536 86.3337 13.2177C91.0483 14.4605 92.9667 14.1251 97.3312 14.6282C99.4124 14.8698 101.651 18.3713 105.015 18.2184C105.651 18.1888 111.199 16.3098 111.924 15.935C112.905 15.432 113.448 14.4309 114.311 13.9772C116.905 12.6111 120.934 9.34636 119.706 15.5948C118.764 20.3834 107.249 20.8766 107.18 27.6674C108.866 30.5771 111.303 31.4648 114.36 32.3426C115.233 37.0228 116.343 38.6354 121.141 39.3111C122.843 39.5478 129.579 38.4776 129.964 40.253C131 45.0466 109.36 45.4707 110.548 51.2062C110.721 52.0347 111.84 54.5647 112.841 54.4907L112.871 55.1762C109.35 57.9231 104.571 60.5172 109.724 64.6154C110.104 64.9162 110.76 64.7288 111.179 65.0641C112.989 66.5091 115.391 67.9985 115.317 70.6369C115.248 73.0682 110.696 74.6809 109.088 73.6699C108.403 73.2359 107.214 68.2845 105.138 66.7804C102.608 64.9409 99.2645 65.7546 97.8096 68.5903C96.4781 71.1843 98.1598 73.6699 94.4955 74.9521C91.0631 76.1505 87.2707 72.2052 84.1193 74.2222C82.847 75.0359 81.9198 77.6546 80.6425 78.0147C79.4343 78.3549 78.1471 77.6004 76.8896 77.5708C70.9272 77.4278 71.7557 83.257 68.2098 86.3048C67.3123 87.079 64.2349 88.8741 63.2289 89.0862C60.6299 89.6386 57.449 86.1765 54.5936 85.9201L50.594 87.301C50.5052 88.9481 50.885 91.123 50.7715 92.637C50.5447 95.6601 47.6054 99.1517 44.5133 99.3292C41.1597 99.5265 41.3324 97.3763 42.2398 94.6195C42.7329 93.1252 44.9621 91.1131 45.179 90.2797C45.3467 89.6386 44.6366 85.6883 44.2519 85.1212C43.4283 83.9129 39.1674 83.1978 37.8062 83.4C36.4451 83.6022 34.7733 85.2247 32.7957 84.2532C31.7058 83.4197 31.9721 81.1315 31.6417 80.589C31.5332 80.4114 29.743 79.869 29.1512 79.4547C26.2662 77.4376 27.9676 76.7423 27.7999 73.808C26.6755 73.8721 25.842 72.7822 25.0185 72.575C15.4609 70.1536 13.2663 82.9364 4.63595 83.3112C-0.172413 83.5233 -1.80479 80.3128 2.46602 77.3785C7.96974 73.591 4.90226 75.5636 10.7315 69.4237C15.7124 64.1764 6.33737 66.7804 5.76036 62.3369C5.59762 61.0991 7.94508 54.6337 5.42501 50.7278C3.76304 48.1584 3.07754 45.8159 2.08628 43.8137C-0.330226 38.9264 13.1677 41.5106 14.9875 39.7204C16.4867 38.2508 13.6609 35.494 14.6916 34.1279C15.4609 33.112 20.7427 32.8802 21.5121 31.2626C22.8683 28.417 17.6456 26.8143 17.8774 24.0328C18.7306 23.1895 24.9248 26.3704 25.8519 26.3014C27.6174 26.1682 29.4027 22.3561 29.9501 20.8618C30.5074 20.5313 33.205 21.1823 34.4034 20.9801C40.0994 20.0332 40.0403 16.5022 40.489 11.7234C40.5433 11.1316 40.0008 10.3869 40.0649 9.87405C40.1241 9.39568 42.2694 8.19729 43.2754 9.03073C45.0804 10.525 44.5872 13.3262 44.9374 15.0079C45.0114 15.3531 45.687 15.358 45.8596 15.7181C46.1013 16.2359 46.0618 16.9904 46.3725 17.4096C49.0701 21.0245 53.0845 15.9942 56.6994 14.2188C58.1937 13.484 60.5855 11.2056 61.705 10.9787C63.0957 10.6976 64.4569 7.51178 65.9364 7.48219C72.2834 7.3589 73.0281 -0.482419 79.3258 0.400346C83.7199 1.0168 80.9088 6.34792 81.7818 8.36989L81.7867 8.37976Z" fill="#AACE65"/>
<path d="M50.0742 56H46.4414V41.8906H41.7891V38.8672H54.7266V41.8906H50.0742V56ZM62.5078 45.1953C61.75 45.1953 61.1562 45.4375 60.7266 45.9219C60.2969 46.3984 60.0508 47.0781 59.9883 47.9609H65.0039C64.9883 47.0781 64.7578 46.3984 64.3125 45.9219C63.8672 45.4375 63.2656 45.1953 62.5078 45.1953ZM63.0117 56.2344C60.9023 56.2344 59.2539 55.6523 58.0664 54.4883C56.8789 53.3242 56.2852 51.6758 56.2852 49.543C56.2852 47.3477 56.832 45.6523 57.9258 44.457C59.0273 43.2539 60.5469 42.6523 62.4844 42.6523C64.3359 42.6523 65.7773 43.1797 66.8086 44.2344C67.8398 45.2891 68.3555 46.7461 68.3555 48.6055V50.3398H59.9062C59.9453 51.3555 60.2461 52.1484 60.8086 52.7188C61.3711 53.2891 62.1602 53.5742 63.1758 53.5742C63.9648 53.5742 64.7109 53.4922 65.4141 53.3281C66.1172 53.1641 66.8516 52.9023 67.6172 52.543V55.3086C66.9922 55.6211 66.3242 55.8516 65.6133 56C64.9023 56.1562 64.0352 56.2344 63.0117 56.2344ZM73.9453 49.3086L69.7266 42.8984H73.7812L76.3242 47.0703L78.8906 42.8984H82.9453L78.6797 49.3086L83.1445 56H79.0781L76.3242 51.5117L73.5586 56H69.5039L73.9453 49.3086ZM90.6562 53.3867C91.2812 53.3867 92.0312 53.25 92.9062 52.9766V55.6367C92.0156 56.0352 90.9219 56.2344 89.625 56.2344C88.1953 56.2344 87.1523 55.875 86.4961 55.1562C85.8477 54.4297 85.5234 53.3438 85.5234 51.8984V45.582H83.8125V44.0703L85.7812 42.875L86.8125 40.1094H89.0977V42.8984H92.7656V45.582H89.0977V51.8984C89.0977 52.4062 89.2383 52.7812 89.5195 53.0234C89.8086 53.2656 90.1875 53.3867 90.6562 53.3867Z" fill="#333333"/>
<path d="M33 48H24V123" stroke="#333333" stroke-width="2"/>
</svg>
