<svg viewBox="0 0 61 51">
	<defs>
		<clipPath id="a"><path d="M1366 0v6021H0V0h1366Z"/></clipPath>
		<clipPath id="b"><path d="M7.144 0 54 8.13 46.856 48 0 39.87 7.144 0Z"/></clipPath>
		<clipPath id="c"><path d="M.192 10.172C1.392 3.478 7.878-.99 14.68.19c4.897.85 7.57 4.402 9.878 8.815 3.703-3.37 7.448-5.809 12.346-4.959 6.802 1.18 11.344 7.564 10.144 14.258-.5 2.793-1.922 5.2-3.903 6.97L18.648 41.986 1.438 18.035a12.08 12.08 0 0 1-1.246-7.863Z"/></clipPath>
		<clipPath id="d"><path d="m12.43 0 .431.008c.577.02 1.16.08 1.744.181l.345.066c4.654.954 7.24 4.442 9.483 8.752l.268-.244c3.581-3.228 7.228-5.525 11.95-4.727l.13.022.304.058c6.54 1.34 10.866 7.576 9.736 14.125l-.024.136-.075.375a12.226 12.226 0 0 1-3.796 6.528L18.553 42 1.43 18.04l-.164-.32A12.137 12.137 0 0 1 .19 10.176C1.256 4.202 6.505 0 12.43 0Z"/></clipPath>
		<clipPath id="e"><path d="m8.855 0 54.099 9.438-8.855 49.687L0 49.687 8.855 0Z"/></clipPath>
		<clipPath id="f"><path d="M7.144 0 54 8.13 46.856 48 0 39.87 7.144 0Z"/></clipPath>
		<clipPath id="g"><path d="M.192 10.172C1.392 3.478 7.878-.99 14.68.19c4.897.85 7.57 4.402 9.878 8.815 3.703-3.37 7.448-5.809 12.346-4.959 6.802 1.18 11.344 7.564 10.144 14.258-.5 2.793-1.922 5.2-3.903 6.97L18.648 41.986 1.438 18.035a12.081 12.081 0 0 1-1.246-7.863Z"/></clipPath>
		<clipPath id="h"><path d="m12.43 0 .418.007c.558.019 1.122.075 1.688.17l.135.024.341.066c4.616.973 7.189 4.45 9.42 8.74l.264-.239c3.6-3.246 7.263-5.551 12.02-4.721l.305.057c6.57 1.31 10.928 7.557 9.802 14.123l-.028.158-.075.375a12.223 12.223 0 0 1-3.794 6.52L18.553 42 1.43 18.04l-.164-.32A12.137 12.137 0 0 1 .19 10.176C1.256 4.202 6.505 0 12.431 0Z"/></clipPath>
		<clipPath id="i"><path d="m8.855 0 54.099 9.438-8.855 49.687L0 49.687 8.855 0Z"/></clipPath>
		<clipPath id="j"><path d="m12.43 0 .416.007c.555.018 1.114.074 1.676.168l.163.028.35.07c4.6.979 7.17 4.451 9.398 8.735l.263-.239c3.589-3.237 7.241-5.539 11.978-4.73l.092.017.303.058c6.549 1.333 10.883 7.573 9.752 14.128l-.024.134-.075.375a12.224 12.224 0 0 1-3.796 6.529L18.553 42 1.43 18.04l-.163-.317a12.14 12.14 0 0 1-1.086-7.49l.02-.111C1.288 4.177 6.523 0 12.431 0Z"/></clipPath>
		<clipPath id="k"><path d="m8.855 0 54.099 9.438-8.855 49.687L0 49.687 8.855 0Z"/></clipPath>
		<clipPath id="l"><path d="M16.025.21c4.884.871 7.673 4.196 9.795 7.958 3.266-2.802 7.016-4.961 11.896-4.093 3.591.64 6.72 2.655 8.812 5.673a13.819 13.819 0 0 1 2.261 10.308 13.705 13.705 0 0 1-4.26 7.812 1.349 1.349 0 0 1-.15.119L20.47 44.74a1.438 1.438 0 0 1-2.002-.357L1.67 20.377a1.428 1.428 0 0 1-.098-.163A13.788 13.788 0 0 1 .212 11.4C1.519 3.91 8.614-1.11 16.025.21ZM3.056 11.908a10.87 10.87 0 0 0 1.03 6.865L20 41.516l22.653-15.872a10.798 10.798 0 0 0 3.29-6.095c.5-2.86-.134-5.747-1.783-8.126a10.68 10.68 0 0 0-6.946-4.472c-4.11-.733-7.296 1.311-10.819 4.604a1.437 1.437 0 0 1-2.264-.403c-2.198-4.313-4.502-7.335-8.608-8.066C9.677 2.044 4.088 6.002 3.056 11.907Z"/></clipPath>
	</defs>
	<g clip-path="url(#a)" transform="translate(-669 -646)">
		<g clip-path="url(#b)" transform="translate(669 649)"><g clip-path="url(#c)" transform="translate(4.78 1.948)">
			<path fill="#FFF" d="M0 0h47.24v41.987H0V0z"/></g></g><g clip-path="url(#d)" transform="translate(673 650)">
			<g clip-path="url(#e)" transform="translate(-8.133 -8.56)"><path fill="#FFF" d="M8.133 8.559h47v42h-47v-42z"/>
			</g>
		</g>
		<g clip-path="url(#f)" transform="translate(676 648)">
			<g clip-path="url(#g)" transform="translate(4.78 1.948)">
				<path fill="#FFF" d="M0 0h47.24v41.987H0V0z"/>
			</g>
		</g>
		<g clip-path="url(#h)" transform="translate(681 650)">
			<g clip-path="url(#i)" transform="translate(-8.133 -8.56)">
				<path fill="#FFF" d="M8.133 8.559h47v42h-47v-42z"/>
			</g>
		</g>
		<g clip-path="url(#j)" transform="translate(680 646)">
			<g clip-path="url(#k)" transform="translate(-8.133 -8.56)">
				<path fill="#DDE7B6" d="M8.133 8.559h47v42h-47v-42z"/>
			</g>
		</g>
		<g clip-path="url(#l)" transform="translate(675 648)">
			<path fill="#333" d="M0 0h49v45H0V0z"/>
		</g>
	</g>
</svg>