<?xml version="1.0" encoding="UTF-8"?>
<svg width="292px" height="434px" viewBox="0 0 292 434" version="1.1" xmlns="http://www.w3.org/2000/svg" xmlns:xlink="http://www.w3.org/1999/xlink">
    <title>varning-bildIkoner</title>
    <defs>
        <path d="M0,74.99702 L0,75.576647 C0.113168654,105.993383 18.3979898,132.218397 44.5697956,144 L44.5697956,144 L57.1277853,113.430272 C42.9108177,106.591668 33.1049404,92.0835788 33.1049404,75.2893212 L33.1049404,75.2893212 C33.1049404,52.7696919 50.7468143,34.3634243 73,33.048691 L73,33.048691 L73,0 C32.6137138,1.34085393 0.154207836,34.4380544 0,74.99702 L0,74.99702 Z" id="path-1"></path>
        <path d="M0,32.7545756 C7.26393553,33.1798957 14.0327161,35.411285 19.8610765,39 L19.8610765,39 L39,12.2923661 C27.7349132,4.93124704 14.3707186,0.473399716 0,0 L0,0 L0,32.7545756 Z" id="path-3"></path>
        <path d="M0,26.5320197 C9.68154754,34.1699507 15.8859019,45.8830049 15.8859019,59.0270936 L15.8859019,59.0270936 C15.8859019,63.3559113 15.2135027,67.5295567 13.9638668,71.455665 L13.9638668,71.455665 L44.9493267,83 C47.5725602,75.476601 49,67.4125616 49,59.0270936 L49,59.0270936 C49,34.9741379 37.2762119,13.5615764 19.1464748,0 L19.1464748,0 L0,26.5320197 Z" id="path-5"></path>
        <path d="M64.3258529,0 C57.7429741,14.7196218 43.0668964,24.9711193 26.0053253,24.9711193 L26.0053253,24.9711193 C21.2552637,24.9711193 16.6959924,24.1658395 12.4382928,22.7029351 L12.4382928,22.7029351 L0,53.2986052 C8.01688283,56.3038251 16.6775289,57.9640168 25.7123699,58 L25.7123699,58 L26.2872025,58 C57.1792197,57.8833647 83.7126032,38.8010868 95,11.7330139 L95,11.7330139 L64.3270838,0 L64.3258529,0 Z" id="path-7"></path>
        <polygon id="path-9" points="0 0 99.5853406 0 99.5853406 63.3284511 0 63.3284511"></polygon>
        <polygon id="path-11" points="0 105 153 105 153 0 0 0"></polygon>
        <path d="M6.5,1.28834549 C5.72785156,0.590649105 4.76296162,0 3.74367837,0 L3.74367837,0 C1.39885392,0 0,1.555334 0,3.9002991 L0,3.9002991 C0,5.79566563 1.51237038,7.31825576 1.68737493,7.48953141 L1.68737493,7.48953141 L5.74440604,11.673191 C6.162998,12.1089363 6.837002,12.1089363 7.25559396,11.673191 L7.25559396,11.673191 L11.3138075,7.49834706 L11.3232672,7.48701265 C12.2172094,6.57648108 13,5.2440573 13,3.9002991 L13,3.9002991 C13,1.46088052 11.5148263,0 9.25750409,0 L9.25750409,0 C8.23822085,0 7.27096598,0.590649105 6.5,1.28834549 L6.5,1.28834549 Z M9.25750409,1.26441727 C10.8774786,1.26441727 11.8187193,2.19258015 11.8187193,3.92170856 L11.8187193,3.92170856 C11.8187193,4.91787795 11.1565399,5.93419741 10.4837184,6.63189379 L10.4837184,6.63189379 L6.5,10.7362124 L2.50918683,6.61929999 C1.83991268,5.96316314 1.18246316,4.88639345 1.18246316,3.92170856 L1.18246316,3.92170856 C1.18246316,2.19258015 2.12015645,1.26441727 3.74367837,1.26441727 L3.74367837,1.26441727 C4.92495907,1.26441727 6.0825905,2.59306292 6.5,3.03258645 L6.5,3.03258645 C6.97298526,2.53890959 8.09632527,1.26441727 9.25750409,1.26441727 L9.25750409,1.26441727 Z" id="path-13"></path>
        <path d="M1.31239347,0 C0.587452317,0 0,0.671237349 0,1.49918381 L0,1.49918381 L0,10.4995103 C0,11.3274567 0.587452317,12 1.31239347,12 L1.31239347,12 L12.6887428,12 C13.413684,12 14,11.3274567 14,10.4995103 L14,10.4995103 L14,1.49918381 C14,0.671237349 13.413684,0 12.6887428,0 L12.6887428,0 L1.31239347,0 Z M4.99277656,6.10251388 C2.90430972,4.23245184 1.92598003,3.34443356 1.31239347,2.77505713 L1.31239347,2.77505713 L1.31239347,1.49918381 L12.6887428,1.49918381 L12.6887428,2.77505713 C12.0751562,3.34443356 11.0968266,4.23245184 9.00835971,6.10251388 L9.00835971,6.10251388 C8.54816979,6.51779301 7.63574385,7.51158994 7.00056814,7.49983676 L7.00056814,7.49983676 C6.99602305,7.49983676 6.99375051,7.49983676 6.98920542,7.49983676 L6.98920542,7.49983676 C6.35516598,7.49983676 5.45069394,6.51387529 4.99277656,6.10251388 L4.99277656,6.10251388 Z M7.00056814,8.99902057 C7.00397695,8.99902057 7.00738576,8.99902057 7.01079458,8.99902057 L7.01079458,8.99902057 C8.1743365,8.99902057 9.20379839,7.83545544 9.81738495,7.28174992 L9.81738495,7.28174992 C11.1729567,6.07117205 12.061521,5.27064969 12.6887428,4.69996735 L12.6887428,4.69996735 L12.6887428,10.4995103 L1.31239347,10.4995103 L1.31239347,4.69996735 C1.93961529,5.27064969 2.82817953,6.07117205 4.18261505,7.28174992 L4.18261505,7.28174992 C4.77802126,7.81847862 5.81998214,8.99902057 6.99034169,8.99902057 L6.99034169,8.99902057 C6.99375051,8.99902057 6.99715932,8.99902057 7.00056814,8.99902057 L7.00056814,8.99902057 Z" id="path-15"></path>
        <polygon id="path-17" points="0 397 215 397 215 0 0 0"></polygon>
    </defs>
    <g id="Page-1" stroke="none" stroke-width="1" fill="none" fill-rule="evenodd">
        <g id="Knapp-Ladda-upp" transform="translate(-765.000000, -3071.000000)">
            <g id="varning-bild" transform="translate(765.000000, 3071.000000)">
                <g id="Group-7" transform="translate(33.000000, 73.000000)" fill="#343434">
                    <path d="M5.01838235,1.90025539 C5.01838235,2.39412124 4.87503593,2.80400483 4.58582822,3.13241308 C4.29787795,3.46082133 3.89172974,3.68143146 3.36864102,3.79549692 L3.36864102,3.83811479 C3.996096,3.91457625 4.46637287,4.11011704 4.77947164,4.42097676 C5.09257042,4.73183649 5.24849109,5.14297354 5.24849109,5.65814832 C5.24849109,6.40646789 4.98317446,6.984316 4.45379862,7.39043918 C3.92316536,7.79656237 3.16745306,7.99962396 2.18917657,7.99962396 C1.32406831,7.99962396 0.593504503,7.8592357 0,7.57845918 L0,6.46788775 C0.330702721,6.62958495 0.681524238,6.75618507 1.05246455,6.84392774 C1.42214744,6.93417733 1.77799866,6.97804867 2.11876078,6.97804867 C2.72483953,6.97804867 3.17625503,6.86649014 3.47552213,6.64211961 C3.77478923,6.41900255 3.92442278,6.07304577 3.92442278,5.60424925 C3.92442278,5.1893518 3.75844271,4.88475941 3.42773999,4.68921862 C3.09703727,4.49367783 2.57772083,4.39590743 1.86853324,4.39590743 L1.19078128,4.39590743 L1.19078128,3.38059947 L1.87985007,3.38059947 C3.12470061,3.38059947 3.74838331,2.95066042 3.74838331,2.09078232 C3.74838331,1.75861367 3.63898735,1.50165301 3.42145286,1.31990035 C3.20643322,1.13940116 2.8857899,1.04789809 2.46203775,1.04789809 C2.1652855,1.04789809 1.88110749,1.09051596 1.60698889,1.17324476 C1.33287028,1.25722702 1.00971211,1.41892421 0.636256946,1.66084327 L0.0213762215,0.787177036 C0.736850929,0.261974523 1.56800872,0 2.51484959,0 C3.30199751,0 3.91562081,0.167964527 4.35697691,0.506400514 C4.79833301,0.842329568 5.01838235,1.30736568 5.01838235,1.90025539" id="Fill-1"></path>
                    <path d="M8.82008048,1.04827413 C8.38626892,1.04827413 8.05430878,1.18866239 7.82168519,1.47194585 C7.59031903,1.75272237 7.47589337,2.15007129 7.47589337,2.66148567 C7.47589337,3.10521285 7.58277448,3.45367657 7.79905154,3.70687683 C8.01281376,3.96007709 8.3397442,4.08793068 8.77858546,4.08793068 C9.20233761,4.08793068 9.5569314,3.96133055 9.84488168,3.70938376 C10.1340894,3.45869044 10.2774358,3.16287232 10.2774358,2.82694326 C10.2774358,2.51106968 10.215822,2.21525156 10.0938518,1.94074237 C9.97062416,1.66497971 9.79961439,1.44687652 9.57956505,1.28768626 C9.35825829,1.12724253 9.1055159,1.04827413 8.82008048,1.04827413 M11.5436626,3.43236764 C11.5436626,4.96661078 11.2343361,6.10977234 10.6144257,6.86686618 C9.99577266,7.62145308 9.06150604,8 7.81665549,8 C7.34260634,8 7.00310165,7.97117027 6.79688398,7.91476427 L6.79688398,6.86686618 C7.11375503,6.95460884 7.4318835,6.99973364 7.75252683,6.99973364 C8.60003114,6.99973364 9.23125838,6.77160271 9.64746599,6.3178478 C10.0636736,5.86409288 10.2925249,5.14961691 10.3315051,4.17818028 L10.2673764,4.17818028 C10.0573865,4.49781427 9.80338666,4.72845213 9.50663441,4.87009385 C9.20988216,5.01173558 8.86157549,5.08318318 8.46297183,5.08318318 C7.77264562,5.08318318 7.22943811,4.86884039 6.83460673,4.43890134 C6.43851792,4.00896229 6.24110222,3.42108644 6.24110222,2.6715134 C6.24110222,1.85926704 6.46995354,1.21247826 6.92765616,0.732400545 C7.38410136,0.251069364 8.00778406,0.0104037729 8.79870425,0.0104037729 C9.35448601,0.0104037729 9.83859456,0.145778168 10.2522873,0.415273491 C10.6647226,0.684768814 10.9828511,1.0758504 11.2066727,1.58977171 C11.4317518,2.10243956 11.5436626,2.7166382 11.5436626,3.43236764" id="Fill-3"></path>
                    <path d="M18.5970612,5.551729 C18.5970612,6.08069191 18.6498731,6.4755339 18.7542393,6.73750842 C18.859863,7.00073641 19.0296153,7.13235041 19.2634964,7.13235041 C19.730001,7.13235041 19.963882,6.60589443 19.963882,5.551729 C19.963882,4.51135171 19.730001,3.99241653 19.2634964,3.99241653 C19.0296153,3.99241653 18.859863,4.11901666 18.7542393,4.37597731 C18.6498731,4.6316845 18.5970612,5.02276609 18.5970612,5.551729 L18.5970612,5.551729 Z M21,5.551729 C21,6.36773577 20.8516239,6.98068095 20.5573865,7.3880576 C20.2606342,7.79543425 19.8293375,7.99974931 19.2634964,7.99974931 C18.7240611,7.99974931 18.3040812,7.78916691 18.0035567,7.3692556 C17.705547,6.94809081 17.5559135,6.34266644 17.5559135,5.551729 C17.5559135,3.9297432 18.1255269,3.12000376 19.2634964,3.12000376 C19.812991,3.12000376 20.239258,3.32933269 20.5435548,3.74799054 C20.8478516,4.16664839 21,4.7670589 21,5.551729 L21,5.551729 Z M19.4131299,0.111683876 L15.0838163,7.89320464 L14.0476983,7.89320464 L18.3782693,0.111683876 L19.4131299,0.111683876 Z M13.5132928,2.44313179 C13.5132928,2.97084123 13.5648472,3.36568322 13.667956,3.62515081 C13.7723223,3.88336493 13.9408172,4.01247199 14.1759556,4.01247199 C14.6449751,4.01247199 14.881371,3.48977641 14.881371,2.44313179 C14.881371,1.39648716 14.6449751,0.87379158 14.1759556,0.87379158 C13.9408172,0.87379158 13.7723223,1.00289864 13.667956,1.26111276 C13.5648472,1.52058036 13.5132928,1.91542234 13.5132928,2.44313179 L13.5132928,2.44313179 Z M15.9162316,2.43310405 C15.9162316,3.24911082 15.7691129,3.86080253 15.4761329,4.27193958 C15.1818955,4.68182317 14.7480839,4.88613823 14.1759556,4.88613823 C13.635263,4.88613823 13.2165405,4.67430237 12.9185308,4.25063065 C12.6205212,3.82570547 12.472145,3.22028109 12.472145,2.43310405 C12.472145,0.811118249 13.0405011,0.000125346662 14.1759556,0.000125346662 C14.7355097,0.000125346662 15.165549,0.209454272 15.4660735,0.630619056 C15.766598,1.05053037 15.9162316,1.65219435 15.9162316,2.43310405 L15.9162316,2.43310405 Z" id="Fill-5"></path>
                </g>
                <g id="Group-14" transform="translate(171.000000, 172.000000)" fill="#343434">
                    <path d="M5.01838235,1.90031494 C5.01838235,2.39419627 4.87503593,2.8040927 4.58582822,3.13251124 C4.29787795,3.46092979 3.89172974,3.68154683 3.36864102,3.79561586 L3.36864102,3.83823506 C3.996096,3.91469892 4.46637287,4.11024584 4.77947164,4.42111531 C5.09257042,4.73198477 5.24849109,5.1431347 5.24849109,5.65832563 C5.24849109,6.40666865 4.98317446,6.98453487 4.45379862,7.39067078 C3.92316536,7.79680669 3.16745306,7.99987465 2.18917657,7.99987465 C1.32406831,7.99987465 0.593504503,7.85948199 0,7.57869667 L0,6.46809044 C0.330702721,6.6297927 0.681524238,6.7563968 1.05246455,6.84414221 C1.42214744,6.93439463 1.77799866,6.97826734 2.11876078,6.97826734 C2.72483953,6.97826734 3.17625503,6.86670532 3.47552213,6.64232776 C3.77478923,6.41920371 3.92442278,6.07323608 3.92442278,5.60442488 C3.92442278,5.18951442 3.75844271,4.88491249 3.42773999,4.68936557 C3.09703727,4.49381865 2.57772083,4.39604519 1.86853324,4.39604519 L1.19078128,4.39604519 L1.19078128,3.38070541 L1.87985007,3.38070541 C3.12470061,3.38070541 3.74838331,2.95075289 3.74838331,2.09084784 C3.74838331,1.75866878 3.63898735,1.50170007 3.42145286,1.31994171 C3.20643322,1.13943686 2.8857899,1.04793093 2.46203775,1.04793093 C2.1652855,1.04793093 1.88110749,1.09055013 1.60698889,1.17328152 C1.33287028,1.25726642 1.00971211,1.41896868 0.636256946,1.66089532 L0.0213762215,0.787201705 C0.736850929,0.261982733 1.56800872,0 2.51484959,0 C3.30199751,0 3.91562081,0.167969791 4.35697691,0.506416383 C4.79833301,0.842355964 5.01838235,1.30740665 5.01838235,1.90031494" id="Fill-8"></path>
                    <path d="M9.5569314,5.15767537 L9.5569314,3.20345968 C9.5569314,2.50901741 9.57579278,1.93992573 9.61100067,1.49493114 L9.56824823,1.49493114 C9.46891167,1.73059024 9.31173357,2.01388258 9.09797135,2.34731515 L7.16027975,5.15767537 L9.5569314,5.15767537 Z M11.8328703,6.19557826 L10.7804057,6.19557826 L10.7804057,7.89407875 L9.5569314,7.89407875 L9.5569314,6.19557826 L5.99087469,6.19557826 L5.99087469,5.23288573 L9.5569314,0.0910045283 L10.7804057,0.0910045283 L10.7804057,5.15767537 L11.8328703,5.15767537 L11.8328703,6.19557826 Z" id="Fill-10"></path>
                    <path d="M18.5970612,5.55190298 C18.5970612,6.08088247 18.6498731,6.47573683 18.7542393,6.73771956 C18.859863,7.0009558 19.0296153,7.13257392 19.2634964,7.13257392 C19.730001,7.13257392 19.963882,6.60610144 19.963882,5.55190298 C19.963882,4.51149308 19.730001,3.99254164 19.2634964,3.99254164 C19.0296153,3.99254164 18.859863,4.11914574 18.7542393,4.37611445 C18.6498731,4.63182965 18.5970612,5.02292349 18.5970612,5.55190298 L18.5970612,5.55190298 Z M21,5.55190298 C21,6.36793532 20.8516239,6.9808997 20.5573865,7.38828912 C20.2606342,7.79567854 19.8293375,8 19.2634964,8 C18.7240611,8 18.3040812,7.78941101 18.0035567,7.36948653 C17.705547,6.94830855 17.5559135,6.3428652 17.5559135,5.55190298 C17.5559135,3.92986634 18.1255269,3.12010153 19.2634964,3.12010153 C19.812991,3.12010153 20.239258,3.32943702 20.5435548,3.74810799 C20.8478516,4.16677896 21,4.76720829 21,5.55190298 L21,5.55190298 Z M19.4131299,0.111687376 L15.0838163,7.893452 L14.0476983,7.893452 L18.3782693,0.111687376 L19.4131299,0.111687376 Z M13.5132928,2.44320835 C13.5132928,2.97093433 13.5648472,3.36578869 13.667956,3.62526441 C13.7723223,3.88348663 13.9408172,4.01259773 14.1759556,4.01259773 C14.6449751,4.01259773 14.881371,3.48988577 14.881371,2.44320835 C14.881371,1.39653092 14.6449751,0.873818962 14.1759556,0.873818962 C13.9408172,0.873818962 13.7723223,1.00293007 13.667956,1.26115229 C13.5648472,1.52062801 13.5132928,1.91548236 13.5132928,2.44320835 L13.5132928,2.44320835 Z M15.9162316,2.4331803 C15.9162316,3.24921264 15.7691129,3.86092352 15.4761329,4.27207346 C15.1818955,4.68196988 14.7480839,4.88629135 14.1759556,4.88629135 C13.635263,4.88629135 13.2165405,4.67444885 12.9185308,4.25076386 C12.6205212,3.82582536 12.472145,3.22038201 12.472145,2.4331803 C12.472145,0.811143667 13.0405011,0.00012535059 14.1759556,0.00012535059 C14.7355097,0.00012535059 15.165549,0.209460836 15.4660735,0.630638818 C15.766598,1.05056329 15.9162316,1.65224613 15.9162316,2.4331803 L15.9162316,2.4331803 Z" id="Fill-12"></path>
                </g>
                <g id="Group-21" transform="translate(218.000000, 63.000000)" fill="#343434">
                    <path d="M5.2967303,7.89357568 L0,7.89357568 L0,6.94591037 L2.01522462,4.92898778 C2.60934456,4.32102789 3.00458537,3.89232216 3.19842959,3.63785647 C3.3922738,3.38339079 3.53451014,3.14522093 3.62387988,2.92209339 C3.71199089,2.69771232 3.75604639,2.45954246 3.75604639,2.20382325 C3.75604639,1.8528361 3.65031318,1.57580696 3.43884676,1.37273582 C3.22612162,1.17091821 2.93409656,1.07063616 2.55899541,1.07063616 C2.26067672,1.07063616 1.96991039,1.12579129 1.69173135,1.23484801 C1.41103485,1.34390473 1.08754158,1.54446882 0.721251536,1.83027264 L0.0415380466,1.00545284 C0.477058171,0.640676904 0.899991009,0.381197117 1.30907783,0.229520526 C1.71816465,0.0765904105 2.15494351,0.000125352554 2.61815566,0.000125352554 C3.34570084,0.000125352554 3.92723349,0.189407709 4.3665298,0.566718897 C4.80456739,0.944030085 5.02358618,1.45296145 5.02358618,2.09100595 C5.02358618,2.44199311 4.95939102,2.77668442 4.83477688,3.09257286 C4.70764528,3.4084613 4.51380106,3.73437794 4.25198549,4.06906926 C3.9889112,4.4050141 3.55339108,4.85753682 2.94416639,5.42914447 L1.58725687,6.73782513 L1.58725687,6.79172673 L5.2967303,6.79172673 L5.2967303,7.89357568 Z" id="Fill-15"></path>
                    <path d="M9.93590074,7.89357568 L8.67968951,7.89357568 L8.67968951,2.86819179 C8.67968951,2.26900658 8.69479426,1.7939204 8.72248629,1.44293325 C8.64066892,1.52817299 8.53997063,1.62093388 8.4203914,1.72372297 C8.30081218,1.82776559 7.90179519,2.15368223 7.22082297,2.70397994 L6.5901999,1.9117518 L8.88863848,0.111689126 L9.93590074,0.111689126 L9.93590074,7.89357568 Z" id="Fill-17"></path>
                    <path d="M18.5945695,5.55186462 C18.5945695,6.0808524 18.6474361,6.47571294 18.7519106,6.73769978 C18.8576438,7.00094014 19.0275722,7.13256033 19.2616957,7.13256033 C19.728684,7.13256033 19.9628076,6.6060796 19.9628076,5.55186462 C19.9628076,4.51143842 19.728684,3.99247885 19.2616957,3.99247885 C19.0275722,3.99247885 18.8576438,4.11908493 18.7519106,4.37605766 C18.6474361,4.63177687 18.5945695,5.02287684 18.5945695,5.55186462 L18.5945695,5.55186462 Z M21,5.55186462 C21,6.36790975 20.85147,6.98088374 20.5569275,7.38827954 C20.2598675,7.79567534 19.8281236,8 19.2616957,8 C18.7217011,8 18.3012857,7.78940771 18.0004495,7.36947665 C17.7021308,6.94829207 17.5523421,6.34283924 17.5523421,5.55186462 C17.5523421,3.92980257 18.1225462,3.12002507 19.2616957,3.12002507 C19.8117601,3.12002507 20.2384691,3.32936384 20.5430815,3.74804137 C20.8476938,4.1667189 21,4.76715763 21,5.55186462 L21,5.55186462 Z M19.4114844,0.111563773 L15.0776815,7.89345033 L14.0404891,7.89345033 L18.3755507,0.111563773 L19.4114844,0.111563773 Z M13.5055294,2.44312128 C13.5055294,2.97085553 13.5571373,3.36571608 13.660353,3.62519586 C13.7648275,3.88342212 13.9334972,4.01253526 14.1688794,4.01253526 C14.6383852,4.01253526 14.8750262,3.4898151 14.8750262,2.44312128 C14.8750262,1.39642745 14.6383852,0.873707302 14.1688794,0.873707302 C13.9334972,0.873707302 13.7648275,1.00282043 13.660353,1.26104669 C13.5571373,1.52052648 13.5055294,1.91538703 13.5055294,2.44312128 L13.5055294,2.44312128 Z M15.9109599,2.43309307 C15.9109599,3.2491382 15.7636887,3.86085866 15.4704049,4.27201504 C15.1758624,4.68191789 14.741601,4.88624256 14.1688794,4.88624256 C13.6276261,4.88624256 13.2084694,4.67439674 12.9101507,4.25070511 C12.611832,3.82575995 12.4633021,3.22030711 12.4633021,2.43309307 C12.4633021,0.811031025 13.0322474,0 14.1688794,0 C14.7290137,0 15.1594989,0.209338765 15.4603351,0.630523347 C15.7611712,1.0504544 15.9109599,1.65214666 15.9109599,2.43309307 L15.9109599,2.43309307 Z" id="Fill-19"></path>
                </g>
                <g id="Group-26" transform="translate(158.000000, 7.000000)" fill="#343434">
                    <path d="M2.59113048,6.9669696 C3.00025634,6.9669696 3.3160728,6.82908179 3.53738358,6.55205265 C3.75989063,6.2750235 3.86994788,5.88016296 3.86994788,5.36621749 C3.86994788,4.91745534 3.765872,4.56646819 3.55891652,4.31200251 C3.35076476,4.0562833 3.03734085,3.92842369 2.62103734,3.92842369 C2.36383833,3.92842369 2.12577971,3.98608587 1.91045031,4.10141022 C1.69272836,4.21673457 1.52166111,4.37467878 1.39724857,4.57524287 C1.27044348,4.77580696 1.20943348,4.98013162 1.20943348,5.18947039 C1.20943348,5.68962708 1.33863112,6.11081166 1.5970264,6.45427766 C1.85661796,6.79649013 2.18798599,6.9669696 2.59113048,6.9669696 M0,4.57774992 C0,1.53293638 1.18311544,0.00990285177 3.5505426,0.00990285177 C3.92258395,0.00990285177 4.23840041,0.0412409903 4.49559942,0.100156691 L4.49559942,1.14434347 C4.23840041,1.06662488 3.94052807,1.02776559 3.6019824,1.02776559 C2.80645988,1.02776559 2.20832265,1.24963961 1.80876698,1.69840175 C1.40921131,2.14465685 1.19148936,2.86292698 1.15799368,3.84819806 L1.22019995,3.84819806 C1.37810818,3.56114071 1.6018115,3.33801316 1.88891737,3.18006894 C2.17721952,3.02337825 2.51696146,2.94315262 2.90575066,2.94315262 C3.57925318,2.94315262 4.10441767,3.16001254 4.48004785,3.59373237 C4.85687431,4.02494516 5.0446894,4.61284864 5.0446894,5.35493576 C5.0446894,6.17098088 4.82577117,6.81529301 4.39152354,7.28912567 C3.95607964,7.76295832 3.36272751,7.99987465 2.61146715,7.99987465 C2.07912501,7.99987465 1.61736307,7.86700094 1.22378877,7.59874647 C0.831410749,7.33049201 0.528753311,6.94064557 0.318209006,6.42670009 C0.106468427,5.91400815 0,5.29852711 0,4.57774992" id="Fill-22"></path>
                    <path d="M11.7139195,5.55186462 C11.7139195,6.0808524 11.764163,6.47571294 11.8634538,6.73769978 C11.9639409,7.00094014 12.1254379,7.13256033 12.347945,7.13256033 C12.7917628,7.13256033 13.0142698,6.6060796 13.0142698,5.55186462 C13.0142698,4.51143842 12.7917628,3.99247885 12.347945,3.99247885 C12.1254379,3.99247885 11.9639409,4.11908493 11.8634538,4.37605766 C11.764163,4.63177687 11.7139195,5.02287684 11.7139195,5.55186462 L11.7139195,5.55186462 Z M14,5.55186462 C14,6.36790975 13.8588396,6.98088374 13.5789114,7.38827954 C13.2965906,7.79567534 12.8862685,8 12.347945,8 C11.8347432,8 11.4351876,7.78940771 11.149278,7.36947665 C10.8657609,6.94829207 10.7234043,6.34283924 10.7234043,5.55186462 C10.7234043,3.92980257 11.2653166,3.12002507 12.347945,3.12002507 C12.8707169,3.12002507 13.276254,3.32936384 13.5657524,3.74804137 C13.8552508,4.1667189 14,4.76715763 14,5.55186462 L14,5.55186462 Z M12.4903016,0.111563773 L8.37152867,7.89345033 L7.38579851,7.89345033 L11.5057678,0.111563773 L12.4903016,0.111563773 Z M6.87738187,2.44312128 C6.87738187,2.97085553 6.92642912,3.36571608 7.02452363,3.62519586 C7.12381441,3.88342212 7.28411518,4.01253526 7.50781851,4.01253526 C7.95402888,4.01253526 8.17892848,3.4898151 8.17892848,2.44312128 C8.17892848,1.39642745 7.95402888,0.873707302 7.50781851,0.873707302 C7.28411518,0.873707302 7.12381441,1.00282043 7.02452363,1.26104669 C6.92642912,1.52052648 6.87738187,1.91538703 6.87738187,2.44312128 L6.87738187,2.44312128 Z M9.16346236,2.43309307 C9.16346236,3.2491382 9.02349825,3.86085866 8.7447663,4.27201504 C8.46483808,4.68191789 8.05212339,4.88624256 7.50781851,4.88624256 C6.99342049,4.88624256 6.5950611,4.67439674 6.31154405,4.25070511 C6.028027,3.82575995 5.88686662,3.22030711 5.88686662,2.43309307 C5.88686662,0.811031025 6.42758267,0 7.50781851,0 C8.04016064,0 8.44928651,0.209338765 8.7351961,0.630523347 C9.0211057,1.0504544 9.16346236,1.65214666 9.16346236,2.43309307 L9.16346236,2.43309307 Z" id="Fill-24"></path>
                </g>
                <g id="Group-29" transform="translate(63.000000, 23.000000)">
                    <mask id="mask-2" fill="white">
                        <use xlink:href="#path-1"></use>
                    </mask>
                    <g id="Clip-28"></g>
                    <polygon id="Fill-27" fill="#779A31" mask="url(#mask-2)" points="-0.647921635 144.646794 73.646678 144.646794 73.646678 -0.646794102 -0.647921635 -0.646794102"></polygon>
                </g>
                <g id="Group-32" transform="translate(141.000000, 24.000000)">
                    <mask id="mask-4" fill="white">
                        <use xlink:href="#path-3"></use>
                    </mask>
                    <g id="Clip-31"></g>
                    <polygon id="Fill-30" fill="#D43372" mask="url(#mask-4)" points="-0.648565672 39.6410621 39.6498129 39.6410621 39.6498129 -0.641062115 -0.648565672 -0.641062115"></polygon>
                </g>
                <g id="Group-35" transform="translate(166.000000, 39.000000)">
                    <mask id="mask-6" fill="white">
                        <use xlink:href="#path-5"></use>
                    </mask>
                    <g id="Clip-34"></g>
                    <polygon id="Fill-33" fill="#D1E2AE" mask="url(#mask-6)" points="-0.651112871 83.6403941 49.6511129 83.6403941 49.6511129 -0.640394089 -0.651112871 -0.640394089"></polygon>
                </g>
                <g id="Group-38" transform="translate(113.000000, 116.000000)">
                    <mask id="mask-8" fill="white">
                        <use xlink:href="#path-7"></use>
                    </mask>
                    <g id="Clip-37"></g>
                    <polygon id="Fill-36" fill="#AACC66" mask="url(#mask-8)" points="-0.64130139 58.6452165 95.6400705 58.6452165 95.6400705 -0.643975697 -0.64130139 -0.643975697"></polygon>
                </g>
                <g id="Group-61" transform="translate(59.000000, 298.000000)">
                    <path d="M26.0344003,53.5404841 C25.5646884,55.1440624 24.4930036,56.4689177 23.0195915,57.2719347 C19.978825,58.9319944 16.1432565,57.8220137 14.472071,54.8002631 C13.662436,53.3366602 13.4757873,51.6471321 13.9467353,50.0435538 C14.4164472,48.4412033 15.488132,47.116348 16.9615441,46.3121031 C17.9022039,45.7988598 18.9368062,45.5385546 19.9812972,45.5385546 C20.5733814,45.5385546 21.1667017,45.6220488 21.7513694,45.7902649 C23.364459,46.2568497 24.6994296,47.3201719 25.5090646,48.7850026 C26.3186996,50.2486055 26.5041122,51.9369058 26.0344003,53.5404841 M30.549815,43.438923 L39.0911551,38.7841256 C37.2370292,37.0970531 34.8130686,36.1380986 32.3075264,36.1380986 L26.0776632,36.1380986 C26.0492333,36.1589721 26.029456,36.1859849 25.9985539,36.2031749 L15.2137213,42.0821435 C15.2075409,42.0845992 15.2013605,42.0833713 15.1951801,42.0870549 C12.6278337,43.4917208 10.7415696,45.9130503 10.0196966,48.7371163 C9.28546268,51.6041572 9.77247976,54.5632871 11.3905137,57.0656551 C14.2038407,61.4159446 19.90466,63.103017 24.6512223,60.9923347 C27.3928566,59.771847 29.4336312,57.5555692 30.3977767,54.7499211 C31.3483252,51.9823364 31.094928,48.9188388 29.7043336,46.3452552 C29.1419154,45.3040344 29.5213931,44.0000526 30.549815,43.438923" id="Fill-39" fill="#D5E4B3"></path>
                    <g id="Group-43" transform="translate(0.001123, 0.000000)">
                        <mask id="mask-10" fill="white">
                            <use xlink:href="#path-9"></use>
                        </mask>
                        <g id="Clip-42"></g>
                        <path d="M13.0384502,16.9769339 C9.38334994,16.9769339 6.40933194,19.9299246 6.40933194,23.5594633 C6.40933194,27.1890019 9.38334994,30.1432205 13.0384502,30.1432205 C16.6935505,30.1432205 19.6675685,27.1890019 19.6675685,23.5594633 C19.6675685,19.9299246 16.6935505,16.9769339 13.0384502,16.9769339 L13.0384502,16.9769339 Z M13.0384502,32.1237502 C8.28323522,32.1237502 4.41429244,28.2817927 4.41429244,23.5594633 C4.41429244,18.8383617 8.28323522,14.9964041 13.0384502,14.9964041 C17.7936652,14.9964041 21.662608,18.8383617 21.662608,23.5594633 C21.662608,28.2817927 17.7936652,32.1237502 13.0384502,32.1237502 L13.0384502,32.1237502 Z M19.9197296,43.6766357 C18.820851,43.6766357 17.7343332,43.9516751 16.7442299,44.4919312 C15.1904724,45.3379232 14.0619277,46.7327662 13.5674941,48.4210665 C13.0718245,50.1093668 13.2695979,51.8885283 14.1212598,53.4294861 C15.2856508,55.5364848 17.5167824,56.845378 19.9456874,56.845378 C21.0495103,56.845378 22.148389,56.5641993 23.1224231,56.033766 C24.6749446,55.1877741 25.8010171,53.7917032 26.2979228,52.1034029 C26.7923564,50.4151026 26.595819,48.6359411 25.7441572,47.0949833 C24.8924954,45.5527978 23.4870679,44.4342221 21.7862164,43.9430802 C21.1706466,43.7650412 20.5427159,43.6766357 19.9197296,43.6766357 L19.9197296,43.6766357 Z M19.9456874,58.8259077 C16.7887289,58.8259077 13.8876399,57.124101 12.373437,54.3847571 C11.2634336,52.3772145 11.0075643,50.0627083 11.6528001,47.867304 C12.2967998,45.6706718 13.7640315,43.8559025 15.7850288,42.7545168 C17.7998456,41.6555867 20.1298639,41.3989651 22.3436902,42.0411331 C24.5550444,42.6796176 26.3844487,44.1358534 27.4919799,46.1409402 C28.6007472,48.1472549 28.8566166,50.4617611 28.2113808,52.6583933 C27.567381,54.8550254 26.1001494,56.6710226 24.0828604,57.7699526 C22.8158743,58.4612349 21.3844891,58.8259077 19.9456874,58.8259077 L19.9456874,58.8259077 Z M14.551417,40.9765831 C11.9531685,42.4426416 10.0582518,44.908174 9.32401791,47.7752149 C8.56629845,50.7318891 9.06814854,53.7843361 10.738098,56.3665146 C12.725721,59.4386073 16.274518,61.3479214 20.0013111,61.3479214 C21.5365274,61.3479214 23.0223003,61.0335906 24.416603,60.4147518 C27.243527,59.1574285 29.3473419,56.8699351 30.3411534,53.9771093 C31.321368,51.122347 31.0617904,47.9630767 29.6266969,45.3096825 C29.142152,44.4108928 29.4561173,43.3316085 30.3399173,42.8502894 L39.7057255,37.7448693 L84.7869435,37.7448693 C91.8276777,37.7448693 97.5606351,32.0709525 97.5903011,25.0856867 L62.930507,25.0856867 L93.3134506,8.52438169 C91.6731672,5.58489739 88.9698516,3.44474654 85.692993,2.49807051 C82.4025375,1.54771093 78.9415024,1.91852307 75.9551236,3.54543063 L36.4375195,25.0856867 L25.7515737,25.0856867 C24.7454014,25.0856867 23.9481272,24.288809 23.9370025,23.2709174 C23.9085725,20.2589897 22.60574,17.364936 20.3634837,15.3303806 C18.0866171,13.2663568 15.1249599,12.2693387 12.0508191,12.5173654 C6.70104776,12.9495703 2.38958692,17.2838976 2.0212339,22.6029644 C1.80862746,25.6652342 2.84693798,28.5789335 4.94333637,30.8099456 C7.01130483,33.0102614 9.93587947,34.2724961 12.9655213,34.2724961 L26.8702297,34.2675846 L14.551417,40.9765831 Z M20.0013111,63.3284511 C15.6033244,63.3284511 11.4117637,61.0704262 9.05949595,57.437204 C7.08794204,54.3872128 6.49462174,50.7822312 7.39078261,47.2865287 C8.27458264,43.8374847 10.5811153,40.8795825 13.7195325,39.1691808 L19.0903173,36.2481144 L12.9655213,36.2530258 C9.38458603,36.2530258 5.92973137,34.7611822 3.4847573,32.1618137 C1.00764505,29.5268374 -0.219786315,26.0827048 0.032374812,22.4666725 C0.467476365,16.1788283 5.56385052,11.0525346 11.887656,10.5442028 C15.5365759,10.2360112 19.0173883,11.4270303 21.7083431,13.8680056 C24.3214246,16.2377653 25.8541687,19.5971759 25.9295698,23.1039291 L35.9257807,23.1039291 L74.9971585,1.80801614 C78.4507771,-0.0742852131 82.4482726,-0.505262235 86.2504669,0.596123487 C90.0576055,1.69750921 93.1960226,4.19128223 95.0897033,7.62068058 L95.2219642,7.85888441 C95.4358068,8.24811437 95.4852501,8.69382564 95.3616417,9.11743554 C95.2367972,9.53858972 94.9549701,9.88852833 94.5693119,10.0997193 L70.7116555,23.1039291 L97.9215716,23.1039291 C98.8387459,23.1039291 99.5853406,23.8455534 99.5853406,24.7566216 L99.5853406,25.0304333 C99.5853406,33.1330468 92.9463337,39.7253991 84.7869435,39.7253991 L40.2174642,39.7253991 L31.453629,44.5029819 C33.0889681,47.6106823 33.3720313,51.2881073 32.2286536,54.6168216 C31.0543739,58.0351693 28.5698451,60.7376776 25.2311824,62.2233819 C23.5785381,62.9564112 21.8195906,63.3284511 20.0013111,63.3284511 L20.0013111,63.3284511 Z" id="Fill-41" fill="#343434" mask="url(#mask-10)"></path>
                    </g>
                    <path d="M39.9632124,29.5464831 C39.0806484,29.5464831 38.3649558,30.257411 38.3649558,31.1328714 C38.3649558,32.0107876 39.0806484,32.7204876 39.9632124,32.7204876 C40.8457763,32.7204876 41.5614689,32.0107876 41.5614689,31.1328714 C41.5614689,30.257411 40.8457763,29.5464831 39.9632124,29.5464831" id="Fill-44" fill="#343434"></path>
                    <path d="M67.8039021,25.0983336 L34.705282,25.0983336 C34.1539886,25.0983336 33.7077623,24.6550781 33.7077623,24.1074548 C33.7077623,23.5610595 34.1539886,23.1178039 34.705282,23.1178039 L67.8039021,23.1178039 C68.3539595,23.1178039 68.8014219,23.5610595 68.8014219,24.1074548 C68.8014219,24.6550781 68.3539595,25.0983336 67.8039021,25.0983336" id="Fill-46" fill="#343434"></path>
                    <path d="M39.2460365,39.4237151 C37.2843712,37.4051219 34.5600422,36.2484827 31.7702007,36.2484827 L12.8000202,36.2484827 L12.5886498,34.2814594 L12.8000202,34.267953 L31.7702007,34.267953 C35.0989748,34.267953 38.3461673,35.645606 40.6798938,38.0472899 L39.2460365,39.4237151 Z" id="Fill-48" fill="#343434"></path>
                    <mask id="mask-12" fill="white">
                        <use xlink:href="#path-11"></use>
                    </mask>
                    <g id="Clip-51"></g>
                    <polygon id="Fill-50" fill="#96C23F" mask="url(#mask-12)" points="113.774112 103.114015 147.242321 103.114015 147.242321 92.2413612 113.774112 92.2413612"></polygon>
                    <path d="M147.241579,93.0907911 L113.715274,93.0907911 C113.24309,93.0907911 112.86114,92.7101561 112.86114,92.2423434 C112.86114,91.7733029 113.24309,91.392668 113.715274,91.392668 L147.241579,91.392668 C147.713763,91.392668 148.095713,91.7733029 148.095713,92.2423434 C148.095713,92.7101561 147.713763,93.0907911 147.241579,93.0907911" id="Fill-52" fill="#343434" mask="url(#mask-12)"></path>
                    <path d="M118.901635,99.268374 C118.143916,99.268374 117.529582,98.6581302 117.529582,97.906683 C117.529582,97.1540081 118.143916,96.5437643 118.901635,96.5437643 C119.659355,96.5437643 120.273688,97.1540081 120.273688,97.906683 C120.273688,98.6581302 119.659355,99.268374 118.901635,99.268374" id="Fill-53" fill="#343434" mask="url(#mask-12)"></path>
                    <path d="M113.808228,50.007946 C113.336044,50.007946 112.954094,49.627311 112.954094,49.1594983 C112.954094,45.3420979 110.360789,41.9397123 106.648829,40.8849851 C106.558595,40.8616558 106.44982,40.8469216 106.337336,40.8469216 C105.638949,40.8469216 105.07035,41.4117348 105.07035,42.1054727 C105.07035,42.5745132 104.687164,42.9551482 104.21498,42.9551482 C103.742796,42.9551482 103.360846,42.5745132 103.360846,42.1054727 C103.360846,40.4748816 104.695817,39.1487985 106.337336,39.1487985 C106.599386,39.1487985 106.857728,39.1831784 107.10618,39.2482547 C111.561027,40.514173 114.662362,44.5881951 114.662362,49.1594983 C114.662362,49.627311 114.280412,50.007946 113.808228,50.007946" id="Fill-54" fill="#343434" mask="url(#mask-12)"></path>
                    <path d="M148.031066,51.4180144 C147.913638,51.4180144 147.794974,51.3934573 147.681254,51.3431152 C141.600957,48.6307841 135.111517,47.2555867 128.392164,47.2555867 C124.843367,47.2555867 121.303223,47.650956 117.870618,48.4257323 C117.409558,48.5411507 116.950971,48.2452377 116.84714,47.7872479 C116.743309,47.3304859 117.03008,46.8749518 117.49114,46.771812 C121.047353,45.9663392 124.716051,45.5586915 128.392164,45.5586915 C135.353789,45.5586915 142.079322,46.9842308 148.380878,49.7947904 C148.812271,49.9863357 149.003864,50.4885283 148.811035,50.9170496 C148.668885,51.2326083 148.357392,51.4180144 148.031066,51.4180144" id="Fill-55" fill="#343434" mask="url(#mask-12)"></path>
                    <path d="M142.566463,49.3700754 C142.094278,49.3700754 141.712329,48.9894404 141.712329,48.5216278 L141.712329,19.5639011 C141.712329,17.4102438 139.947201,15.6568672 137.777873,15.6568672 C135.608546,15.6568672 133.842182,17.4102438 133.842182,19.5639011 C133.842182,20.0317137 133.460232,20.4123487 132.988048,20.4123487 C132.515864,20.4123487 132.133914,20.0317137 132.133914,19.5639011 C132.133914,16.4733906 134.665414,13.9587441 137.777873,13.9587441 C140.890333,13.9587441 143.420597,16.4733906 143.420597,19.5639011 L143.420597,48.5216278 C143.420597,48.9894404 143.038647,49.3700754 142.566463,49.3700754" id="Fill-56" fill="#343434" mask="url(#mask-12)"></path>
                    <path d="M132.98916,47.2560779 C132.516976,47.2560779 132.135026,46.8754429 132.135026,46.4076302 L132.135026,14.8075601 C132.135026,12.6539028 130.368662,10.9017541 128.199335,10.9017541 C126.030008,10.9017541 124.26488,12.6539028 124.26488,14.8075601 L124.26488,19.5630416 C124.26488,20.0320821 123.88293,20.4127171 123.410746,20.4127171 C122.938562,20.4127171 122.556612,20.0320821 122.556612,19.5630416 L122.556612,14.8075601 C122.556612,11.7182775 125.086876,9.20363094 128.199335,9.20363094 C131.311795,9.20363094 133.843294,11.7182775 133.843294,14.8075601 L133.843294,46.4076302 C133.843294,46.8754429 133.461345,47.2560779 132.98916,47.2560779" id="Fill-57" fill="#343434" mask="url(#mask-12)"></path>
                    <path d="M131.69634,71.9126294 C131.420693,71.9126294 131.151227,71.7812489 130.985592,71.5369058 C127.136427,65.8445711 120.722387,62.4458691 113.828747,62.4458691 C113.601307,62.4458691 113.384992,62.3574636 113.224302,62.1978425 C113.063611,62.0382214 112.974613,61.8221189 112.974613,61.5974215 L112.977085,19.5630416 C112.977085,16.473759 115.509821,13.9591124 118.62228,13.9591124 C121.733504,13.9591124 124.265003,16.473759 124.265003,19.5630416 L124.265003,46.6617962 C124.265003,47.1296088 123.883054,47.5102438 123.410869,47.5102438 C122.938685,47.5102438 122.555499,47.1296088 122.555499,46.6617962 L122.555499,19.5630416 C122.555499,17.4093843 120.791608,15.6572356 118.62228,15.6572356 C116.452953,15.6572356 114.686589,17.4093843 114.686589,19.5630416 L114.682881,60.7637081 C121.821265,61.0338362 128.397232,64.6633748 132.404616,70.5902298 C132.667902,70.9794597 132.564071,71.5074373 132.172233,71.7689704 C132.026375,71.8659709 131.859503,71.9126294 131.69634,71.9126294" id="Fill-58" fill="#343434" mask="url(#mask-12)"></path>
                    <path d="M147.559006,104.998772 C147.086822,104.998772 146.704872,104.618137 146.704872,104.150325 L146.704872,84.2750395 C146.704872,84.0957727 146.761731,83.9189616 146.868035,83.7740747 C149.760471,79.8437116 151.290743,75.1852307 151.290743,70.2995966 L151.290743,30.9750921 C151.290743,28.8214348 149.524379,27.0680582 147.355052,27.0680582 C145.185724,27.0680582 143.420597,28.8214348 143.420597,30.9750921 C143.420597,31.4441326 143.038647,31.8235397 142.566463,31.8235397 C142.094278,31.8235397 141.712329,31.4441326 141.712329,30.9750921 C141.712329,27.8845817 144.242592,25.3699351 147.355052,25.3699351 C150.467511,25.3699351 152.999011,27.8845817 152.999011,30.9750921 L152.999011,70.2995966 C152.999011,75.4541309 151.414352,80.3741449 148.41314,84.5500789 L148.41314,104.150325 C148.41314,104.618137 148.03119,104.998772 147.559006,104.998772" id="Fill-59" fill="#343434" mask="url(#mask-12)"></path>
                    <path d="M113.715274,105 C113.24309,105 112.86114,104.619365 112.86114,104.151552 L112.86114,89.51184 C106.81669,84.8189791 103.360599,77.7895106 103.360599,70.1571654 L103.360599,42.1055955 C103.360599,41.6377828 103.743785,41.2571479 104.214733,41.2571479 C104.686917,41.2571479 105.070103,41.6377828 105.070103,42.1055955 L105.070103,70.1571654 C105.070103,77.3941414 108.408766,84.0491142 114.230721,88.4153657 C114.444564,88.5762147 114.569408,88.8266971 114.569408,89.0931416 L114.569408,104.151552 C114.569408,104.619365 114.187458,105 113.715274,105" id="Fill-60" fill="#343434" mask="url(#mask-12)"></path>
                </g>
                <g id="Group-76" transform="translate(96.000000, 208.000000)">
                    <path d="M87.02353,34 L4.97646995,34 C2.23941148,34 0,31.7732499 0,29.0516664 L0,4.94833358 C0,2.22675011 2.23941148,0 4.97646995,0 L87.02353,0 C89.7605885,0 92,2.22675011 92,4.94833358 L92,29.0516664 C92,31.7732499 89.7605885,34 87.02353,34" id="Fill-62" fill="#21244C"></path>
                    <path d="M39.2509115,17.8448042 L38.4297939,15.4696041 C38.3688322,15.3100204 38.2867204,15.0601295 38.1809704,14.7174574 C38.0739763,14.3747853 38.0005734,14.1248945 37.9607616,13.9653107 C37.8525234,14.4551958 37.6945205,14.9896158 37.4867529,15.571045 L36.69425,17.8448042 L39.2509115,17.8448042 Z M40.506226,21.4966744 L39.6291232,19.0732281 L36.2737383,19.0732281 L35.4165414,21.4966744 L33.9036945,21.4966744 L37.1869205,12.7356498 L38.7470439,12.7356498 L42.0290258,21.4966744 L40.506226,21.4966744 Z" id="Fill-64" fill="#FEFEFE"></path>
                    <path d="M44.5506031,21.4967981 L42.0300211,14.8969582 L43.5179856,14.8969582 L44.8678531,18.7343909 C45.0992589,19.3776743 45.2410883,19.8997235 45.2883648,20.2968272 L45.3368854,20.2968272 C45.3717207,20.011061 45.5123059,19.4902489 45.7573971,18.7343909 L47.1072646,14.8969582 L48.6076703,14.8969582 L46.074647,21.4967981 L44.5506031,21.4967981 Z" id="Fill-66" fill="#FEFEFE"></path>
                    <path d="M52.6397306,15.9227478 C52.072413,15.9227478 51.6630984,16.089754 51.4130308,16.4212924 C51.1629632,16.7540678 51.0335749,17.3095183 51.0261102,18.0888808 L51.0261102,18.1841362 C51.0261102,18.9894775 51.1542543,19.5696696 51.4105425,19.9296609 C51.6668307,20.2896522 52.0848542,20.4702663 52.664613,20.4702663 C53.1647482,20.4702663 53.544204,20.2735701 53.8017364,19.8789405 C54.0605128,19.485548 54.1886569,18.9164896 54.1886569,18.1730025 C54.1886569,16.6724203 53.6723481,15.9227478 52.6397306,15.9227478 M53.0067453,14.7772086 C53.8340834,14.7772086 54.4797804,15.0753457 54.9425921,15.6728569 C55.4041597,16.2691311 55.6343214,17.1066366 55.6343214,18.1841362 C55.6343214,19.2665842 55.4016714,20.1102751 54.9326392,20.7114976 C54.464851,21.3139572 53.8141775,21.6170426 52.9818629,21.6170426 C52.1420836,21.6170426 51.4901661,21.3151943 51.0261102,20.7152088 L50.9303132,20.7152088 L50.6715368,21.4970456 L49.615281,21.4970456 L49.615281,12.2114976 L51.0261102,12.2114976 L51.0261102,14.4184544 C51.0261102,14.5829865 51.0174014,14.8242177 51.002472,15.1470965 C50.9862985,15.4699753 50.9738573,15.6753311 50.9651485,15.7619269 L51.0261102,15.7619269 C51.4739925,15.1062727 52.1346189,14.7772086 53.0067453,14.7772086" id="Fill-68" fill="#FEFEFE"></path>
                    <path d="M60.640277,14.777456 C60.9251799,14.777456 61.1578298,14.7972493 61.3419592,14.836836 L61.2038622,16.143196 C61.0048034,16.0961869 60.7957916,16.0726823 60.5805593,16.0726823 C60.01573,16.0726823 59.5591389,16.2545335 59.2095418,16.6207102 C58.8587007,16.9868869 58.6845243,17.463164 58.6845243,18.0483045 L58.6845243,21.497293 L57.273695,21.497293 L57.273695,14.8974531 L58.3784714,14.8974531 L58.5638449,16.0603115 L58.6360037,16.0603115 C58.8549684,15.6669189 59.1436036,15.3539368 59.496933,15.1226022 C59.8502623,14.8925047 60.2322064,14.777456 60.640277,14.777456" id="Fill-70" fill="#FEFEFE"></path>
                    <path d="M61.5647807,14.8970819 L63.1012658,14.8970819 L64.4511332,18.6380221 C64.6551685,19.1712051 64.7920214,19.6722238 64.8592038,20.1423155 L64.9077243,20.1423155 C64.9438038,19.9233518 65.009742,19.6586159 65.105539,19.3456338 C65.2013361,19.0338888 65.7101801,17.5506258 66.629583,14.8970819 L68.154871,14.8970819 L65.3157949,22.374014 C64.8007302,23.7459395 63.9385568,24.4325207 62.7342511,24.4325207 C62.4219776,24.4325207 62.1184129,24.3991195 61.822313,24.3310799 L61.822313,23.2214161 C62.0350571,23.2696623 62.2764159,23.2931669 62.5488776,23.2931669 C63.2294099,23.2931669 63.707151,22.9010115 63.9833451,22.1179377 L64.2296803,21.4969218 L61.5647807,14.8970819 Z" id="Fill-72" fill="#FEFEFE"></path>
                    <path d="M71.6356629,20.4820186 C71.9790393,20.4820186 72.3236599,20.428824 72.6682804,20.3211978 L72.6682804,21.377667 C72.5115216,21.4444695 72.3112187,21.5013753 72.0648834,21.5471474 C71.8185482,21.5929195 71.5635041,21.6164241 71.2985071,21.6164241 C69.9623249,21.6164241 69.2954779,20.9162349 69.2954779,19.5158565 L69.2954779,15.9592417 L68.3897604,15.9592417 L68.3897604,15.3382259 L69.3614161,14.8248363 L69.8416455,13.4281691 L70.7112836,13.4281691 L70.7112836,14.8965871 L72.6010981,14.8965871 L72.6010981,15.9592417 L70.7112836,15.9592417 L70.7112836,19.4911148 C70.7112836,19.8300757 70.7958836,20.0799665 70.9663277,20.2407874 C71.1367718,20.4028453 71.3594688,20.4820186 71.6356629,20.4820186" id="Fill-74" fill="#FEFEFE"></path>
                </g>
                <g id="Group-79" transform="translate(111.000000, 219.000000)">
                    <mask id="mask-14" fill="white">
                        <use xlink:href="#path-13"></use>
                    </mask>
                    <g id="Clip-78"></g>
                    <polygon id="Fill-77" fill="#FEFEFE" mask="url(#mask-14)" points="-0.649172276 12.8003358 13.6503547 12.8003358 13.6503547 -0.691399486 -0.649172276 -0.691399486"></polygon>
                </g>
                <g id="Group-83" transform="translate(107.000000, 254.000000)">
                    <mask id="mask-16" fill="white">
                        <use xlink:href="#path-15"></use>
                    </mask>
                    <g id="Clip-81"></g>
                    <polygon id="Fill-80" fill="#22398E" mask="url(#mask-16)" points="-0.870383897 12.8801828 14.4851879 12.8801828 14.4851879 -1.02513875 -0.870383897 -1.02513875"></polygon>
                    <polygon id="Fill-82" fill="#20244C" mask="url(#mask-16)" points="-0.870383897 12.8801828 14.4851879 12.8801828 14.4851879 -1.02513875 -0.870383897 -1.02513875"></polygon>
                </g>
                <g id="Group-93" transform="translate(24.000000, 6.000000)">
                    <path d="M106.209839,253.236942 L107.20332,253.236942 C107.869362,253.236942 108.351839,253.113257 108.650751,252.867125 C108.949664,252.620993 109.09974,252.254887 109.09974,251.768807 C109.09974,251.276543 108.937261,250.922805 108.614783,250.707594 C108.292304,250.492383 107.804866,250.384777 107.154948,250.384777 L106.209839,250.384777 L106.209839,253.236942 Z M106.209839,254.418129 L106.209839,257.902321 L104.779772,257.902321 L104.779772,249.180091 L107.250451,249.180091 C108.379125,249.180091 109.215088,249.391591 109.7571,249.812118 C110.300352,250.233882 110.571978,250.870858 110.571978,251.72057 C110.571978,252.80652 110.00516,253.580785 108.871525,254.042128 L111.343445,257.902321 L109.71617,257.902321 L107.622542,254.418129 L106.209839,254.418129 Z" id="Fill-84" fill="#21244C"></path>
                    <mask id="mask-18" fill="white">
                        <use xlink:href="#path-17"></use>
                    </mask>
                    <g id="Clip-87"></g>
                    <path d="M112.461825,257.903187 L113.868326,257.903187 L113.868326,251.304619 L112.461825,251.304619 L112.461825,257.903187 Z M112.378725,249.55572 C112.378725,249.305878 112.448181,249.111693 112.584614,248.976877 C112.722288,248.842061 112.918256,248.774034 113.174998,248.774034 C113.421818,248.774034 113.614064,248.842061 113.750498,248.976877 C113.889411,249.111693 113.957628,249.305878 113.957628,249.55572 C113.957628,249.794431 113.889411,249.982432 113.750498,250.119722 C113.614064,250.257011 113.421818,250.326275 113.174998,250.326275 C112.918256,250.326275 112.722288,250.257011 112.584614,250.119722 C112.448181,249.982432 112.378725,249.794431 112.378725,249.55572 L112.378725,249.55572 Z" id="Fill-86" fill="#21244C" mask="url(#mask-18)"></path>
                    <path d="M121.700332,257.902815 L120.287629,257.902815 L120.287629,253.845964 C120.287629,253.336384 120.185924,252.956673 119.980034,252.70683 C119.774144,252.455751 119.449185,252.329592 119.001436,252.329592 C118.408572,252.329592 117.973227,252.505224 117.69788,252.855251 C117.422533,253.205279 117.28486,253.79278 117.28486,254.615282 L117.28486,257.902815 L115.879598,257.902815 L115.879598,251.304248 L116.979746,251.304248 L117.178194,252.168803 L117.248891,252.168803 C117.448579,251.854644 117.731368,251.612222 118.099738,251.440301 C118.465626,251.270853 118.872445,251.184274 119.318954,251.184274 C120.906539,251.184274 121.700332,251.990697 121.700332,253.599832 L121.700332,257.902815 Z" id="Fill-88" fill="#21244C" mask="url(#mask-18)"></path>
                    <path d="M124.649644,253.439784 C124.649644,253.854127 124.75631,254.171997 124.969641,254.393392 C125.182973,254.617261 125.489328,254.728577 125.887464,254.728577 C126.701102,254.728577 127.107921,254.294444 127.107921,253.427416 C127.107921,252.999468 127.007456,252.666756 126.806527,252.435466 C126.604358,252.201703 126.299244,252.085439 125.887464,252.085439 C125.480646,252.085439 125.173051,252.200466 124.96344,252.431756 C124.753829,252.661809 124.649644,252.999468 124.649644,253.439784 L124.649644,253.439784 Z M124.045617,258.928902 C124.045617,259.231929 124.18205,259.464456 124.454916,259.627719 C124.727783,259.790983 125.112276,259.871378 125.605916,259.871378 C126.373662,259.871378 126.942961,259.761299 127.317532,259.543614 C127.692102,259.324692 127.879388,259.034034 127.879388,258.671638 C127.879388,258.385927 127.776443,258.181848 127.571793,258.060637 C127.365903,257.939426 126.985131,257.878821 126.426995,257.878821 L125.361577,257.878821 C124.958479,257.878821 124.638481,257.972821 124.401584,258.162058 C124.163446,258.351295 124.045617,258.607322 124.045617,258.928902 L124.045617,258.928902 Z M129.244959,251.303753 L129.244959,252.074308 L128.113805,252.282098 C128.21799,252.421861 128.302331,252.592546 128.370547,252.795388 C128.438764,252.999468 128.472252,253.212205 128.472252,253.439784 C128.472252,254.120049 128.237835,254.654366 127.766521,255.045209 C127.296446,255.434815 126.647769,255.630237 125.821728,255.630237 C125.609637,255.630237 125.41863,255.614158 125.247469,255.580763 C124.944835,255.768763 124.792278,255.987685 124.792278,256.238764 C124.792278,256.389659 124.864216,256.503449 125.00561,256.57766 C125.147005,256.654344 125.407468,256.69145 125.78576,256.69145 L126.94172,256.69145 C127.671017,256.69145 128.225432,256.847292 128.603724,257.15774 C128.983256,257.466951 129.171782,257.914689 129.171782,258.499717 C129.171782,259.246771 128.862947,259.824378 128.245277,260.228826 C127.626366,260.634511 126.73459,260.837354 125.564986,260.837354 C124.663287,260.837354 123.97492,260.680274 123.499885,260.361168 C123.02609,260.043299 122.789192,259.589377 122.789192,259.000639 C122.789192,258.594954 122.918183,258.254822 123.174926,257.977768 C123.432908,257.700715 123.792596,257.509004 124.255228,257.401399 C124.066702,257.32224 123.911665,257.193609 123.791355,257.01674 C123.669806,256.839871 123.607791,256.654344 123.607791,256.458923 C123.607791,256.211554 123.678488,256.003764 123.817402,255.833079 C123.956315,255.661158 124.164686,255.49171 124.440033,255.324736 C124.09771,255.177551 123.818642,254.93884 123.60531,254.606129 C123.391978,254.274655 123.285313,253.885049 123.285313,253.439784 C123.285313,252.723651 123.511047,252.169545 123.963757,251.774991 C124.417707,251.381674 125.062664,251.185016 125.899867,251.185016 C126.087153,251.185016 126.28312,251.198621 126.48901,251.223358 C126.69366,251.249332 126.848698,251.276543 126.952883,251.303753 L129.244959,251.303753 Z" id="Fill-89" fill="#21244C" mask="url(#mask-18)"></path>
                    <path d="M134.707742,254.590916 C134.707742,256.114709 135.272079,256.876605 136.400753,256.876605 C137.518264,256.876605 138.0764,256.114709 138.0764,254.590916 C138.0764,253.083202 137.514543,252.329963 136.38835,252.329963 C135.799207,252.329963 135.371303,252.525385 135.105878,252.914991 C134.840454,253.304597 134.707742,253.863651 134.707742,254.590916 M139.525071,254.590916 C139.525071,255.669445 139.247244,256.510499 138.692829,257.115316 C138.138415,257.720133 137.366947,258.021924 136.377187,258.021924 C135.759517,258.021924 135.212544,257.883397 134.737509,257.605107 C134.263714,257.326817 133.899065,256.927316 133.643563,256.405367 C133.388061,255.884656 133.26031,255.279838 133.26031,254.590916 C133.26031,253.522282 133.535657,252.686175 134.086351,252.086305 C134.635804,251.485198 135.410993,251.184645 136.413156,251.184645 C137.369428,251.184645 138.128492,251.491383 138.686628,252.106094 C139.244763,252.720806 139.525071,253.549492 139.525071,254.590916" id="Fill-90" fill="#21244C" mask="url(#mask-18)"></path>
                    <path d="M145.584563,256.02343 C145.584563,256.667826 145.350146,257.162564 144.878831,257.506407 C144.408757,257.85025 143.734033,258.022171 142.85714,258.022171 C141.975286,258.022171 141.267074,257.888592 140.732505,257.62267 L140.732505,256.410562 C141.510173,256.769247 142.234509,256.94859 142.904272,256.94859 C143.770002,256.94859 144.202867,256.687615 144.202867,256.166904 C144.202867,255.998693 144.154495,255.860166 144.058992,255.74885 C143.962249,255.637534 143.80473,255.522507 143.586437,255.402534 C143.366904,255.28256 143.06179,255.14898 142.669855,254.996848 C141.90831,254.703716 141.393585,254.40811 141.12444,254.113741 C140.855294,253.820609 140.720102,253.437187 140.720102,252.968423 C140.720102,252.403185 140.949557,251.965342 141.405988,251.653657 C141.862419,251.340735 142.48381,251.184892 143.26892,251.184892 C144.047829,251.184892 144.783328,251.341972 145.476656,251.65613 L145.022706,252.711159 C144.308293,252.418027 143.707987,252.270842 143.221789,252.270842 C142.478849,252.270842 142.107999,252.481106 142.107999,252.904107 C142.107999,253.11066 142.204742,253.285055 142.399469,253.427292 C142.591716,253.572003 143.014659,253.768661 143.663336,254.018504 C144.211549,254.230005 144.607205,254.422952 144.854025,254.597347 C145.102085,254.771743 145.28565,254.973348 145.404719,255.203401 C145.525028,255.430981 145.584563,255.705561 145.584563,256.02343" id="Fill-91" fill="#21244C" mask="url(#mask-18)"></path>
                    <path d="M151.549915,256.02343 C151.549915,256.667826 151.315498,257.162564 150.844184,257.506407 C150.374109,257.85025 149.699386,258.022171 148.822493,258.022171 C147.940639,258.022171 147.232427,257.888592 146.697857,257.62267 L146.697857,256.410562 C147.475526,256.769247 148.199862,256.94859 148.869624,256.94859 C149.735354,256.94859 150.168219,256.687615 150.168219,256.166904 C150.168219,255.998693 150.119848,255.860166 150.024345,255.74885 C149.927601,255.637534 149.770083,255.522507 149.55179,255.402534 C149.332256,255.28256 149.027142,255.14898 148.635207,254.996848 C147.873662,254.703716 147.358937,254.40811 147.089792,254.113741 C146.820647,253.820609 146.685454,253.437187 146.685454,252.968423 C146.685454,252.403185 146.91491,251.965342 147.37134,251.653657 C147.827771,251.340735 148.449162,251.184892 149.234273,251.184892 C150.013182,251.184892 150.74868,251.341972 151.442009,251.65613 L150.988058,252.711159 C150.273645,252.418027 149.673339,252.270842 149.187141,252.270842 C148.444201,252.270842 148.073351,252.481106 148.073351,252.904107 C148.073351,253.11066 148.170094,253.285055 148.364822,253.427292 C148.557068,253.572003 148.980011,253.768661 149.628688,254.018504 C150.176902,254.230005 150.572558,254.422952 150.819378,254.597347 C151.067438,254.771743 151.251002,254.973348 151.370071,255.203401 C151.49038,255.430981 151.549915,255.705561 151.549915,256.02343" id="Fill-92" fill="#21244C" mask="url(#mask-18)"></path>
                </g>
                <rect id="Rectangle-Copy" x="0" y="0" width="292" height="434"></rect>
            </g>
        </g>
    </g>
</svg>