<?xml version="1.0" encoding="UTF-8"?>
<svg width="616px" height="281px" viewBox="0 0 616 281" version="1.1" xmlns="http://www.w3.org/2000/svg" xmlns:xlink="http://www.w3.org/1999/xlink">
    <title>Group 6</title>
    <g id="Page-1" stroke="none" stroke-width="1" fill="none" fill-rule="evenodd">
        <g id="Grid-designmönstersida-placeholder" transform="translate(-380.000000, -1022.000000)">
            <g id="Group-6" transform="translate(380.000000, 1022.000000)">
                <rect id="Rectangle" fill="#FFFFFF" x="0" y="0" width="616" height="281"></rect>
                <g id="Group" fill="#E0EDF5">
                    <rect id="Rectangle-Copy-3" x="0" y="0" width="32" height="281"></rect>
                    <rect id="Rectangle-Copy-64" x="53" y="0" width="32" height="281"></rect>
                    <rect id="Rectangle-Copy-65" x="106" y="0" width="32" height="281"></rect>
                    <rect id="Rectangle-Copy-66" x="159" y="0" width="32" height="281"></rect>
                    <rect id="Rectangle-Copy-67" x="212" y="0" width="32" height="281"></rect>
                    <rect id="Rectangle-Copy-68" x="265" y="0" width="32" height="281"></rect>
                    <rect id="Rectangle-Copy-69" x="318" y="0" width="32" height="281"></rect>
                    <rect id="Rectangle-Copy-70" x="371" y="0" width="32" height="281"></rect>
                    <rect id="Rectangle-Copy-71" x="424" y="0" width="32" height="281"></rect>
                    <rect id="Rectangle-Copy-72" x="477" y="0" width="32" height="281"></rect>
                    <rect id="Rectangle-Copy-73" x="530" y="0" width="32" height="281"></rect>
                    <rect id="Rectangle-Copy-74" x="584" y="0" width="32" height="281"></rect>
                </g>
            </g>
        </g>
    </g>
</svg>