<?xml version="1.0" encoding="UTF-8"?>
<svg width="455px" height="275px" viewBox="0 0 455 275" version="1.1" xmlns="http://www.w3.org/2000/svg" xmlns:xlink="http://www.w3.org/1999/xlink">
    <title>Group 251 Copy 3</title>
    <defs>
        <rect id="path-1" x="0" y="0" width="455" height="275"></rect>
    </defs>
    <g id="Page-2" stroke="none" stroke-width="1" fill="none" fill-rule="evenodd">
        <g id="annas-illustrationer-copy" transform="translate(-1080.000000, -664.000000)">
            <g id="Group-251-Copy-3" transform="translate(1080.000000, 664.000000)">
                <mask id="mask-2" fill="white">
                    <use xlink:href="#path-1"></use>
                </mask>
                <use id="Mask" fill="#F1F1F1" xlink:href="#path-1"></use>
                <g id="Group-141" mask="url(#mask-2)">
                    <g transform="translate(-17.000000, 19.000000)">
                        <path d="M130.455584,32.4155868 L47.0510765,32.4155868 C38.2058765,32.4155868 31.0356912,25.2350748 31.0356912,16.3775681 L31.0356912,16.3775681 C31.0356912,7.51962896 38.2058765,0.339116961 47.0510765,0.339116961 L130.455584,0.339116961 C139.300353,0.339116961 146.470538,7.51962896 146.470538,16.3775681 L146.470538,16.3775681 C146.470538,25.2350748 139.300353,32.4155868 130.455584,32.4155868" id="Fill-1" stroke="none" fill="#96C23E" fill-rule="evenodd"></path>
                        <line x1="48.1728615" y1="16.3773951" x2="110.539962" y2="16.3773951" id="Stroke-3" stroke="#FEFEFE" stroke-width="4.32" fill="none"></line>
                        <polyline id="Stroke-5" stroke="#FEFEFE" stroke-width="1.296" fill="none" stroke-linejoin="round" points="122.800724 23.7154902 130.527377 16.3776113 122.593074 9.03930009"></polyline>
                        <path d="M262.551819,32.1895233 L179.147312,32.1895233 C170.302112,32.1895233 163.131926,25.0090113 163.131926,16.1515045 L163.131926,16.1515045 C163.131926,7.2935654 170.302112,0.113053398 179.147312,0.113053398 L262.551819,0.113053398 C271.396588,0.113053398 278.566773,7.2935654 278.566773,16.1515045 L278.566773,16.1515045 C278.566773,25.0090113 271.396588,32.1895233 262.551819,32.1895233" id="Fill-7" stroke="none" fill="#D4E4B2" fill-rule="evenodd"></path>
                        <line x1="180.269097" y1="16.1513316" x2="242.636197" y2="16.1513316" id="Stroke-9" stroke="#FEFEFE" stroke-width="4.32" fill="none"></line>
                        <polyline id="Stroke-11" stroke="#FEFEFE" stroke-width="1.296" fill="none" stroke-linejoin="round" points="254.897002 23.4893834 262.623655 16.1515045 254.689352 8.81319329"></polyline>
                        <path d="M391.475197,32.1895233 L308.070689,32.1895233 C299.225489,32.1895233 292.055304,25.0090113 292.055304,16.1515045 L292.055304,16.1515045 C292.055304,7.2935654 299.225489,0.113053398 308.070689,0.113053398 L391.475197,0.113053398 C400.319965,0.113053398 407.490151,7.2935654 407.490151,16.1515045 L407.490151,16.1515045 C407.490151,25.0090113 400.319965,32.1895233 391.475197,32.1895233 Z" id="Stroke-13" stroke="#3B3835" stroke-width="1.296" fill="none" stroke-linejoin="round"></path>
                        <line x1="309.192474" y1="16.1513316" x2="371.559574" y2="16.1513316" id="Stroke-15" stroke="#95C23F" stroke-width="4.32" fill="none"></line>
                        <polyline id="Stroke-17" stroke="#95C23F" stroke-width="1.296" fill="none" stroke-linejoin="round" points="383.820336 23.4893834 391.546989 16.1515045 383.612686 8.81319329"></polyline>
                        <path d="M521.985046,32.0764699 L438.580539,32.0764699 C429.735339,32.0764699 422.565153,24.8959579 422.565153,16.0384511 L422.565153,16.0384511 C422.565153,7.180512 429.735339,0 438.580539,0 L521.985046,0 C530.829815,0 538,7.180512 538,16.0384511 L538,16.0384511 C538,24.8959579 530.829815,32.0764699 521.985046,32.0764699 Z" id="Stroke-19" stroke="#3B3835" stroke-width="1.296" fill="none" stroke-linejoin="round"></path>
                        <line x1="437.598022" y1="16.0382782" x2="494.198841" y2="16.0382782" id="Stroke-21" stroke="#95C23F" stroke-width="4.32" fill="none"></line>
                        <path d="M358.076353,82.9594481 L274.671846,82.9594481 C265.826646,82.9594481 258.65646,75.7789361 258.65646,66.9214294 L258.65646,66.9214294 C258.65646,58.0634903 265.826646,50.8829783 274.671846,50.8829783 L358.076353,50.8829783 C366.921122,50.8829783 374.091307,58.0634903 374.091307,66.9214294 L374.091307,66.9214294 C374.091307,75.7789361 366.921122,82.9594481 358.076353,82.9594481" id="Fill-29" stroke="none" fill="#96C23E" fill-rule="evenodd"></path>
                        <line x1="275.793631" y1="66.9212564" x2="338.160731" y2="66.9212564" id="Stroke-31" stroke="#FEFEFE" stroke-width="4.32" fill="none"></line>
                        <polyline id="Stroke-33" stroke="#FEFEFE" stroke-width="1.296" fill="none" stroke-linejoin="round" points="350.421493 74.2593082 358.148146 66.9214294 350.213843 59.5831182"></polyline>
                        <path d="M490.172632,82.7333846 L406.768124,82.7333846 C397.922924,82.7333846 390.752739,75.5528726 390.752739,66.6953658 L390.752739,66.6953658 C390.752739,57.8374267 397.922924,50.6569147 406.768124,50.6569147 L490.172632,50.6569147 C499.0174,50.6569147 506.187586,57.8374267 506.187586,66.6953658 L506.187586,66.6953658 C506.187586,75.5528726 499.0174,82.7333846 490.172632,82.7333846" id="Fill-35" stroke="none" fill="#D4E4B2" fill-rule="evenodd"></path>
                        <line x1="407.889866" y1="66.6951496" x2="470.256966" y2="66.6951496" id="Stroke-37" stroke="#FEFEFE" stroke-width="4.32" fill="none"></line>
                        <path d="M99.419893,82.7333846 L16.0153854,82.7333846 C7.17018534,82.7333846 0,75.5528726 0,66.6953658 L0,66.6953658 C0,57.8374267 7.17018534,50.6569147 16.0153854,50.6569147 L99.419893,50.6569147 C108.264661,50.6569147 115.434847,57.8374267 115.434847,66.6953658 L115.434847,66.6953658 C115.434847,75.5528726 108.264661,82.7333846 99.419893,82.7333846 Z" id="Stroke-41" stroke="#3B3835" stroke-width="1.296" fill="none" stroke-linejoin="round"></path>
                        <line x1="17.1371704" y1="66.6951496" x2="79.5042705" y2="66.6951496" id="Stroke-43" stroke="#95C23F" stroke-width="4.32" fill="none"></line>
                        <polyline id="Stroke-45" stroke="#95C23F" stroke-width="1.296" fill="none" stroke-linejoin="round" points="91.7650327 74.0332447 99.4916855 66.6953658 91.5573827 59.3570546"></polyline>
                        <path d="M229.929699,82.6203312 L146.525192,82.6203312 C137.679992,82.6203312 130.509806,75.4398192 130.509806,66.5823124 L130.509806,66.5823124 C130.509806,57.7243733 137.679992,50.5438613 146.525192,50.5438613 L229.929699,50.5438613 C238.774468,50.5438613 245.944653,57.7243733 245.944653,66.5823124 L245.944653,66.5823124 C245.944653,75.4398192 238.774468,82.6203312 229.929699,82.6203312 Z" id="Stroke-47" stroke="#3B3835" stroke-width="1.296" fill="none" stroke-linejoin="round"></path>
                        <line x1="145.542675" y1="66.5820962" x2="202.143494" y2="66.5820962" id="Stroke-49" stroke="#95C23F" stroke-width="4.32" fill="none"></line>
                        <path d="M221.081909,58.490456 C218.209345,58.490456 215.978295,60.4852108 215.378225,63.5564587 C215.371318,63.5880186 215.364842,63.6195784 215.359662,63.6515706 C215.347142,63.7138256 215.33635,63.7773776 215.327284,63.8404973 C215.325125,63.8530348 215.322967,63.8660046 215.322103,63.8789744 C215.281523,64.1530694 215.26037,64.4327847 215.26037,64.7185526 C215.267277,64.8400363 215.260801,65.2196191 215.26037,65.3428321 C215.26037,67.1940545 214.511362,68.8701846 213.299998,70.083293 C213.032341,70.3513354 212.866566,70.7218393 212.866997,71.1303879 C212.866566,71.6988974 213.216247,72.2150953 213.656586,72.4407697 C214.311051,72.7771198 217.166778,74.1830458 221.081909,74.1830458 C224.99704,74.1830458 227.852767,72.7771198 228.507232,72.4407697 C228.947571,72.2150953 229.297252,71.6988974 229.296821,71.1303879 C229.297252,70.7218393 229.131477,70.3513354 228.86382,70.083293 C227.652456,68.8701846 226.903017,67.1940545 226.903017,65.3428321 C226.903017,65.2196191 226.896541,64.8400363 226.903449,64.7181202 C226.903449,64.4327847 226.882295,64.1530694 226.841715,63.8789744 C226.840851,63.8660046 226.838693,63.8530348 226.836966,63.8404973 C226.827469,63.7769453 226.816676,63.7138256 226.804156,63.6515706 C226.798976,63.6195784 226.7925,63.5880186 226.786025,63.5564587 C226.185523,60.4852108 223.954473,58.490456 221.081909,58.490456" id="Stroke-51" stroke="#95C23F" stroke-width="1.296" fill="none" stroke-linecap="round" stroke-linejoin="round"></path>
                        <line x1="221.081909" y1="58.490456" x2="221.081909" y2="55.5731163" id="Stroke-53" stroke="#95C23F" stroke-width="1.296" fill="none" stroke-linejoin="round"></line>
                        <path d="M224.036195,74.1830026 C224.036195,75.7493218 222.768278,77.0190649 221.204211,77.0190649 C219.640145,77.0190649 218.372227,75.7493218 218.372227,74.1830026" id="Fill-55" stroke="none" fill="#95C23F" fill-rule="evenodd"></path>
                        <path d="M130.455584,137.707815 L47.0510765,137.707815 C38.2058765,137.707815 31.0356912,130.527303 31.0356912,121.669796 L31.0356912,121.669796 C31.0356912,112.811857 38.2058765,105.631345 47.0510765,105.631345 L130.455584,105.631345 C139.300353,105.631345 146.470538,112.811857 146.470538,121.669796 L146.470538,121.669796 C146.470538,130.527303 139.300353,137.707815 130.455584,137.707815" id="Fill-57" stroke="none" fill="#96C23E" fill-rule="evenodd"></path>
                        <line x1="48.1728615" y1="121.669623" x2="110.539962" y2="121.669623" id="Stroke-59" stroke="#FEFEFE" stroke-width="4.32" fill="none"></line>
                        <polyline id="Stroke-61" stroke="#FEFEFE" stroke-width="1.296" fill="none" stroke-linejoin="round" points="122.800724 129.007675 130.527377 121.669796 122.593074 114.331485"></polyline>
                        <path d="M262.551819,137.481708 L179.147312,137.481708 C170.302112,137.481708 163.131926,130.301196 163.131926,121.443689 L163.131926,121.443689 C163.131926,112.58575 170.302112,105.405238 179.147312,105.405238 L262.551819,105.405238 C271.396588,105.405238 278.566773,112.58575 278.566773,121.443689 L278.566773,121.443689 C278.566773,130.301196 271.396588,137.481708 262.551819,137.481708" id="Fill-63" stroke="none" fill="#D4E4B2" fill-rule="evenodd"></path>
                        <line x1="180.269097" y1="121.443517" x2="242.636197" y2="121.443517" id="Stroke-65" stroke="#FEFEFE" stroke-width="4.32" fill="none"></line>
                        <polyline id="Stroke-67" stroke="#FEFEFE" stroke-width="1.296" fill="none" stroke-linejoin="round" points="254.897002 128.781612 262.623655 121.443733 254.689352 114.105421"></polyline>
                        <path d="M391.475197,137.481708 L308.070689,137.481708 C299.225489,137.481708 292.055304,130.301196 292.055304,121.443689 L292.055304,121.443689 C292.055304,112.58575 299.225489,105.405238 308.070689,105.405238 L391.475197,105.405238 C400.319965,105.405238 407.490151,112.58575 407.490151,121.443689 L407.490151,121.443689 C407.490151,130.301196 400.319965,137.481708 391.475197,137.481708 Z" id="Stroke-69" stroke="#3B3835" stroke-width="1.296" fill="none" stroke-linejoin="round"></path>
                        <line x1="309.192474" y1="121.443517" x2="371.559574" y2="121.443517" id="Stroke-71" stroke="#95C23F" stroke-width="4.32" fill="none"></line>
                        <polyline id="Stroke-73" stroke="#95C23F" stroke-width="1.296" fill="none" stroke-linejoin="round" points="383.820336 128.781612 391.546989 121.443733 383.612686 114.105421"></polyline>
                        <path d="M521.985046,137.368698 L438.580539,137.368698 C429.735339,137.368698 422.565153,130.188186 422.565153,121.330679 L422.565153,121.330679 C422.565153,112.47274 429.735339,105.292228 438.580539,105.292228 L521.985046,105.292228 C530.829815,105.292228 538,112.47274 538,121.330679 L538,121.330679 C538,130.188186 530.829815,137.368698 521.985046,137.368698 Z" id="Stroke-75" stroke="#3B3835" stroke-width="1.296" fill="none" stroke-linejoin="round"></path>
                        <line x1="437.598022" y1="121.330463" x2="494.198841" y2="121.330463" id="Stroke-77" stroke="#95C23F" stroke-width="4.32" fill="none"></line>
                        <path d="M358.076353,188.251676 L274.671846,188.251676 C265.826646,188.251676 258.65646,181.071164 258.65646,172.213658 L258.65646,172.213658 C258.65646,163.355718 265.826646,156.175206 274.671846,156.175206 L358.076353,156.175206 C366.921122,156.175206 374.091307,163.355718 374.091307,172.213658 L374.091307,172.213658 C374.091307,181.071164 366.921122,188.251676 358.076353,188.251676" id="Fill-85" stroke="none" fill="#96C23E" fill-rule="evenodd"></path>
                        <line x1="275.793631" y1="172.213441" x2="338.160731" y2="172.213441" id="Stroke-87" stroke="#FEFEFE" stroke-width="4.32" fill="none"></line>
                        <polyline id="Stroke-89" stroke="#FEFEFE" stroke-width="1.296" fill="none" stroke-linejoin="round" points="350.421493 179.551536 358.148146 172.213658 350.213843 164.875346"></polyline>
                        <path d="M490.172632,188.02557 L406.768124,188.02557 C397.922924,188.02557 390.752739,180.845058 390.752739,171.987551 L390.752739,171.987551 C390.752739,163.129612 397.922924,155.9491 406.768124,155.9491 L490.172632,155.9491 C499.0174,155.9491 506.187586,163.129612 506.187586,171.987551 L506.187586,171.987551 C506.187586,180.845058 499.0174,188.02557 490.172632,188.02557" id="Fill-91" stroke="none" fill="#D4E4B2" fill-rule="evenodd"></path>
                        <line x1="407.889866" y1="171.987378" x2="470.256966" y2="171.987378" id="Stroke-93" stroke="#FEFEFE" stroke-width="4.32" fill="none"></line>
                        <path d="M99.419893,188.02557 L16.0153854,188.02557 C7.17018534,188.02557 0,180.845058 0,171.987551 L0,171.987551 C0,163.129612 7.17018534,155.9491 16.0153854,155.9491 L99.419893,155.9491 C108.264661,155.9491 115.434847,163.129612 115.434847,171.987551 L115.434847,171.987551 C115.434847,180.845058 108.264661,188.02557 99.419893,188.02557 Z" id="Stroke-97" stroke="#3B3835" stroke-width="1.296" fill="none" stroke-linejoin="round"></path>
                        <line x1="17.1371704" y1="171.987378" x2="79.5042705" y2="171.987378" id="Stroke-99" stroke="#95C23F" stroke-width="4.32" fill="none"></line>
                        <polyline id="Stroke-101" stroke="#95C23F" stroke-width="1.296" fill="none" stroke-linejoin="round" points="91.7650327 179.32543 99.4916855 171.987551 91.5573827 164.64924"></polyline>
                        <path d="M229.929699,187.912516 L146.525192,187.912516 C137.679992,187.912516 130.509806,180.732004 130.509806,171.874497 L130.509806,171.874497 C130.509806,163.016558 137.679992,155.836046 146.525192,155.836046 L229.929699,155.836046 C238.774468,155.836046 245.944653,163.016558 245.944653,171.874497 L245.944653,171.874497 C245.944653,180.732004 238.774468,187.912516 229.929699,187.912516 Z" id="Stroke-103" stroke="#3B3835" stroke-width="1.296" fill="none" stroke-linejoin="round"></path>
                        <line x1="145.542675" y1="171.874324" x2="202.143494" y2="171.874324" id="Stroke-105" stroke="#95C23F" stroke-width="4.32" fill="none"></line>
                        <path d="M221.081909,163.782641 C218.209345,163.782641 215.978295,165.777396 215.378225,168.848644 C215.371318,168.880204 215.364842,168.911763 215.359662,168.943756 C215.347142,169.006011 215.33635,169.069563 215.327284,169.132682 C215.325125,169.14522 215.322967,169.15819 215.322103,169.171159 C215.281523,169.445254 215.26037,169.72497 215.26037,170.010738 C215.267277,170.132221 215.260801,170.511804 215.26037,170.635017 C215.26037,172.486239 214.511362,174.16237 213.299998,175.375478 C213.032341,175.64352 212.866566,176.014024 212.866997,176.422573 C212.866566,176.991082 213.216247,177.50728 213.656586,177.732955 C214.311051,178.069305 217.166778,179.475231 221.081909,179.475231 C224.99704,179.475231 227.852767,178.069305 228.507232,177.732955 C228.947571,177.50728 229.297252,176.991082 229.296821,176.422573 C229.297252,176.014024 229.131477,175.64352 228.86382,175.375478 C227.652456,174.16237 226.903017,172.486239 226.903017,170.635017 C226.903017,170.511804 226.896541,170.132221 226.903449,170.010305 C226.903449,169.72497 226.882295,169.445254 226.841715,169.171159 C226.840851,169.15819 226.838693,169.14522 226.836966,169.132682 C226.827469,169.06913 226.816676,169.006011 226.804156,168.943756 C226.798976,168.911763 226.7925,168.880204 226.786025,168.848644 C226.185523,165.777396 223.954473,163.782641 221.081909,163.782641" id="Stroke-107" stroke="#95C23F" stroke-width="1.296" fill="none" stroke-linecap="round" stroke-linejoin="round"></path>
                        <line x1="221.081909" y1="163.782641" x2="221.081909" y2="160.865301" id="Stroke-109" stroke="#95C23F" stroke-width="1.296" fill="none" stroke-linejoin="round"></line>
                        <path d="M224.036195,179.475231 C224.036195,181.04155 222.768278,182.311293 221.204211,182.311293 C219.640145,182.311293 218.372227,181.04155 218.372227,179.475231" id="Fill-111" stroke="none" fill="#95C23F" fill-rule="evenodd"></path>
                        <path d="M130.455584,243 L47.0510765,243 C38.2058765,243 31.0356912,235.819488 31.0356912,226.961981 L31.0356912,226.961981 C31.0356912,218.104042 38.2058765,210.92353 47.0510765,210.92353 L130.455584,210.92353 C139.300353,210.92353 146.470538,218.104042 146.470538,226.961981 L146.470538,226.961981 C146.470538,235.819488 139.300353,243 130.455584,243" id="Fill-113" stroke="none" fill="#96C23E" fill-rule="evenodd"></path>
                        <line x1="48.1728615" y1="226.961808" x2="110.539962" y2="226.961808" id="Stroke-115" stroke="#FEFEFE" stroke-width="4.32" fill="none"></line>
                        <polyline id="Stroke-117" stroke="#FEFEFE" stroke-width="1.296" fill="none" stroke-linejoin="round" points="122.800724 234.299903 130.527377 226.962024 122.593074 219.623713"></polyline>
                        <path d="M262.551819,242.773936 L179.147312,242.773936 C170.302112,242.773936 163.131926,235.593424 163.131926,226.735918 L163.131926,226.735918 C163.131926,217.877979 170.302112,210.697467 179.147312,210.697467 L262.551819,210.697467 C271.396588,210.697467 278.566773,217.877979 278.566773,226.735918 L278.566773,226.735918 C278.566773,235.593424 271.396588,242.773936 262.551819,242.773936" id="Fill-119" stroke="none" fill="#D4E4B2" fill-rule="evenodd"></path>
                        <line x1="180.269097" y1="226.735745" x2="242.636197" y2="226.735745" id="Stroke-121" stroke="#FEFEFE" stroke-width="4.32" fill="none"></line>
                        <polyline id="Stroke-123" stroke="#FEFEFE" stroke-width="1.296" fill="none" stroke-linejoin="round" points="254.897002 234.073797 262.623655 226.735918 254.689352 219.397606"></polyline>
                        <path d="M391.475197,242.773936 L308.070689,242.773936 C299.225489,242.773936 292.055304,235.593424 292.055304,226.735918 L292.055304,226.735918 C292.055304,217.877979 299.225489,210.697467 308.070689,210.697467 L391.475197,210.697467 C400.319965,210.697467 407.490151,217.877979 407.490151,226.735918 L407.490151,226.735918 C407.490151,235.593424 400.319965,242.773936 391.475197,242.773936 Z" id="Stroke-125" stroke="#3B3835" stroke-width="1.296" fill="none" stroke-linejoin="round"></path>
                        <line x1="309.192474" y1="226.735745" x2="371.559574" y2="226.735745" id="Stroke-127" stroke="#95C23F" stroke-width="4.32" fill="none"></line>
                        <polyline id="Stroke-129" stroke="#95C23F" stroke-width="1.296" fill="none" stroke-linejoin="round" points="383.820336 234.073797 391.546989 226.735918 383.612686 219.397606"></polyline>
                        <path d="M521.985046,242.660883 L438.580539,242.660883 C429.735339,242.660883 422.565153,235.480371 422.565153,226.622864 L422.565153,226.622864 C422.565153,217.764925 429.735339,210.584413 438.580539,210.584413 L521.985046,210.584413 C530.829815,210.584413 538,217.764925 538,226.622864 L538,226.622864 C538,235.480371 530.829815,242.660883 521.985046,242.660883 Z" id="Stroke-131" stroke="#3B3835" stroke-width="1.296" fill="none" stroke-linejoin="round"></path>
                        <line x1="437.598022" y1="226.622691" x2="494.198841" y2="226.622691" id="Stroke-133" stroke="#95C23F" stroke-width="4.32" fill="none"></line>
                    </g>
                </g>
            </g>
        </g>
    </g>
</svg>