<?xml version="1.0" encoding="UTF-8"?>
<svg width="240px" height="23px" viewBox="0 0 240 23" version="1.1" xmlns="http://www.w3.org/2000/svg" xmlns:xlink="http://www.w3.org/1999/xlink">
    <title>Large/Default Copy 20</title>
    <defs>
        <polygon id="path-1" points="0.133453818 1.25813244 1.42794682 0 7.384616 5.93353277 1.294493 12 8.8817842e-16 10.7418686 4.82671754 5.93375898"></polygon>
    </defs>
    <g id="David-skissar" stroke="none" stroke-width="1" fill="none" fill-rule="evenodd">
        <g id="Artboard" transform="translate(-1183, -101)">
            <g id="Large/Default-Copy-20" transform="translate(1183, 101.3242)">
                <g id="✏️-TEXT" transform="translate(20, 0)" fill="#822998" fill-rule="nonzero">
                    <g transform="translate(1.6963, 0)">
                        <polygon id="Path" points="7.26855469 13.6757812 0 13.6757812 0 0.826171875 7.26855469 0.826171875 7.26855469 2.6015625 2.10058594 2.6015625 2.10058594 6.09960937 6.94335937 6.09960937 6.94335937 7.85742188 2.10058594 7.85742188 2.10058594 11.8916016 7.26855469 11.8916016"></polygon>
                        <path d="M18.3779297,13.6757812 L16.3037109,13.6757812 L16.3037109,7.69921875 C16.3037109,6.94921875 16.152832,6.38964844 15.8510742,6.02050781 C15.5493164,5.65136719 15.0703125,5.46679687 14.4140625,5.46679687 C13.5410156,5.46679687 12.9023437,5.72460937 12.4980469,6.24023438 C12.09375,6.75585938 11.8916016,7.62011719 11.8916016,8.83300781 L11.8916016,13.6757812 L9.82617188,13.6757812 L9.82617188,3.95507812 L11.4433594,3.95507812 L11.7333984,5.22949219 L11.8388672,5.22949219 C12.1318359,4.76660156 12.5478516,4.40917969 13.0869141,4.15722656 C13.6259766,3.90527344 14.2236328,3.77929688 14.8798828,3.77929688 C17.2119141,3.77929688 18.3779297,4.96582031 18.3779297,7.33886719 L18.3779297,13.6757812 Z" id="Path"></path>
                        <polygon id="Path" points="27.9931641 13.6757812 25.9277344 13.6757812 25.9277344 0 27.9931641 0"></polygon>
                        <path d="M37.0283203,13.6757812 L36.6152344,12.3222656 L36.5449219,12.3222656 C36.0761719,12.9140625 35.6044922,13.3168945 35.1298828,13.5307617 C34.6552734,13.7446289 34.0458984,13.8515625 33.3017578,13.8515625 C32.3466797,13.8515625 31.6010742,13.59375 31.0649414,13.078125 C30.5288086,12.5625 30.2607422,11.8330078 30.2607422,10.8896484 C30.2607422,9.88769531 30.6328125,9.13183594 31.3769531,8.62207031 C32.1210937,8.11230469 33.2548828,7.83398438 34.7783203,7.78710938 L36.4570312,7.734375 L36.4570312,7.21582031 C36.4570312,6.59472656 36.3120117,6.13037109 36.0219727,5.82275391 C35.7319336,5.51513672 35.2822266,5.36132812 34.6728516,5.36132812 C34.1748047,5.36132812 33.6972656,5.43457031 33.2402344,5.58105469 C32.7832031,5.72753906 32.34375,5.90039062 31.921875,6.09960938 L31.2539062,4.62304688 C31.78125,4.34765625 32.3583984,4.13818359 32.9853516,3.99462891 C33.6123047,3.85107422 34.2041016,3.77929688 34.7607422,3.77929688 C35.9970703,3.77929688 36.9301758,4.04882812 37.5600586,4.58789063 C38.1899414,5.12695313 38.5048828,5.97363281 38.5048828,7.12792969 L38.5048828,13.6757812 L37.0283203,13.6757812 Z M33.9521484,12.2695312 C34.7021484,12.2695312 35.3041992,12.0600586 35.7583008,11.6411133 C36.2124023,11.222168 36.4394531,10.6347656 36.4394531,9.87890625 L36.4394531,9.03515625 L35.1914062,9.08789062 C34.21875,9.12304688 33.5112305,9.28564453 33.0688477,9.57568359 C32.6264648,9.86572266 32.4052734,10.3095703 32.4052734,10.9072266 C32.4052734,11.3408203 32.5341797,11.6762695 32.7919922,11.9135742 C33.0498047,12.1508789 33.4365234,12.2695312 33.9521484,12.2695312 Z M31.9482422,1.37988281 C31.9482422,1.01660156 32.0463867,0.754394531 32.2426758,0.593261719 C32.4389648,0.432128906 32.6777344,0.3515625 32.9589844,0.3515625 C33.2695312,0.3515625 33.5170898,0.442382813 33.7016602,0.624023437 C33.8862305,0.805664063 33.9785156,1.05761719 33.9785156,1.37988281 C33.9785156,1.69042969 33.8847656,1.93945312 33.6972656,2.12695312 C33.5097656,2.31445313 33.2636719,2.40820312 32.9589844,2.40820312 C32.6777344,2.40820312 32.4389648,2.32324219 32.2426758,2.15332031 C32.0463867,1.98339844 31.9482422,1.72558594 31.9482422,1.37988281 Z M35.4023438,1.37988281 C35.4023438,1.01660156 35.5004883,0.754394531 35.6967773,0.593261719 C35.8930664,0.432128906 36.1318359,0.3515625 36.4130859,0.3515625 C36.7236328,0.3515625 36.9726562,0.442382813 37.1601562,0.624023437 C37.3476562,0.805664063 37.4414062,1.05761719 37.4414062,1.37988281 C37.4414062,1.69628906 37.3447266,1.94677734 37.1513672,2.13134766 C36.9580078,2.31591797 36.7119141,2.40820312 36.4130859,2.40820312 C36.1318359,2.40820312 35.8930664,2.32324219 35.6967773,2.15332031 C35.5004883,1.98339844 35.4023438,1.72558594 35.4023438,1.37988281 Z" id="Shape"></path>
                        <path d="M49.9394531,13.6757812 L47.8652344,13.6757812 L47.8652344,7.69921875 C47.8652344,6.94921875 47.7143555,6.38964844 47.4125977,6.02050781 C47.1108398,5.65136719 46.6318359,5.46679687 45.9755859,5.46679687 C45.1025391,5.46679687 44.4638672,5.72460937 44.0595703,6.24023438 C43.6552734,6.75585938 43.453125,7.62011719 43.453125,8.83300781 L43.453125,13.6757812 L41.3876953,13.6757812 L41.3876953,3.95507812 L43.0048828,3.95507812 L43.2949219,5.22949219 L43.4003906,5.22949219 C43.6933594,4.76660156 44.109375,4.40917969 44.6484375,4.15722656 C45.1875,3.90527344 45.7851562,3.77929688 46.4414062,3.77929688 C48.7734375,3.77929688 49.9394531,4.96582031 49.9394531,7.33886719 L49.9394531,13.6757812 Z" id="Path"></path>
                        <polygon id="Path" points="54.8085938 8.54296875 55.9775391 7.08398437 58.9130859 3.95507813 61.2949219 3.95507813 57.3837891 8.12988281 61.5410156 13.6757812 59.1152344 13.6757812 55.9951172 9.41308594 54.8613281 10.3447266 54.8613281 13.6757812 52.8134766 13.6757812 52.8134766 0 54.8613281 0 54.8613281 6.67089844 54.7558594 8.54296875"></polygon>
                        <path d="M69.8466797,13.6757812 L67.78125,13.6757812 L67.78125,3.95507812 L69.8466797,3.95507812 L69.8466797,13.6757812 Z M67.6582031,1.37988281 C67.6582031,1.01074219 67.7592773,0.7265625 67.9614258,0.52734375 C68.1635742,0.328125 68.4521484,0.228515625 68.8271484,0.228515625 C69.1904297,0.228515625 69.4731445,0.328125 69.675293,0.52734375 C69.8774414,0.7265625 69.9785156,1.01074219 69.9785156,1.37988281 C69.9785156,1.73144531 69.8774414,2.00830078 69.675293,2.21044922 C69.4731445,2.41259766 69.1904297,2.51367188 68.8271484,2.51367188 C68.4521484,2.51367188 68.1635742,2.41259766 67.9614258,2.21044922 C67.7592773,2.00830078 67.6582031,1.73144531 67.6582031,1.37988281 Z" id="Shape"></path>
                        <path d="M80.7539062,13.8515625 C79.5410156,13.8515625 78.5947266,13.4121094 77.9150391,12.5332031 C77.2353516,11.6542969 76.8955078,10.4208984 76.8955078,8.83300781 C76.8955078,7.23925781 77.2397461,5.99853516 77.9282227,5.11083984 C78.6166992,4.22314453 79.5703125,3.77929688 80.7890625,3.77929688 C82.0664062,3.77929688 83.0390625,4.25097656 83.7070312,5.19433594 L83.8125,5.19433594 C83.7128906,4.49707031 83.6630859,3.94628906 83.6630859,3.54199219 L83.6630859,0 L85.7373047,0 L85.7373047,13.6757813 L84.1201172,13.6757813 L83.7597656,12.4013672 L83.6630859,12.4013672 C83.0009766,13.3681641 82.03125,13.8515625 80.7539062,13.8515625 Z M81.3076172,12.1816406 C82.1572266,12.1816406 82.7753906,11.9428711 83.1621094,11.465332 C83.5488281,10.987793 83.7480469,10.2128906 83.7597656,9.140625 L83.7597656,8.85058594 C83.7597656,7.62597656 83.5605469,6.75585938 83.1621094,6.24023437 C82.7636719,5.72460938 82.1396484,5.46679688 81.2900391,5.46679688 C80.5634766,5.46679688 80.0039062,5.76123047 79.6113281,6.35009766 C79.21875,6.93896484 79.0224609,7.77832031 79.0224609,8.86816406 C79.0224609,9.94628906 79.2128906,10.7680664 79.59375,11.3334961 C79.9746094,11.8989258 80.5458984,12.1816406 81.3076172,12.1816406 Z" id="Shape"></path>
                        <path d="M92.9355469,13.8515625 C91.4238281,13.8515625 90.2416992,13.4106445 89.3891602,12.5288086 C88.5366211,11.6469727 88.1103516,10.4326172 88.1103516,8.88574219 C88.1103516,7.29785156 88.5058594,6.04980469 89.296875,5.14160156 C90.0878906,4.23339844 91.1748047,3.77929688 92.5576172,3.77929688 C93.8408203,3.77929688 94.8544922,4.16894531 95.5986328,4.94824219 C96.3427734,5.72753906 96.7148438,6.79980469 96.7148438,8.16503906 L96.7148438,9.28125 L90.2373047,9.28125 C90.2666016,10.2246094 90.5214844,10.949707 91.0019531,11.456543 C91.4824219,11.9633789 92.1591797,12.2167969 93.0322266,12.2167969 C93.6064453,12.2167969 94.1411133,12.1625977 94.6362305,12.0541992 C95.1313477,11.9458008 95.6630859,11.765625 96.2314453,11.5136719 L96.2314453,13.1923828 C95.7275391,13.4326172 95.2177734,13.6025391 94.7021484,13.7021484 C94.1865234,13.8017578 93.5976562,13.8515625 92.9355469,13.8515625 Z M92.5576172,5.34375 C91.9013672,5.34375 91.3754883,5.55175781 90.9799805,5.96777344 C90.5844727,6.38378906 90.3486328,6.99023438 90.2724609,7.78710938 L94.6845703,7.78710938 C94.6728516,6.984375 94.4794922,6.37646484 94.1044922,5.96337891 C93.7294922,5.55029297 93.2138672,5.34375 92.5576172,5.34375 Z" id="Shape"></path>
                        <path d="M105.591797,10.9072266 C105.591797,11.8564453 105.246094,12.5844727 104.554688,13.0913086 C103.863281,13.5981445 102.873047,13.8515625 101.583984,13.8515625 C100.289062,13.8515625 99.2490234,13.6552734 98.4638672,13.2626953 L98.4638672,11.4785156 C99.6064453,12.0058594 100.669922,12.2695313 101.654297,12.2695313 C102.925781,12.2695313 103.561523,11.8857422 103.561523,11.1181641 C103.561523,10.8720703 103.491211,10.6669922 103.350586,10.5029297 C103.209961,10.3388672 102.978516,10.1689453 102.65625,9.99316406 C102.333984,9.81738281 101.885742,9.61816406 101.311523,9.39550781 C100.192383,8.96191406 99.4350586,8.52832031 99.0395508,8.09472656 C98.644043,7.66113281 98.4462891,7.09863281 98.4462891,6.40722656 C98.4462891,5.57519531 98.7817383,4.92919922 99.4526367,4.46923828 C100.123535,4.00927734 101.036133,3.77929688 102.19043,3.77929688 C103.333008,3.77929688 104.414062,4.01074219 105.433594,4.47363281 L104.765625,6.02929688 C103.716797,5.59570313 102.834961,5.37890625 102.120117,5.37890625 C101.030273,5.37890625 100.485352,5.68945313 100.485352,6.31054687 C100.485352,6.61523438 100.627441,6.87304687 100.911621,7.08398438 C101.195801,7.29492188 101.81543,7.58496094 102.770508,7.95410156 C103.573242,8.26464844 104.15625,8.54882812 104.519531,8.80664062 C104.882812,9.06445312 105.152344,9.36181641 105.328125,9.69873047 C105.503906,10.0356445 105.591797,10.4384766 105.591797,10.9072266 Z" id="Path"></path>
                        <path d="M114.354492,10.9072266 C114.354492,11.8564453 114.008789,12.5844727 113.317383,13.0913086 C112.625977,13.5981445 111.635742,13.8515625 110.34668,13.8515625 C109.051758,13.8515625 108.011719,13.6552734 107.226562,13.2626953 L107.226562,11.4785156 C108.369141,12.0058594 109.432617,12.2695313 110.416992,12.2695313 C111.688477,12.2695313 112.324219,11.8857422 112.324219,11.1181641 C112.324219,10.8720703 112.253906,10.6669922 112.113281,10.5029297 C111.972656,10.3388672 111.741211,10.1689453 111.418945,9.99316406 C111.09668,9.81738281 110.648438,9.61816406 110.074219,9.39550781 C108.955078,8.96191406 108.197754,8.52832031 107.802246,8.09472656 C107.406738,7.66113281 107.208984,7.09863281 107.208984,6.40722656 C107.208984,5.57519531 107.544434,4.92919922 108.215332,4.46923828 C108.88623,4.00927734 109.798828,3.77929688 110.953125,3.77929688 C112.095703,3.77929688 113.176758,4.01074219 114.196289,4.47363281 L113.52832,6.02929688 C112.479492,5.59570313 111.597656,5.37890625 110.882812,5.37890625 C109.792969,5.37890625 109.248047,5.68945313 109.248047,6.31054687 C109.248047,6.61523438 109.390137,6.87304687 109.674316,7.08398438 C109.958496,7.29492188 110.578125,7.58496094 111.533203,7.95410156 C112.335938,8.26464844 112.918945,8.54882812 113.282227,8.80664062 C113.645508,9.06445312 113.915039,9.36181641 114.09082,9.69873047 C114.266602,10.0356445 114.354492,10.4384766 114.354492,10.9072266 Z" id="Path"></path>
                        <path d="M129.884766,8.79785156 C129.884766,10.3857422 129.477539,11.625 128.663086,12.515625 C127.848633,13.40625 126.714844,13.8515625 125.261719,13.8515625 C124.353516,13.8515625 123.550781,13.6464844 122.853516,13.2363281 C122.15625,12.8261719 121.620117,12.2373047 121.245117,11.4697266 C120.870117,10.7021484 120.682617,9.81152344 120.682617,8.79785156 C120.682617,7.22167969 121.086914,5.99121094 121.895508,5.10644531 C122.704102,4.22167969 123.84375,3.77929688 125.314453,3.77929688 C126.720703,3.77929688 127.833984,4.23193359 128.654297,5.13720703 C129.474609,6.04248047 129.884766,7.26269531 129.884766,8.79785156 Z M122.80957,8.79785156 C122.80957,11.0419922 123.638672,12.1640625 125.296875,12.1640625 C126.9375,12.1640625 127.757812,11.0419922 127.757812,8.79785156 C127.757812,6.57714844 126.931641,5.46679688 125.279297,5.46679688 C124.412109,5.46679688 123.783691,5.75390625 123.394043,6.328125 C123.004395,6.90234375 122.80957,7.72558594 122.80957,8.79785156 Z" id="Shape"></path>
                        <polygon id="Path" points="134.323242 13.6757812 132.257812 13.6757812 132.257812 0 134.323242 0"></polygon>
                        <path d="M139.341797,13.6757812 L137.276367,13.6757812 L137.276367,3.95507812 L139.341797,3.95507812 L139.341797,13.6757812 Z M137.15332,1.37988281 C137.15332,1.01074219 137.254395,0.7265625 137.456543,0.52734375 C137.658691,0.328125 137.947266,0.228515625 138.322266,0.228515625 C138.685547,0.228515625 138.968262,0.328125 139.17041,0.52734375 C139.372559,0.7265625 139.473633,1.01074219 139.473633,1.37988281 C139.473633,1.73144531 139.372559,2.00830078 139.17041,2.21044922 C138.968262,2.41259766 138.685547,2.51367188 138.322266,2.51367188 C137.947266,2.51367188 137.658691,2.41259766 137.456543,2.21044922 C137.254395,2.00830078 137.15332,1.73144531 137.15332,1.37988281 Z" id="Shape"></path>
                        <polygon id="Path" points="144.290039 8.54296875 145.458984 7.08398437 148.394531 3.95507813 150.776367 3.95507813 146.865234 8.12988281 151.022461 13.6757812 148.59668 13.6757812 145.476562 9.41308594 144.342773 10.3447266 144.342773 13.6757812 142.294922 13.6757812 142.294922 0 144.342773 0 144.342773 6.67089844 144.237305 8.54296875"></polygon>
                        <path d="M158.668945,13.6757812 L158.255859,12.3222656 L158.185547,12.3222656 C157.716797,12.9140625 157.245117,13.3168945 156.770508,13.5307617 C156.295898,13.7446289 155.686523,13.8515625 154.942383,13.8515625 C153.987305,13.8515625 153.241699,13.59375 152.705566,13.078125 C152.169434,12.5625 151.901367,11.8330078 151.901367,10.8896484 C151.901367,9.88769531 152.273438,9.13183594 153.017578,8.62207031 C153.761719,8.11230469 154.895508,7.83398438 156.418945,7.78710938 L158.097656,7.734375 L158.097656,7.21582031 C158.097656,6.59472656 157.952637,6.13037109 157.662598,5.82275391 C157.372559,5.51513672 156.922852,5.36132812 156.313477,5.36132812 C155.81543,5.36132812 155.337891,5.43457031 154.880859,5.58105469 C154.423828,5.72753906 153.984375,5.90039062 153.5625,6.09960938 L152.894531,4.62304688 C153.421875,4.34765625 153.999023,4.13818359 154.625977,3.99462891 C155.25293,3.85107422 155.844727,3.77929688 156.401367,3.77929688 C157.637695,3.77929688 158.570801,4.04882813 159.200684,4.58789063 C159.830566,5.12695313 160.145508,5.97363281 160.145508,7.12792969 L160.145508,13.6757812 L158.668945,13.6757812 Z M155.592773,12.2695312 C156.342773,12.2695312 156.944824,12.0600586 157.398926,11.6411133 C157.853027,11.222168 158.080078,10.6347656 158.080078,9.87890625 L158.080078,9.03515625 L156.832031,9.08789062 C155.859375,9.12304688 155.151855,9.28564453 154.709473,9.57568359 C154.26709,9.86572266 154.045898,10.3095703 154.045898,10.9072266 C154.045898,11.3408203 154.174805,11.6762695 154.432617,11.9135742 C154.69043,12.1508789 155.077148,12.2695312 155.592773,12.2695312 Z" id="Shape"></path>
                        <path d="M174.234375,10.9072266 C174.234375,11.8564453 173.888672,12.5844727 173.197266,13.0913086 C172.505859,13.5981445 171.515625,13.8515625 170.226562,13.8515625 C168.931641,13.8515625 167.891602,13.6552734 167.106445,13.2626953 L167.106445,11.4785156 C168.249023,12.0058594 169.3125,12.2695313 170.296875,12.2695313 C171.568359,12.2695313 172.204102,11.8857422 172.204102,11.1181641 C172.204102,10.8720703 172.133789,10.6669922 171.993164,10.5029297 C171.852539,10.3388672 171.621094,10.1689453 171.298828,9.99316406 C170.976562,9.81738281 170.52832,9.61816406 169.954102,9.39550781 C168.834961,8.96191406 168.077637,8.52832031 167.682129,8.09472656 C167.286621,7.66113281 167.088867,7.09863281 167.088867,6.40722656 C167.088867,5.57519531 167.424316,4.92919922 168.095215,4.46923828 C168.766113,4.00927734 169.678711,3.77929688 170.833008,3.77929688 C171.975586,3.77929688 173.056641,4.01074219 174.076172,4.47363281 L173.408203,6.02929688 C172.359375,5.59570313 171.477539,5.37890625 170.762695,5.37890625 C169.672852,5.37890625 169.12793,5.68945313 169.12793,6.31054687 C169.12793,6.61523438 169.27002,6.87304687 169.554199,7.08398438 C169.838379,7.29492188 170.458008,7.58496094 171.413086,7.95410156 C172.21582,8.26464844 172.798828,8.54882812 173.162109,8.80664062 C173.525391,9.06445312 173.794922,9.36181641 173.970703,9.69873047 C174.146484,10.0356445 174.234375,10.4384766 174.234375,10.9072266 Z" id="Path"></path>
                        <path d="M180.087891,12.1816406 C180.591797,12.1816406 181.095703,12.1025391 181.599609,11.9443359 L181.599609,13.5 C181.371094,13.5996094 181.07666,13.6831055 180.716309,13.7504883 C180.355957,13.8178711 179.982422,13.8515625 179.595703,13.8515625 C177.638672,13.8515625 176.660156,12.8203125 176.660156,10.7578125 L176.660156,5.51953125 L175.333008,5.51953125 L175.333008,4.60546875 L176.756836,3.84960937 L177.459961,1.79296875 L178.734375,1.79296875 L178.734375,3.95507813 L181.50293,3.95507813 L181.50293,5.51953125 L178.734375,5.51953125 L178.734375,10.7226563 C178.734375,11.2207031 178.858887,11.5883789 179.10791,11.8256836 C179.356934,12.0629883 179.683594,12.1816406 180.087891,12.1816406 Z" id="Path"></path>
                        <path d="M189.624023,13.6757812 L189.210938,12.3222656 L189.140625,12.3222656 C188.671875,12.9140625 188.200195,13.3168945 187.725586,13.5307617 C187.250977,13.7446289 186.641602,13.8515625 185.897461,13.8515625 C184.942383,13.8515625 184.196777,13.59375 183.660645,13.078125 C183.124512,12.5625 182.856445,11.8330078 182.856445,10.8896484 C182.856445,9.88769531 183.228516,9.13183594 183.972656,8.62207031 C184.716797,8.11230469 185.850586,7.83398438 187.374023,7.78710938 L189.052734,7.734375 L189.052734,7.21582031 C189.052734,6.59472656 188.907715,6.13037109 188.617676,5.82275391 C188.327637,5.51513672 187.87793,5.36132812 187.268555,5.36132812 C186.770508,5.36132812 186.292969,5.43457031 185.835938,5.58105469 C185.378906,5.72753906 184.939453,5.90039062 184.517578,6.09960938 L183.849609,4.62304688 C184.376953,4.34765625 184.954102,4.13818359 185.581055,3.99462891 C186.208008,3.85107422 186.799805,3.77929688 187.356445,3.77929688 C188.592773,3.77929688 189.525879,4.04882813 190.155762,4.58789063 C190.785645,5.12695313 191.100586,5.97363281 191.100586,7.12792969 L191.100586,13.6757812 L189.624023,13.6757812 Z M186.547852,12.2695312 C187.297852,12.2695312 187.899902,12.0600586 188.354004,11.6411133 C188.808105,11.222168 189.035156,10.6347656 189.035156,9.87890625 L189.035156,9.03515625 L187.787109,9.08789062 C186.814453,9.12304688 186.106934,9.28564453 185.664551,9.57568359 C185.222168,9.86572266 185.000977,10.3095703 185.000977,10.9072266 C185.000977,11.3408203 185.129883,11.6762695 185.387695,11.9135742 C185.645508,12.1508789 186.032227,12.2695312 186.547852,12.2695312 Z" id="Shape"></path>
                        <path d="M197.604492,12.1816406 C198.108398,12.1816406 198.612305,12.1025391 199.116211,11.9443359 L199.116211,13.5 C198.887695,13.5996094 198.593262,13.6831055 198.23291,13.7504883 C197.872559,13.8178711 197.499023,13.8515625 197.112305,13.8515625 C195.155273,13.8515625 194.176758,12.8203125 194.176758,10.7578125 L194.176758,5.51953125 L192.849609,5.51953125 L192.849609,4.60546875 L194.273438,3.84960937 L194.976562,1.79296875 L196.250977,1.79296875 L196.250977,3.95507813 L199.019531,3.95507813 L199.019531,5.51953125 L196.250977,5.51953125 L196.250977,10.7226563 C196.250977,11.2207031 196.375488,11.5883789 196.624512,11.8256836 C196.873535,12.0629883 197.200195,12.1816406 197.604492,12.1816406 Z" id="Path"></path>
                        <path d="M205.303711,13.8515625 C203.791992,13.8515625 202.609863,13.4106445 201.757324,12.5288086 C200.904785,11.6469727 200.478516,10.4326172 200.478516,8.88574219 C200.478516,7.29785156 200.874023,6.04980469 201.665039,5.14160156 C202.456055,4.23339844 203.542969,3.77929688 204.925781,3.77929688 C206.208984,3.77929688 207.222656,4.16894531 207.966797,4.94824219 C208.710938,5.72753906 209.083008,6.79980469 209.083008,8.16503906 L209.083008,9.28125 L202.605469,9.28125 C202.634766,10.2246094 202.889648,10.949707 203.370117,11.456543 C203.850586,11.9633789 204.527344,12.2167969 205.400391,12.2167969 C205.974609,12.2167969 206.509277,12.1625977 207.004395,12.0541992 C207.499512,11.9458008 208.03125,11.765625 208.599609,11.5136719 L208.599609,13.1923828 C208.095703,13.4326172 207.585938,13.6025391 207.070312,13.7021484 C206.554688,13.8017578 205.96582,13.8515625 205.303711,13.8515625 Z M204.925781,5.34375 C204.269531,5.34375 203.743652,5.55175781 203.348145,5.96777344 C202.952637,6.38378906 202.716797,6.99023438 202.640625,7.78710938 L207.052734,7.78710938 C207.041016,6.984375 206.847656,6.37646484 206.472656,5.96337891 C206.097656,5.55029297 205.582031,5.34375 204.925781,5.34375 Z" id="Shape"></path>
                        <path d="M217.959961,10.9072266 C217.959961,11.8564453 217.614258,12.5844727 216.922852,13.0913086 C216.231445,13.5981445 215.241211,13.8515625 213.952148,13.8515625 C212.657227,13.8515625 211.617188,13.6552734 210.832031,13.2626953 L210.832031,11.4785156 C211.974609,12.0058594 213.038086,12.2695313 214.022461,12.2695313 C215.293945,12.2695313 215.929688,11.8857422 215.929688,11.1181641 C215.929688,10.8720703 215.859375,10.6669922 215.71875,10.5029297 C215.578125,10.3388672 215.34668,10.1689453 215.024414,9.99316406 C214.702148,9.81738281 214.253906,9.61816406 213.679688,9.39550781 C212.560547,8.96191406 211.803223,8.52832031 211.407715,8.09472656 C211.012207,7.66113281 210.814453,7.09863281 210.814453,6.40722656 C210.814453,5.57519531 211.149902,4.92919922 211.820801,4.46923828 C212.491699,4.00927734 213.404297,3.77929688 214.558594,3.77929688 C215.701172,3.77929688 216.782227,4.01074219 217.801758,4.47363281 L217.133789,6.02929688 C216.084961,5.59570313 215.203125,5.37890625 214.488281,5.37890625 C213.398438,5.37890625 212.853516,5.68945313 212.853516,6.31054687 C212.853516,6.61523438 212.995605,6.87304687 213.279785,7.08398438 C213.563965,7.29492188 214.183594,7.58496094 215.138672,7.95410156 C215.941406,8.26464844 216.524414,8.54882812 216.887695,8.80664062 C217.250977,9.06445312 217.520508,9.36181641 217.696289,9.69873047 C217.87207,10.0356445 217.959961,10.4384766 217.959961,10.9072266 Z" id="Path"></path>
                    </g>
                    <g id="Decorations" transform="translate(0, 20.7588)">
                        <polygon id="Path" points="0 0.0517578125 10.0458984 0.0517578125 10.0458984 0.948242188 0 0.948242188"></polygon>
                        <polygon id="Path" points="10.0458984 0.0517578125 21.4716797 0.0517578125 21.4716797 0.948242188 10.0458984 0.948242188"></polygon>
                        <polygon id="Path" points="21.4716797 0.948242188 26.1474609 0.948242188 26.1474609 0.0517578125 21.4716797 0.0517578125"></polygon>
                        <polygon id="Path" points="26.1474609 0.0517578125 31.1660156 0.0517578125 31.1660156 0.948242188 26.1474609 0.948242188"></polygon>
                        <polygon id="Path" points="31.1660156 0.0517578125 41.6074219 0.0517578125 41.6074219 0.948242188 31.1660156 0.948242188"></polygon>
                        <polygon id="Path" points="41.6074219 0.0517578125 53.0332031 0.0517578125 53.0332031 0.948242188 41.6074219 0.948242188"></polygon>
                        <polygon id="Path" points="53.0332031 0.0517578125 63.3251953 0.0517578125 63.3251953 0.948242188 53.0332031 0.948242188"></polygon>
                        <polygon id="Path" points="63.3251953 0.948242188 68.0009766 0.948242188 68.0009766 0.0517578125 63.3251953 0.0517578125"></polygon>
                        <polygon id="Path" points="68.0009766 0.0517578125 73.0195312 0.0517578125 73.0195312 0.948242188 68.0009766 0.948242188"></polygon>
                        <polygon id="Path" points="73.0195312 0.948242188 77.6953125 0.948242188 77.6953125 0.0517578125 73.0195312 0.0517578125"></polygon>
                        <polygon id="Path" points="77.6953125 0.0517578125 88.9101562 0.0517578125 88.9101562 0.948242188 77.6953125 0.948242188"></polygon>
                        <polygon id="Path" points="88.9101562 0.0517578125 99.28125 0.0517578125 99.28125 0.948242188 88.9101562 0.948242188"></polygon>
                        <polygon id="Path" points="99.28125 0.0517578125 108.043945 0.0517578125 108.043945 0.948242188 99.28125 0.948242188"></polygon>
                        <polygon id="Path" points="108.043945 0.0517578125 116.806641 0.0517578125 116.806641 0.948242188 108.043945 0.948242188"></polygon>
                        <polygon id="Path" points="116.806641 0.948242188 121.482422 0.948242188 121.482422 0.0517578125 116.806641 0.0517578125"></polygon>
                        <polygon id="Path" points="121.482422 0.0517578125 132.477539 0.0517578125 132.477539 0.948242188 121.482422 0.948242188"></polygon>
                        <polygon id="Path" points="132.477539 0.0517578125 137.496094 0.0517578125 137.496094 0.948242188 132.477539 0.948242188"></polygon>
                        <polygon id="Path" points="137.496094 0.0517578125 142.514648 0.0517578125 142.514648 0.948242188 137.496094 0.948242188"></polygon>
                        <polygon id="Path" points="142.514648 0.0517578125 152.806641 0.0517578125 152.806641 0.948242188 142.514648 0.948242188"></polygon>
                        <polygon id="Path" points="152.806641 0.0517578125 163.248047 0.0517578125 163.248047 0.948242188 152.806641 0.948242188"></polygon>
                        <polygon id="Path" points="163.248047 0.948242188 167.923828 0.948242188 167.923828 0.0517578125 163.248047 0.0517578125"></polygon>
                        <polygon id="Path" points="167.923828 0.0517578125 176.686523 0.0517578125 176.686523 0.948242188 167.923828 0.948242188"></polygon>
                        <polygon id="Path" points="176.686523 0.0517578125 183.761719 0.0517578125 183.761719 0.948242188 176.686523 0.948242188"></polygon>
                        <polygon id="Path" points="183.761719 0.0517578125 194.203125 0.0517578125 194.203125 0.948242188 183.761719 0.948242188"></polygon>
                        <polygon id="Path" points="194.203125 0.0517578125 201.27832 0.0517578125 201.27832 0.948242188 194.203125 0.948242188"></polygon>
                        <polygon id="Path" points="201.27832 0.0517578125 211.649414 0.0517578125 211.649414 0.948242188 201.27832 0.948242188"></polygon>
                        <polygon id="Path" points="211.649414 0.0517578125 219.65625 0.0517578125 219.65625 0.948242188 211.649414 0.948242188"></polygon>
                    </g>
                </g>
                <g id="🔷-ICON" transform="translate(2.3077, 1.6181)">
                    <mask id="mask-2" fill="white">
                        <use xlink:href="#path-1"></use>
                    </mask>
                    <use id="Icon" fill="#822998" xlink:href="#path-1"></use>
                </g>
            </g>
        </g>
    </g>
</svg>