<svg width="135" height="72" viewBox="0 0 135 72" fill="none" xmlns="http://www.w3.org/2000/svg">
<path d="M62.7481 5.12721C63.8756 5.12667 64.7891 4.17144 64.7886 2.99365C64.788 1.81586 63.8736 0.861514 62.7461 0.862056C61.6186 0.862598 60.705 1.81783 60.7056 2.99562C60.7062 4.17341 61.6206 5.12776 62.7481 5.12721Z" fill="white"/>
<path d="M62.7506 11.9456C63.5763 11.9452 64.2454 11.2456 64.245 10.383C64.2446 9.52035 63.5748 8.82139 62.7491 8.82179C61.9233 8.82219 61.2542 9.52179 61.2547 10.3844C61.2551 11.247 61.9248 11.946 62.7506 11.9456Z" fill="white"/>
<path d="M68.7345 9.95143C69.5602 9.95103 70.2293 9.25143 70.2289 8.38882C70.2285 7.52621 69.5587 6.82725 68.733 6.82765C67.9072 6.82805 67.2381 7.52765 67.2385 8.39026C67.239 9.25287 67.9087 9.95183 68.7345 9.95143Z" fill="white"/>
<path d="M74.4449 11.6524C75.2707 11.652 75.9397 10.9524 75.9393 10.0897C75.9389 9.22714 75.2692 8.52818 74.4434 8.52858C73.6177 8.52898 72.9486 9.22858 72.949 10.0912C72.9494 10.9538 73.6192 11.6528 74.4449 11.6524Z" fill="white"/>
<path d="M78.797 16.1985C79.6227 16.1981 80.2918 15.4985 80.2914 14.6359C80.291 13.7733 79.6212 13.0743 78.7955 13.0747C77.9697 13.0751 77.3006 13.7747 77.301 14.6373C77.3015 15.4999 77.9712 16.1989 78.797 16.1985Z" fill="white"/>
<path d="M80.4351 22.4456C81.2609 22.4452 81.93 21.7456 81.9296 20.883C81.9292 20.0204 81.2594 19.3214 80.4336 19.3218C79.6079 19.3222 78.9388 20.0218 78.9392 20.8844C78.9396 21.747 79.6094 22.446 80.4351 22.4456Z" fill="white"/>
<path d="M78.8029 28.4147C79.479 28.4144 80.0267 27.8416 80.0264 27.1354C80.0261 26.4292 79.4777 25.857 78.8017 25.8573C78.1257 25.8576 77.5779 26.4304 77.5782 27.1366C77.5786 27.8428 78.1269 28.415 78.8029 28.4147Z" fill="white"/>
<path d="M74.5907 32.3946C75.0421 32.3944 75.4079 32.0119 75.4077 31.5404C75.4075 31.0688 75.0413 30.6866 74.5899 30.6869C74.1384 30.6871 73.7726 31.0696 73.7729 31.5411C73.7731 32.0127 74.1393 32.3949 74.5907 32.3946Z" fill="white"/>
<path d="M58.5442 28.1413C59.1454 28.141 59.6325 27.6317 59.6322 27.0037C59.6319 26.3757 59.1443 25.8669 58.5431 25.8672C57.9419 25.8674 57.4548 26.3768 57.4551 27.0048C57.4554 27.6328 57.943 28.1416 58.5442 28.1413Z" fill="white"/>
<path d="M57.0461 22.1732C57.7221 22.1729 58.2699 21.6002 58.2695 20.894C58.2692 20.1878 57.7209 19.6155 57.0449 19.6159C56.3688 19.6162 55.8211 20.1889 55.8214 20.8951C55.8218 21.6013 56.3701 22.1736 57.0461 22.1732Z" fill="white"/>
<path d="M58.5387 16.2083C59.2896 16.208 59.898 15.5718 59.8977 14.7874C59.8973 14.003 59.2883 13.3674 58.5374 13.3678C57.7865 13.3681 57.178 14.0043 57.1784 14.7887C57.1788 15.5731 57.7878 16.2087 58.5387 16.2083Z" fill="white"/>
<path d="M63.5716 18.7635C64.0979 18.7632 64.5244 18.3173 64.5241 17.7675C64.5238 17.2177 64.097 16.7722 63.5706 16.7725C63.0443 16.7727 62.6179 17.2186 62.6182 17.7684C62.6184 18.3182 63.0453 18.7637 63.5716 18.7635Z" fill="white"/>
<path d="M63.7098 24.7277C64.1613 24.7274 64.5271 24.345 64.5268 23.8734C64.5266 23.4018 64.1605 23.0197 63.709 23.0199C63.2576 23.0201 62.8918 23.4026 62.892 23.8742C62.8922 24.3457 63.2584 24.7279 63.7098 24.7277Z" fill="white"/>
<path d="M68.6018 15.9204C69.203 15.9201 69.6901 15.4108 69.6898 14.7828C69.6895 14.1548 69.2019 13.6459 68.6007 13.6462C67.9996 13.6465 67.5125 14.1558 67.5128 14.7838C67.5131 15.4118 68.0006 15.9207 68.6018 15.9204Z" fill="white"/>
<path d="M73.7708 18.7583C74.3719 18.758 74.859 18.2487 74.8587 17.6207C74.8584 16.9927 74.3708 16.4838 73.7697 16.4841C73.1685 16.4844 72.6814 16.9937 72.6817 17.6217C72.682 18.2497 73.1696 18.7586 73.7708 18.7583Z" fill="white"/>
<path d="M73.7738 24.7228C74.2252 24.7226 74.591 24.3401 74.5908 23.8685C74.5906 23.3969 74.2244 23.0148 73.773 23.015C73.3215 23.0152 72.9557 23.3977 72.956 23.8693C72.9562 24.3409 73.3224 24.723 73.7738 24.7228Z" fill="white"/>
<path d="M68.6077 27.5659C68.9071 27.5657 69.1498 27.312 69.1496 26.9992C69.1495 26.6864 68.9066 26.4329 68.6071 26.4331C68.3077 26.4332 68.0651 26.6869 68.0652 26.9997C68.0654 27.3126 68.3082 27.566 68.6077 27.5659Z" fill="white"/>
<path d="M64.9202 30.5273C65.2196 30.5272 65.4623 30.2735 65.4621 29.9607C65.462 29.6478 65.2191 29.3944 64.9196 29.3945C64.6202 29.3947 64.3776 29.6484 64.3777 29.9612C64.3779 30.274 64.6207 30.5275 64.9202 30.5273Z" fill="white"/>
<path d="M68.6048 21.3139C68.9042 21.3138 69.1468 21.0601 69.1467 20.7473C69.1465 20.4345 68.9037 20.181 68.6042 20.1811C68.3048 20.1813 68.0621 20.435 68.0623 20.7478C68.0624 21.0606 68.3053 21.3141 68.6048 21.3139Z" fill="white"/>
<path d="M57.0396 8.54128C58.1671 8.54074 59.0807 7.58551 59.0801 6.40772C59.0795 5.22992 58.1651 4.27558 57.0376 4.27612C55.9101 4.27666 54.9966 5.23189 54.9971 6.40968C54.9977 7.58747 55.9121 8.54182 57.0396 8.54128Z" fill="white"/>
<path d="M53.505 13.3704C54.6324 13.3698 55.546 12.4146 55.5454 11.2368C55.5449 10.059 54.6304 9.10468 53.5029 9.10522C52.3754 9.10576 51.4619 10.061 51.4624 11.2388C51.463 12.4166 52.3775 13.3709 53.505 13.3704Z" fill="white"/>
<path d="M73.7684 39.4964C74.2947 39.4961 74.7211 39.0502 74.7209 38.5004C74.7206 37.9506 74.2937 37.5051 73.7674 37.5054C73.2411 37.5057 72.8147 37.9516 72.8149 38.5013C72.8152 39.0511 73.2421 39.4966 73.7684 39.4964Z" fill="white"/>
<path d="M80.4412 36.0862C80.9675 36.086 81.394 35.6401 81.3937 35.0903C81.3935 34.5405 80.9666 34.095 80.4403 34.0952C79.914 34.0955 79.4875 34.5414 79.4878 35.0912C79.488 35.641 79.9149 36.0865 80.4412 36.0862Z" fill="white"/>
<path d="M84.3825 31.9998C85.1334 31.9995 85.7418 31.3633 85.7414 30.5789C85.741 29.7945 85.132 29.1589 84.3811 29.1593C83.6302 29.1596 83.0218 29.7958 83.0222 30.5802C83.0225 31.3646 83.6316 32.0002 84.3825 31.9998Z" fill="white"/>
<path d="M86.4175 26.1371C87.3929 26.1366 88.1833 25.3102 88.1829 24.2911C88.1824 23.2721 87.3912 22.4464 86.4157 22.4469C85.4402 22.4474 84.6498 23.2738 84.6503 24.2928C84.6508 25.3119 85.442 26.1376 86.4175 26.1371Z" fill="white"/>
<path d="M86.414 19.3187C87.3895 19.3183 88.1799 18.4918 88.1794 17.4728C88.1789 16.4538 87.3878 15.6281 86.4123 15.6285C85.4368 15.629 84.6464 16.4555 84.6469 17.4745C84.6474 18.4935 85.4386 19.3192 86.414 19.3187Z" fill="white"/>
<path d="M84.5093 13.3509C85.4847 13.3505 86.2751 12.524 86.2746 11.505C86.2742 10.486 85.483 9.6603 84.5075 9.66077C83.532 9.66124 82.7416 10.4877 82.7421 11.5067C82.7426 12.5257 83.5338 13.3514 84.5093 13.3509Z" fill="white"/>
<path d="M74.9884 5.40456C76.1158 5.40402 77.0294 4.44879 77.0288 3.271C77.0283 2.09321 76.1138 1.13886 74.9863 1.1394C73.8588 1.13994 72.9453 2.09517 72.9458 3.27296C72.9464 4.45075 73.8609 5.4051 74.9884 5.40456Z" fill="white"/>
<path d="M69.2745 4.27443C70.402 4.27389 71.3155 3.31866 71.315 2.14087C71.3144 0.963082 70.3999 0.0087327 69.2724 0.00927393C68.145 0.00981515 67.2314 0.965042 67.232 2.14283C67.2325 3.32062 68.147 4.27497 69.2745 4.27443Z" fill="white"/>
<path d="M80.4283 8.53005C81.5558 8.5295 82.4693 7.57428 82.4688 6.39649C82.4682 5.21869 81.5537 4.26435 80.4263 4.26489C79.2988 4.26543 78.3852 5.22066 78.3858 6.39845C78.3864 7.57624 79.3008 8.53059 80.4283 8.53005Z" fill="white"/>
<path d="M51.335 19.3399C52.4625 19.3393 53.3761 18.3841 53.3755 17.2063C53.3749 16.0285 52.4605 15.0742 51.333 15.0747C50.2055 15.0752 49.292 16.0305 49.2925 17.2083C49.2931 18.3861 50.2076 19.3404 51.335 19.3399Z" fill="white"/>
<path d="M50.7926 26.4417C51.92 26.4411 52.8336 25.4859 52.833 24.3081C52.8325 23.1303 51.918 22.176 50.7905 22.1765C49.663 22.1771 48.7495 23.1323 48.75 24.3101C48.7506 25.4879 49.6651 26.4422 50.7926 26.4417Z" fill="white"/>
<path d="M54.0066 31.1083C53.6056 30.8764 53.09 31.0188 52.8551 31.4264C52.6201 31.8339 52.7547 32.3522 53.1557 32.5841C53.5568 32.816 54.0723 32.6735 54.3073 32.266C54.5422 31.8585 54.4076 31.3401 54.0066 31.1083Z" fill="white"/>
<path d="M57.1603 56.8474C56.5304 56.4832 55.7206 56.7069 55.3516 57.3471C54.9825 57.9872 55.194 58.8014 55.8239 59.1655C56.4537 59.5297 57.2635 59.306 57.6326 58.6659C58.0016 58.0258 57.7902 57.2116 57.1603 56.8474Z" fill="white"/>
<path d="M51.7438 55.6834C51.1139 55.3192 50.3041 55.5429 49.9351 56.183C49.566 56.8231 49.7775 57.6373 50.4074 58.0015C51.0372 58.3657 51.847 58.142 52.2161 57.5018C52.5851 56.8617 52.3737 56.0475 51.7438 55.6834Z" fill="white"/>
<path d="M48.1139 51.8955C47.4841 51.5313 46.6743 51.755 46.3052 52.3952C45.9361 53.0353 46.1476 53.8495 46.7775 54.2136C47.4073 54.5778 48.2171 54.3541 48.5862 53.714C48.9553 53.0738 48.7438 52.2597 48.1139 51.8955Z" fill="white"/>
<path d="M46.7385 46.5984C46.1086 46.2342 45.2988 46.4579 44.9297 47.098C44.5607 47.7382 44.7721 48.5523 45.402 48.9165C46.0319 49.2807 46.8417 49.057 47.2107 48.4169C47.5798 47.7767 47.3683 46.9626 46.7385 46.5984Z" fill="white"/>
<path d="M48.1667 41.2375C47.5368 40.8734 46.727 41.0971 46.3579 41.7372C45.9889 42.3773 46.2003 43.1915 46.8302 43.5557C47.4601 43.9199 48.2699 43.6962 48.6389 43.056C49.008 42.4159 48.7966 41.6017 48.1667 41.2375Z" fill="white"/>
<path d="M51.9702 37.5236C51.4538 37.2251 50.7899 37.4085 50.4873 37.9333C50.1847 38.4581 50.3581 39.1256 50.8745 39.4242C51.3909 39.7228 52.0549 39.5394 52.3574 39.0146C52.66 38.4897 52.4867 37.8222 51.9702 37.5236Z" fill="white"/>
<path d="M67.3153 46.679C66.8575 46.4143 66.269 46.5769 66.0008 47.0421C65.7326 47.5073 65.8863 48.0989 66.344 48.3636C66.8018 48.6282 67.3903 48.4657 67.6585 48.0005C67.9267 47.5353 67.773 46.9436 67.3153 46.679Z" fill="white"/>
<path d="M65.9053 51.7717C65.3889 51.4731 64.7249 51.6565 64.4224 52.1813C64.1198 52.7062 64.2931 53.3737 64.8096 53.6723C65.326 53.9708 65.9899 53.7874 66.2925 53.2626C66.5951 52.7378 66.4217 52.0703 65.9053 51.7717Z" fill="white"/>
<path d="M62.2062 55.5411C61.633 55.2097 60.8961 55.4133 60.5603 55.9958C60.2245 56.5783 60.4169 57.3191 60.99 57.6505C61.5632 57.9819 62.3001 57.7783 62.6359 57.1958C62.9717 56.6133 62.7793 55.8725 62.2062 55.5411Z" fill="white"/>
<path d="M59.4627 51.4208C59.0616 51.1889 58.5461 51.3313 58.3111 51.7389C58.0762 52.1464 58.2108 52.6647 58.6118 52.8966C59.0128 53.1285 59.5284 52.986 59.7633 52.5785C59.9983 52.171 59.8637 51.6526 59.4627 51.4208Z" fill="white"/>
<path d="M61.9113 46.9282C61.567 46.7291 61.1244 46.8514 60.9227 47.2013C60.721 47.5512 60.8365 47.9962 61.1808 48.1952C61.5251 48.3943 61.9677 48.272 62.1694 47.9221C62.3712 47.5723 62.2556 47.1272 61.9113 46.9282Z" fill="white"/>
<path d="M54.4012 51.312C53.9435 51.0474 53.355 51.2099 53.0868 51.6751C52.8186 52.1403 52.9722 52.732 53.43 52.9966C53.8877 53.2613 54.4762 53.0987 54.7444 52.6335C55.0126 52.1683 54.8589 51.5767 54.4012 51.312Z" fill="white"/>
<path d="M51.6717 46.9212C51.214 46.6565 50.6255 46.8191 50.3573 47.2843C50.0891 47.7495 50.2427 48.3411 50.7005 48.6058C51.1582 48.8704 51.7467 48.7078 52.0149 48.2427C52.2831 47.7775 52.1294 47.1858 51.6717 46.9212Z" fill="white"/>
<path d="M54.2282 42.4865C53.8839 42.2875 53.4413 42.4098 53.2396 42.7596C53.0379 43.1095 53.1534 43.5545 53.4977 43.7536C53.842 43.9526 54.2846 43.8304 54.4863 43.4805C54.6881 43.1306 54.5725 42.6856 54.2282 42.4865Z" fill="white"/>
<path d="M56.7133 47.3019C56.4844 47.1696 56.1902 47.2508 56.0561 47.4834C55.922 47.716 55.9988 48.0119 56.2277 48.1442C56.4565 48.2765 56.7508 48.1952 56.8849 47.9626C57.019 47.73 56.9422 47.4342 56.7133 47.3019Z" fill="white"/>
<path d="M59.4441 62.977C58.5834 62.4793 57.4768 62.785 56.9725 63.6597C56.4682 64.5345 56.7571 65.647 57.6178 66.1446C58.4785 66.6422 59.5851 66.3366 60.0894 65.4618C60.5937 64.5871 60.3048 63.4746 59.4441 62.977Z" fill="white"/>
<path d="M53.9773 62.6145C53.2146 62.1735 52.2338 62.4445 51.7869 63.2198C51.3399 63.9951 51.5959 64.9812 52.3586 65.4222C53.1214 65.8632 54.1021 65.5922 54.5491 64.8169C54.9961 64.0415 54.7401 63.0555 53.9773 62.6145Z" fill="white"/>
<path d="M65.1262 61.0021C64.2655 60.5045 63.1589 60.8102 62.6546 61.6849C62.1503 62.5596 62.4392 63.6721 63.3 64.1697C64.1607 64.6674 65.2672 64.3617 65.7715 63.487C66.2758 62.6123 65.9869 61.4998 65.1262 61.0021Z" fill="white"/>
<path d="M73.0314 46.6101C72.4015 46.2459 71.5917 46.4696 71.2227 47.1098C70.8536 47.7499 71.0651 48.5641 71.695 48.9282C72.3248 49.2924 73.1346 49.0687 73.5037 48.4286C73.8727 47.7884 73.6613 46.9743 73.0314 46.6101Z" fill="white"/>
<path d="M49.0514 32.7403C48.4782 32.409 47.7414 32.6125 47.4055 33.195C47.0697 33.7775 47.2621 34.5183 47.8353 34.8497C48.4084 35.1811 49.1453 34.9775 49.4811 34.395C49.8169 33.8125 49.6245 33.0717 49.0514 32.7403Z" fill="white"/>
<path d="M45.1811 35.8492C44.4358 35.4183 43.4776 35.683 43.041 36.4404C42.6043 37.1978 42.8545 38.1612 43.5997 38.5921C44.345 39.023 45.3032 38.7583 45.7399 38.0009C46.1766 37.2434 45.9264 36.2801 45.1811 35.8492Z" fill="white"/>
<path d="M42.2612 40.9141C41.5159 40.4832 40.5577 40.7479 40.121 41.5054C39.6844 42.2628 39.9345 43.2261 40.6798 43.657C41.4251 44.0879 42.3833 43.8232 42.82 43.0658C43.2567 42.3084 43.0065 41.3451 42.2612 40.9141Z" fill="white"/>
<path d="M41.1621 46.1866C40.4168 45.7557 39.4586 46.0204 39.0219 46.7778C38.5852 47.5352 38.8354 48.4986 39.5807 48.9295C40.326 49.3604 41.2842 49.0957 41.7208 48.3383C42.1575 47.5809 41.9073 46.6175 41.1621 46.1866Z" fill="white"/>
<path d="M45.0251 56.2958C44.1644 55.7982 43.0578 56.1039 42.5535 56.9786C42.0492 57.8533 42.3382 58.9658 43.1989 59.4635C44.0596 59.9611 45.1661 59.6554 45.6704 58.7807C46.1747 57.906 45.8858 56.7935 45.0251 56.2958Z" fill="white"/>
<path d="M48.8972 59.6628C48.0365 59.1651 46.9299 59.4708 46.4256 60.3455C45.9213 61.2202 46.2102 62.3328 47.071 62.8304C47.9317 63.328 49.0382 63.0223 49.5425 62.1476C50.0468 61.2729 49.7579 60.1604 48.8972 59.6628Z" fill="white"/>
<path d="M42.2087 51.5719C41.348 51.0743 40.2414 51.38 39.7371 52.2547C39.2328 53.1294 39.5218 54.2419 40.3825 54.7396C41.2432 55.2372 42.3497 54.9315 42.854 54.0568C43.3583 53.1821 43.0694 52.0696 42.2087 51.5719Z" fill="white"/>
<path d="M72.5056 51.3644C71.6449 50.8668 70.5383 51.1725 70.034 52.0472C69.5297 52.9219 69.8186 54.0344 70.6793 54.5321C71.5401 55.0297 72.6466 54.724 73.1509 53.8493C73.6552 52.9746 73.3663 51.8621 72.5056 51.3644Z" fill="white"/>
<path d="M69.6652 56.6624C68.8809 56.2089 67.8724 56.4876 67.4128 57.2849C66.9532 58.0821 67.2164 59.096 68.0007 59.5495C68.7851 60.003 69.7935 59.7243 70.2531 58.9271C70.7128 58.1298 70.4495 57.1159 69.6652 56.6624Z" fill="white"/>
<path d="M1.87436 49.9095C1.31899 49.9095 0.860816 49.7288 0.499829 49.3673C0.166609 49.0059 0 48.561 0 48.0328C0 47.8104 0.0694205 47.5323 0.208262 47.1987L10.8296 22.0923C11.0518 21.5919 11.3572 21.1887 11.746 20.8829C12.1625 20.5492 12.6623 20.3824 13.2455 20.3824H13.662C14.2451 20.3824 14.7311 20.5492 15.1198 20.8829C15.5363 21.1887 15.8557 21.5919 16.0778 22.0923L26.6992 47.1987C26.838 47.5323 26.9074 47.8104 26.9074 48.0328C26.9074 48.561 26.7269 49.0059 26.366 49.3673C26.0327 49.7288 25.5884 49.9095 25.0331 49.9095C24.6443 49.9095 24.2833 49.8122 23.9501 49.6176C23.6447 49.3951 23.4086 49.1032 23.242 48.7418L20.5346 42.2358H6.37281L3.66541 48.7418C3.4988 49.1032 3.24889 49.3951 2.91567 49.6176C2.61022 49.8122 2.26311 49.9095 1.87436 49.9095ZM7.83065 38.7743H19.0768L13.4537 25.2202L7.83065 38.7743ZM33.9143 49.9095C33.3867 49.9095 32.9424 49.7288 32.5814 49.3673C32.2204 49.0059 32.0399 48.561 32.0399 48.0328V30.1414C32.0399 29.6131 32.2204 29.1682 32.5814 28.8068C32.9424 28.4176 33.3867 28.2229 33.9143 28.2229C34.4419 28.2229 34.8862 28.4176 35.2472 28.8068C35.6359 29.1682 35.8303 29.6131 35.8303 30.1414V31.9347C37.7741 29.3212 39.9539 28.0144 42.3697 28.0144H42.578C43.1056 28.0144 43.536 28.1951 43.8692 28.5566C44.2302 28.918 44.4107 29.3629 44.4107 29.8911C44.4107 30.4194 44.2302 30.8503 43.8692 31.184C43.5082 31.5176 43.05 31.6844 42.4947 31.6844H42.2864C40.9535 31.6844 39.7317 32.0181 38.621 32.6854C37.5103 33.3248 36.58 34.2145 35.8303 35.3545V48.0328C35.8303 48.561 35.6359 49.0059 35.2472 49.3673C34.8862 49.7288 34.4419 49.9095 33.9143 49.9095ZM62.5989 50.118C59.8776 50.118 57.5034 49.0615 55.4763 46.9485V48.0328C55.4763 48.561 55.282 49.0059 54.8932 49.3673C54.5322 49.7288 54.0879 49.9095 53.5603 49.9095C53.0327 49.9095 52.5884 49.7288 52.2275 49.3673C51.8665 49.0059 51.686 48.561 51.686 48.0328V20.9663C51.686 20.438 51.8665 19.9932 52.2275 19.6317C52.5884 19.2425 53.0327 19.0479 53.5603 19.0479C54.1157 19.0479 54.5739 19.2286 54.9349 19.59C55.2958 19.9515 55.4763 20.4102 55.4763 20.9663V31.184C57.5034 29.0709 59.8776 28.0144 62.5989 28.0144C64.3205 28.0144 65.945 28.4593 67.4722 29.349C69.0273 30.2109 70.2768 31.4898 71.2209 33.1858C72.1928 34.854 72.6788 36.8141 72.6788 39.0662C72.6788 41.3183 72.1928 43.2923 71.2209 44.9883C70.2768 46.6565 69.0273 47.9355 67.4722 48.8252C65.945 49.6871 64.3205 50.118 62.5989 50.118ZM61.5946 46.5731C63.6495 46.5731 65.3017 45.9197 66.5513 44.613C67.8008 43.3062 68.4256 41.4573 68.4256 39.0662C68.4256 36.6751 67.8008 34.8262 66.5513 33.5195C65.3017 32.2127 63.6495 31.5593 61.5946 31.5593C60.3173 31.5593 59.1094 31.8513 57.9709 32.4351C56.8601 32.9912 55.8744 33.7419 55.0135 34.6872V43.4452C55.8744 44.3905 56.8601 45.1551 57.9709 45.739C59.1094 46.2951 60.3173 46.5731 61.5946 46.5731ZM86.6184 50.118C85.3966 50.118 84.2581 49.8678 83.2029 49.3673C82.1755 48.8669 81.3564 48.144 80.7455 47.1987C80.1346 46.2256 79.8291 45.1134 79.8291 43.8623C79.8291 41.8048 80.6344 40.1644 82.2449 38.9411C83.8833 37.7178 86.2713 37.1061 89.4091 37.1061H94.4491V36.7724C94.4491 34.9374 93.9909 33.6168 93.0746 32.8105C92.186 32.0042 90.7837 31.601 88.8677 31.601C87.8125 31.601 86.8684 31.6844 86.0353 31.8513C85.23 32.0181 84.3276 32.2683 83.3279 32.602C83.1058 32.6576 82.9253 32.6854 82.7864 32.6854C82.3699 32.6854 82.0089 32.5324 81.7035 32.2266C81.398 31.9208 81.2453 31.5454 81.2453 31.1006C81.2453 30.3499 81.6063 29.8216 82.3282 29.5158C84.6885 28.5149 87.0905 28.0144 89.5341 28.0144C91.4501 28.0144 93.0607 28.4037 94.3658 29.1821C95.6987 29.9606 96.6705 30.9755 97.2814 32.2266C97.9201 33.45 98.2395 34.7845 98.2395 36.2303V48.0328C98.2395 48.561 98.0451 49.0059 97.6563 49.3673C97.2953 49.7288 96.851 49.9095 96.3234 49.9095C95.7958 49.9095 95.3516 49.7288 94.9906 49.3673C94.6296 49.0059 94.4491 48.561 94.4491 48.0328V46.9485C92.3942 49.0615 89.784 50.118 86.6184 50.118ZM88.0346 46.7816C89.2564 46.7816 90.4366 46.4897 91.5751 45.9058C92.7136 45.2942 93.6716 44.5435 94.4491 43.6538V40.1505H89.909C85.716 40.1505 83.6195 41.2488 83.6195 43.4452C83.6195 44.4462 83.9527 45.2524 84.6191 45.8641C85.3133 46.4758 86.4518 46.7816 88.0346 46.7816ZM106.468 49.9095C105.941 49.9095 105.496 49.7288 105.135 49.3673C104.774 49.0059 104.594 48.561 104.594 48.0328V20.9663C104.594 20.438 104.774 19.9932 105.135 19.6317C105.496 19.2425 105.941 19.0479 106.468 19.0479C107.023 19.0479 107.482 19.2286 107.843 19.59C108.204 19.9515 108.384 20.4102 108.384 20.9663V48.0328C108.384 48.561 108.19 49.0059 107.801 49.3673C107.44 49.7288 106.996 49.9095 106.468 49.9095ZM124.337 50.118C122.199 50.118 120.324 49.6593 118.714 48.7418C117.103 47.8243 115.854 46.5314 114.965 44.8632C114.104 43.1672 113.674 41.2349 113.674 39.0662C113.674 36.8976 114.104 34.9791 114.965 33.3109C115.854 31.6149 117.103 30.3082 118.714 29.3907C120.324 28.4732 122.199 28.0144 124.337 28.0144C126.447 28.0144 128.308 28.4732 129.918 29.3907C131.529 30.3082 132.779 31.6149 133.667 33.3109C134.556 34.9791 135 36.8976 135 39.0662C135 41.2349 134.556 43.1672 133.667 44.8632C132.779 46.5314 131.529 47.8243 129.918 48.7418C128.308 49.6593 126.447 50.118 124.337 50.118ZM124.337 46.6565C125.475 46.6565 126.558 46.3924 127.586 45.8641C128.641 45.3359 129.502 44.5018 130.168 43.3618C130.863 42.2219 131.21 40.7761 131.21 39.0245C131.21 37.3007 130.863 35.8688 130.168 34.7289C129.502 33.589 128.641 32.7688 127.586 32.2683C126.558 31.7401 125.475 31.4759 124.337 31.4759C123.171 31.4759 122.06 31.7401 121.005 32.2683C119.977 32.7688 119.13 33.589 118.464 34.7289C117.798 35.8688 117.464 37.3007 117.464 39.0245C117.464 40.7761 117.798 42.2219 118.464 43.3618C119.13 44.5018 119.977 45.3359 121.005 45.8641C122.06 46.3924 123.171 46.6565 124.337 46.6565Z" fill="white"/>
</svg>
