<svg width="27" height="27" viewBox="0 0 27 27" fill="none" xmlns="http://www.w3.org/2000/svg">
<path d="M13.5 0C6.05613 0 0 6.05613 0 13.5C0 20.9433 6.05613 27 13.5 27C20.9433 27 27 20.9433 27 13.5C27 6.05613 20.9444 0 13.5 0ZM19.5224 10.4102C19.5284 10.544 19.5317 10.6788 19.5317 10.8137C19.5317 14.9198 16.4071 19.6529 10.6903 19.6529C8.93547 19.6529 7.30194 19.1401 5.92725 18.2581C6.17032 18.2869 6.41775 18.3016 6.66843 18.3016C8.12469 18.3016 9.46403 17.8046 10.5277 16.9715C9.16821 16.9465 8.02028 16.0482 7.62495 14.8132C7.81419 14.8491 8.00941 14.8692 8.20897 14.8692C8.49229 14.8692 8.76744 14.8323 9.02791 14.761C7.60646 14.4761 6.53575 13.2205 6.53575 11.7142C6.53575 11.7012 6.53575 11.6876 6.53629 11.6751C6.95501 11.9073 7.43408 12.0476 7.94306 12.0633C7.10999 11.507 6.56131 10.5554 6.56131 9.47762C6.56131 8.90774 6.71411 8.37374 6.98165 7.91479C8.51349 9.79519 10.8039 11.0318 13.3858 11.1623C13.3325 10.9344 13.3059 10.6979 13.3059 10.4537C13.3059 8.73808 14.6969 7.34653 16.4125 7.34653C17.3065 7.34653 18.1129 7.72392 18.6806 8.32752C19.3892 8.18831 20.0526 7.93056 20.6546 7.57329C20.4207 8.29924 19.9297 8.90774 19.2864 9.29274C19.9156 9.2177 20.5159 9.0513 21.0711 8.80387C20.6568 9.42596 20.1298 9.97356 19.5224 10.4102Z" fill="white"/>
</svg>
