{
  "info": {
    "description": "Expressjs kickstarter.",
    "version": "0.5.2",
    "title": "Swagger Expressjs Kickstarter",
    "termsOfService": "http://swagger.io/terms/",
    "contact": {
      "email": "apiteam@swagger.io"
    },
    "license": {
      "name": "Apache 2.0",
      "url": "http://www.apache.org/licenses/LICENSE-2.0.html"
    }
  },
  "tags": [
    {
      "name": "users",
      "description": "Everything about your Users",
      "externalDocs": {
        "description": "Find out more",
        "url": "http://swagger.io"
      }
    },
    {
      "name": "discovery",
      "description": "[debug] endpoint discovery"
    },
    {
      "name": "healthcheck",
      "description": "Application healthcheck"
    }
  ],
  "schemes": [
    "https",
    "http"
  ],
  "basePath": "/api/v1",
  "host": "localhost:80"
}
