{
  "env": "prod",
  "name": "prod",
  "server": {
    "port": 3000
  },
  "modules": {
    "winston": {
      "transports": {
        "console": {
          "level": "silly",
          "colorize": true,
          "label": "default console",
          "handleExceptions": true,
          "json": false
        },
        "file": {
          "level": "silly",
          "colorize": true,
          "label": "default file",
          "filename": "somefile.log",
          "handleExceptions": true,
          "json": true,
          "maxsize": 5242880,
          "maxFiles": 5
        }
      },
      "loggers": [
        {
          "name": "controllers",
          "transports": ["console", "file"],
          "options": {
            "label": "controllers"
          }
        }
      ]
    }
  }
}

