ISO-10303-21;
HEADER;
FILE_DESCRIPTION (( 'STEP AP203' ),
    '1' );
FILE_NAME ('PinHeader 7x21mm.STEP',
    '2020-12-25T19:15:49',
    ( '' ),
    ( '' ),
    'SwSTEP 2.0',
    'SolidWorks 2018',
    '' );
FILE_SCHEMA (( 'CONFIG_CONTROL_DESIGN' ));
ENDSEC;

DATA;
#1 = APPROVAL ( #1222, 'UNKNOWN' ) ;
#2 = EDGE_CURVE ( 'NONE', #149, #447, #1241, .T. ) ;
#3 = CARTESIAN_POINT ( 'NONE',  ( 0.5499999999999989342, 0.2000000000000000944, 0.5499999999999988232 ) ) ;
#4 = DIRECTION ( 'NONE',  ( 0.0000000000000000000, 1.000000000000000000, 0.0000000000000000000 ) ) ;
#5 = LOCAL_TIME ( 20, 15, 49.00000000000000000, #267 ) ;
#6 = FACE_OUTER_BOUND ( 'NONE', #692, .T. ) ;
#7 = AXIS2_PLACEMENT_3D ( 'NONE', #600, #268, #1249 ) ;
#8 = ORIENTED_EDGE ( 'NONE', *, *, #63, .T. ) ;
#9 = CARTESIAN_POINT ( 'NONE',  ( 0.5500000000000007105, 21.19999999999999929, 0.5500000000000005995 ) ) ;
#10 = DIRECTION ( 'NONE',  ( 1.668003342285391797E-16, -0.0000000000000000000, 1.000000000000000000 ) ) ;
#11 = CALENDAR_DATE ( 2020, 25, 12 ) ;
#12 = ORIENTED_EDGE ( 'NONE', *, *, #362, .T. ) ;
#13 = CARTESIAN_POINT ( 'NONE',  ( 1.595000000000000195, 3.000000000000000000, 1.524999999999999911 ) ) ;
#14 = CARTESIAN_POINT ( 'NONE',  ( -0.9449999999999998401, 5.299999999999999822, -0.6250000000000014433 ) ) ;
#15 = EDGE_CURVE ( 'NONE', #1012, #689, #470, .T. ) ;
#16 = PLANE ( 'NONE',  #1248 ) ;
#17 = PRODUCT_DEFINITION_FORMATION_WITH_SPECIFIED_SOURCE ( 'ANY', '', #479, .NOT_KNOWN. ) ;
#18 = EDGE_CURVE ( 'NONE', #804, #231, #718, .T. ) ;
#19 = PERSON_AND_ORGANIZATION ( #388, #283 ) ;
#20 = FACE_OUTER_BOUND ( 'NONE', #274, .T. ) ;
#21 = FACE_OUTER_BOUND ( 'NONE', #164, .T. ) ;
#22 = VERTEX_POINT ( 'NONE', #120 ) ;
#23 = VECTOR ( 'NONE', #777, 1000.000000000000000 ) ;
#24 = ORGANIZATION ( 'NAUO-ORG7', 'UNSPECIFIED', 'UNSPECIFIED' ) ;
#25 = DIRECTION ( 'NONE',  ( -0.7071067811865475727, 0.0000000000000000000, 0.7071067811865475727 ) ) ;
#26 = ORIENTED_EDGE ( 'NONE', *, *, #2, .F. ) ;
#27 = CARTESIAN_POINT ( 'NONE',  ( 1.345000000000001750, 5.299999999999999822, -0.8749999999999998890 ) ) ;
#28 = CALENDAR_DATE ( 2020, 25, 12 ) ;
#29 =( REPRESENTATION_RELATIONSHIP ('NONE','NONE', #478, #205 ) REPRESENTATION_RELATIONSHIP_WITH_TRANSFORMATION ( #631 )SHAPE_REPRESENTATION_RELATIONSHIP( ) );
#30 = CARTESIAN_POINT ( 'NONE',  ( 1.595000000000000195, 3.000000000000000000, -0.6250000000000014433 ) ) ;
#31 = CC_DESIGN_DATE_AND_TIME_ASSIGNMENT ( #683, #999, ( #1033 ) ) ;
#32 = APPROVAL_STATUS ( 'not_yet_approved' ) ;
#33 = CALENDAR_DATE ( 2020, 25, 12 ) ;
#34 = EDGE_CURVE ( 'NONE', #669, #924, #446, .T. ) ;
#35 = EDGE_LOOP ( 'NONE', ( #340, #520, #558, #670 ) ) ;
#36 = ITEM_DEFINED_TRANSFORMATION ( 'NONE', 'NONE', #202,  #1069 ) ;
#37 = SECURITY_CLASSIFICATION_LEVEL ( 'unclassified' ) ;
#38 = ORIENTED_EDGE ( 'NONE', *, *, #883, .T. ) ;
#39 = CC_DESIGN_PERSON_AND_ORGANIZATION_ASSIGNMENT ( #487, #715, ( #1107 ) ) ;
#40 = APPROVAL_ROLE ( '' ) ;
#41 = ORGANIZATION ( 'NAUO-ORG4', 'UNSPECIFIED', 'UNSPECIFIED' ) ;
#42 = DATE_TIME_ROLE ( 'creation_date' ) ;
#43 = PRODUCT_DEFINITION_SHAPE ( 'NONE', 'NONE',  #1259 ) ;
#44 = LINE ( 'NONE', #788, #78 ) ;
#45 = FACE_BOUND ( 'NONE', #35, .T. ) ;
#46 = SECURITY_CLASSIFICATION_LEVEL ( 'unclassified' ) ;
#47 = CARTESIAN_POINT ( 'NONE',  ( 0.6500000000000001332, 0.2000000000000000944, 0.0000000000000000000 ) ) ;
#48 = ORIENTED_EDGE ( 'NONE', *, *, #1143, .F. ) ;
#49 = VECTOR ( 'NONE', #1187, 1000.000000000000000 ) ;
#50 = COORDINATED_UNIVERSAL_TIME_OFFSET ( 1, 0, .AHEAD. ) ;
#51 = ORIENTED_EDGE ( 'NONE', *, *, #440, .T. ) ;
#52 = APPROVAL ( #32, 'UNSPECIFIED' ) ;
#53 = ORIENTED_EDGE ( 'NONE', *, *, #503, .F. ) ;
#54 = ADVANCED_FACE ( 'NONE', ( #1178 ), #1186, .F. ) ;
#55 = DIRECTION ( 'NONE',  ( 0.7071067811865474617, -0.0000000000000000000, 0.7071067811865474617 ) ) ;
#56 = EDGE_CURVE ( 'NONE', #754, #215, #914, .T. ) ;
#57 = ITEM_DEFINED_TRANSFORMATION ( 'NONE', 'NONE', #7,  #1069 ) ;
#58 = ORIENTED_EDGE ( 'NONE', *, *, #18, .F. ) ;
#59 = CARTESIAN_POINT ( 'NONE',  ( 0.0000000000000000000, 0.4500000000000037859, 0.6500000000000000222 ) ) ;
#60 = PERSON_AND_ORGANIZATION ( #388, #283 ) ;
#61 = CC_DESIGN_APPROVAL ( #1, ( #567 ) ) ;
#62 = VECTOR ( 'NONE', #469, 1000.000000000000000 ) ;
#63 = EDGE_CURVE ( 'NONE', #627, #145, #1205, .T. ) ;
#64 = ORIENTED_EDGE ( 'NONE', *, *, #503, .T. ) ;
#65 = CARTESIAN_POINT ( 'NONE',  ( 0.0000000000000000000, 0.2000000000000000944, 0.1000000000000011297 ) ) ;
#66 = CARTESIAN_POINT ( 'NONE',  ( 1.345000000000001750, 5.299999999999999822, 1.524999999999999911 ) ) ;
#67 = EDGE_LOOP ( 'NONE', ( #1155, #1079, #1147, #974, #290 ) ) ;
#68 = AXIS2_PLACEMENT_3D ( 'NONE', #1059, #1254, #390 ) ;
#69 = DIRECTION ( 'NONE',  ( -1.000000000000000000, 0.0000000000000000000, 0.0000000000000000000 ) ) ;
#70 = COORDINATED_UNIVERSAL_TIME_OFFSET ( 1, 0, .AHEAD. ) ;
#71 = VERTEX_POINT ( 'NONE', #30 ) ;
#72 = AXIS2_PLACEMENT_3D ( 'NONE', #200, #497, #408 ) ;
#73 = PLANE ( 'NONE',  #1229 ) ;
#74 = EDGE_CURVE ( 'NONE', #231, #627, #1146, .T. ) ;
#75 = DIRECTION ( 'NONE',  ( -1.000000000000000000, 0.0000000000000000000, -0.0000000000000000000 ) ) ;
#76 =( NAMED_UNIT ( * ) SI_UNIT ( $, .STERADIAN. ) SOLID_ANGLE_UNIT ( ) );
#77 = APPROVAL ( #1105, 'UNSPECIFIED' ) ;
#78 = VECTOR ( 'NONE', #1082, 1000.000000000000000 ) ;
#79 = FACE_BOUND ( 'NONE', #80, .T. ) ;
#80 = EDGE_LOOP ( 'NONE', ( #322, #320, #8, #1056 ) ) ;
#81 = VECTOR ( 'NONE', #1040, 1000.000000000000000 ) ;
#82 = DIRECTION ( 'NONE',  ( 0.0000000000000000000, 0.0000000000000000000, -1.000000000000000000 ) ) ;
#83 = DATE_AND_TIME ( #262, #528 ) ;
#84 = CARTESIAN_POINT ( 'NONE',  ( 0.6500000000000001332, 21.19999999999999929, 0.6500000000000000222 ) ) ;
#85 = EDGE_CURVE ( 'NONE', #119, #643, #663, .T. ) ;
#86 = ORIENTED_EDGE ( 'NONE', *, *, #1192, .T. ) ;
#87 = ORIENTED_EDGE ( 'NONE', *, *, #289, .T. ) ;
#88 = ORIENTED_EDGE ( 'NONE', *, *, #378, .T. ) ;
#89 = DIRECTION ( 'NONE',  ( 1.000000000000000000, 0.0000000000000000000, 0.0000000000000000000 ) ) ;
#90 = APPROVAL_DATE_TIME ( #365, #400 ) ;
#91 = ORIENTED_EDGE ( 'NONE', *, *, #572, .F. ) ;
#92 = DIRECTION ( 'NONE',  ( 0.0000000000000000000, 1.000000000000000000, 0.0000000000000000000 ) ) ;
#93 = CARTESIAN_POINT ( 'NONE',  ( 1.595000000000000195, 3.200000000000000178, -0.6249999999999962252 ) ) ;
#94 = AXIS2_PLACEMENT_3D ( 'NONE', #607, #316, #886 ) ;
#95 = CARTESIAN_POINT ( 'NONE',  ( 0.6500000000000001332, 5.299999999999998934, 0.6500000000000000222 ) ) ;
#96 = COORDINATED_UNIVERSAL_TIME_OFFSET ( 1, 0, .AHEAD. ) ;
#97 = LINE ( 'NONE', #1168, #371 ) ;
#98 = LINE ( 'NONE', #666, #594 ) ;
#99 = CC_DESIGN_PERSON_AND_ORGANIZATION_ASSIGNMENT ( #136, #527, ( #1033 ) ) ;
#100 = ORIENTED_EDGE ( 'NONE', *, *, #125, .T. ) ;
#101 = CARTESIAN_POINT ( 'NONE',  ( -0.9449999999999998401, 5.299999999999999822, -0.6250000000000014433 ) ) ;
#102 = DIRECTION ( 'NONE',  ( 1.000000000000000000, 0.0000000000000000000, -0.0000000000000000000 ) ) ;
#103 = EDGE_CURVE ( 'NONE', #702, #766, #144, .T. ) ;
#104 = CARTESIAN_POINT ( 'NONE',  ( 0.0000000000000000000, 5.299999999999998934, 0.0000000000000000000 ) ) ;
#105 = EDGE_LOOP ( 'NONE', ( #51, #304, #181, #801 ) ) ;
#106 = CC_DESIGN_DATE_AND_TIME_ASSIGNMENT ( #704, #138, ( #1107 ) ) ;
#107 = CARTESIAN_POINT ( 'NONE',  ( 0.0000000000000000000, 0.0000000000000000000, 0.0000000000000000000 ) ) ;
#108 = CARTESIAN_POINT ( 'NONE',  ( 0.1666666666666654362, 21.36666666666666714, 0.4833333333333345028 ) ) ;
#109 = ADVANCED_FACE ( 'NONE', ( #385 ), #639, .F. ) ;
#110 = FACE_OUTER_BOUND ( 'NONE', #955, .T. ) ;
#111 = VECTOR ( 'NONE', #1195, 1000.000000000000000 ) ;
#112 = EDGE_LOOP ( 'NONE', ( #785, #1078, #464, #130 ) ) ;
#113 = LINE ( 'NONE', #896, #323 ) ;
#114 = CARTESIAN_POINT ( 'NONE',  ( 0.0000000000000000000, 21.19999999999999929, 0.0000000000000000000 ) ) ;
#115 = PERSON_AND_ORGANIZATION ( #1045, #389 ) ;
#116 = EDGE_LOOP ( 'NONE', ( #413, #645, #317, #829 ) ) ;
#117 = AXIS2_PLACEMENT_3D ( 'NONE', #203, #893, #881 ) ;
#118 = EDGE_LOOP ( 'NONE', ( #910, #1001, #880, #64 ) ) ;
#119 = VERTEX_POINT ( 'NONE', #711 ) ;
#120 = CARTESIAN_POINT ( 'NONE',  ( 0.0000000000000000000, 20.94999999999999929, 0.0000000000000000000 ) ) ;
#121 = DIRECTION ( 'NONE',  ( 1.807003620809174139E-16, -0.0000000000000000000, -1.000000000000000000 ) ) ;
#122 = DATE_AND_TIME ( #398, #647 ) ;
#123 = CC_DESIGN_APPROVAL ( #52, ( #1125 ) ) ;
#124 = CARTESIAN_POINT ( 'NONE',  ( 0.0000000000000000000, 0.4500000000000037859, 0.6500000000000000222 ) ) ;
#125 = EDGE_CURVE ( 'NONE', #1085, #351, #857, .T. ) ;
#126 = AXIS2_PLACEMENT_3D ( 'NONE', #819, #246, #1110 ) ;
#127 = LOCAL_TIME ( 20, 15, 49.00000000000000000, #402 ) ;
#128 = FACE_OUTER_BOUND ( 'NONE', #949, .T. ) ;
#129 = VECTOR ( 'NONE', #1057, 1000.000000000000000 ) ;
#130 = ORIENTED_EDGE ( 'NONE', *, *, #686, .F. ) ;
#131 = APPROVAL_ROLE ( '' ) ;
#132 = CARTESIAN_POINT ( 'NONE',  ( 1.595000000000000195, 5.299999999999999822, -0.8749999999999998890 ) ) ;
#133 = CC_DESIGN_DATE_AND_TIME_ASSIGNMENT ( #1010, #453, ( #567 ) ) ;
#134 = EDGE_CURVE ( 'NONE', #548, #804, #637, .T. ) ;
#135 = DATE_TIME_ROLE ( 'classification_date' ) ;
#136 = PERSON_AND_ORGANIZATION ( #849, #411 ) ;
#137 = AXIS2_PLACEMENT_3D ( 'NONE', #1134, #159, #276 ) ;
#138 = DATE_TIME_ROLE ( 'creation_date' ) ;
#139 = ADVANCED_FACE ( 'NONE', ( #824, #79 ), #722, .F. ) ;
#140 = PERSON_AND_ORGANIZATION_ROLE ( 'classification_officer' ) ;
#141 = DIRECTION ( 'NONE',  ( 1.807003620809174139E-16, 0.0000000000000000000, -1.000000000000000000 ) ) ;
#142 = VECTOR ( 'NONE', #681, 1000.000000000000114 ) ;
#143 = EDGE_CURVE ( 'NONE', #669, #1156, #321, .T. ) ;
#144 = LINE ( 'NONE', #132, #111 ) ;
#145 = VERTEX_POINT ( 'NONE', #364 ) ;
#146 = LINE ( 'NONE', #465, #1116 ) ;
#147 = LOCAL_TIME ( 20, 15, 49.00000000000000000, #421 ) ;
#148 = APPROVAL_ROLE ( '' ) ;
#149 = VERTEX_POINT ( 'NONE', #1112 ) ;
#150 = ADVANCED_FACE ( 'NONE', ( #580, #45 ), #257, .F. ) ;
#151 = CC_DESIGN_APPROVAL ( #77, ( #17 ) ) ;
#152 = ORIENTED_EDGE ( 'NONE', *, *, #378, .F. ) ;
#153 = APPROVAL_STATUS ( 'not_yet_approved' ) ;
#154 = EDGE_CURVE ( 'NONE', #766, #392, #1084, .T. ) ;
#155 = EDGE_LOOP ( 'NONE', ( #895, #986, #425, #326 ) ) ;
#156 = ADVANCED_FACE ( 'NONE', ( #21 ), #709, .F. ) ;
#157 = APPROVAL_DATE_TIME ( #431, #242 ) ;
#158 = LINE ( 'NONE', #84, #901 ) ;
#159 = DIRECTION ( 'NONE',  ( 0.0000000000000000000, 0.0000000000000000000, 1.000000000000000000 ) ) ;
#160 = DIRECTION ( 'NONE',  ( 0.0000000000000000000, 0.0000000000000000000, -1.000000000000000000 ) ) ;
#161 = LINE ( 'NONE', #585, #652 ) ;
#162 = CARTESIAN_POINT ( 'NONE',  ( 0.4833333333333327819, 0.03333333333333405452, 0.4833333333333327264 ) ) ;
#163 = SECURITY_CLASSIFICATION ( '', '', #623 ) ;
#164 = EDGE_LOOP ( 'NONE', ( #1141, #570, #581, #825 ) ) ;
#165 = CARTESIAN_POINT ( 'NONE',  ( 1.595000000000000195, 3.200000000000000178, 1.274999999999997913 ) ) ;
#166 = LOCAL_TIME ( 20, 15, 49.00000000000000000, #438 ) ;
#167 = EDGE_CURVE ( 'NONE', #177, #215, #1021, .T. ) ;
#168 = CARTESIAN_POINT ( 'NONE',  ( 0.0000000000000000000, 3.200000000000000178, 0.6500000000000000222 ) ) ;
#169 =( LENGTH_UNIT ( ) NAMED_UNIT ( * ) SI_UNIT ( .MILLI., .METRE. ) );
#170 = PRODUCT_DEFINITION_FORMATION_WITH_SPECIFIED_SOURCE ( 'ANY', '', #1246, .NOT_KNOWN. ) ;
#171 = DIRECTION ( 'NONE',  ( 0.0000000000000000000, -1.000000000000000000, 0.0000000000000000000 ) ) ;
#172 = VECTOR ( 'NONE', #696, 1000.000000000000000 ) ;
#173 = VECTOR ( 'NONE', #616, 1000.000000000000000 ) ;
#174 = ORIENTED_EDGE ( 'NONE', *, *, #289, .F. ) ;
#175 = CARTESIAN_POINT ( 'NONE',  ( 0.6500000000000001332, 3.200000000000000178, 0.0000000000000000000 ) ) ;
#176 = COORDINATED_UNIVERSAL_TIME_OFFSET ( 1, 0, .AHEAD. ) ;
#177 = VERTEX_POINT ( 'NONE', #455 ) ;
#178 = CARTESIAN_POINT ( 'NONE',  ( 0.0000000000000000000, 0.2000000000000000944, 0.6500000000000000222 ) ) ;
#179 = DIRECTION ( 'NONE',  ( 0.0000000000000000000, 0.0000000000000000000, 1.000000000000000000 ) ) ;
#180 = ORIENTED_EDGE ( 'NONE', *, *, #1220, .T. ) ;
#181 = ORIENTED_EDGE ( 'NONE', *, *, #1014, .T. ) ;
#182 = CARTESIAN_POINT ( 'NONE',  ( 1.595000000000000195, 5.299999999999999822, 1.275000000000001465 ) ) ;
#183 = LOCAL_TIME ( 20, 15, 49.00000000000000000, #454 ) ;
#184 = CARTESIAN_POINT ( 'NONE',  ( -6.283693229401454694, 2.256187637073627350, 11.06368319029512826 ) ) ;
#185 = ORIENTED_EDGE ( 'NONE', *, *, #260, .T. ) ;
#186 = DIRECTION ( 'NONE',  ( -0.0000000000000000000, -1.000000000000000000, -0.0000000000000000000 ) ) ;
#187 = CC_DESIGN_SECURITY_CLASSIFICATION ( #1125, ( #17 ) ) ;
#188 = APPROVAL_PERSON_ORGANIZATION ( #456, #242, #241 ) ;
#189 = LINE ( 'NONE', #165, #1190 ) ;
#190 = VECTOR ( 'NONE', #399, 1000.000000000000000 ) ;
#191 = CARTESIAN_POINT ( 'NONE',  ( -0.6950000000000013944, 5.299999999999999822, -0.8749999999999998890 ) ) ;
#192 = EDGE_CURVE ( 'NONE', #1156, #145, #547, .T. ) ;
#193 = DIRECTION ( 'NONE',  ( 0.0000000000000000000, 0.3713906763541026113, 0.9284766908852597478 ) ) ;
#194 = CARTESIAN_POINT ( 'NONE',  ( 1.595000000000000195, 3.200000000000000178, 1.274999999999997913 ) ) ;
#195 = ORIENTED_EDGE ( 'NONE', *, *, #260, .F. ) ;
#196 = DIRECTION ( 'NONE',  ( 1.000000000000000000, 0.0000000000000000000, -0.0000000000000000000 ) ) ;
#197 = COORDINATED_UNIVERSAL_TIME_OFFSET ( 1, 0, .AHEAD. ) ;
#198 = CC_DESIGN_PERSON_AND_ORGANIZATION_ASSIGNMENT ( #473, #140, ( #567 ) ) ;
#199 = EDGE_CURVE ( 'NONE', #149, #823, #765, .T. ) ;
#200 = CARTESIAN_POINT ( 'NONE',  ( 0.0000000000000000000, 0.2000000000000000944, 0.0000000000000000000 ) ) ;
#201 = DIRECTION ( 'NONE',  ( 0.0000000000000000000, 0.0000000000000000000, 1.000000000000000000 ) ) ;
#202 = AXIS2_PLACEMENT_3D ( 'NONE', #184, #853, #89 ) ;
#203 = CARTESIAN_POINT ( 'NONE',  ( 0.0000000000000000000, 0.2000000000000000944, 0.0000000000000000000 ) ) ;
#204 = APPROVAL_DATE_TIME ( #468, #77 ) ;
#205 = SHAPE_REPRESENTATION ( '1_Male_Pin_2.54_mm', ( #1069 ), #939 ) ;
#206 = DIRECTION ( 'NONE',  ( 0.0000000000000000000, 0.0000000000000000000, 1.000000000000000000 ) ) ;
#207 = VECTOR ( 'NONE', #327, 1000.000000000000000 ) ;
#208 = VERTEX_POINT ( 'NONE', #559 ) ;
#209 = ADVANCED_FACE ( 'NONE', ( #731 ), #648, .T. ) ;
#210 = APPROVAL_PERSON_ORGANIZATION ( #473, #1, #1217 ) ;
#211 = AXIS2_PLACEMENT_3D ( 'NONE', #282, #760, #82 ) ;
#212 = CARTESIAN_POINT ( 'NONE',  ( 1.595000000000000195, 5.299999999999999822, -0.8749999999999998890 ) ) ;
#213 = ORIENTED_EDGE ( 'NONE', *, *, #554, .F. ) ;
#214 = EDGE_CURVE ( 'NONE', #984, #71, #253, .T. ) ;
#215 = VERTEX_POINT ( 'NONE', #369 ) ;
#216 = CARTESIAN_POINT ( 'NONE',  ( 0.0000000000000000000, 21.19999999999999929, 0.0000000000000000000 ) ) ;
#217 = CC_DESIGN_PERSON_AND_ORGANIZATION_ASSIGNMENT ( #1203, #248, ( #17 ) ) ;
#218 = ADVANCED_FACE ( 'NONE', ( #1225 ), #462, .F. ) ;
#219 = CALENDAR_DATE ( 2020, 25, 12 ) ;
#220 = PRODUCT_DEFINITION_SHAPE ( 'NONE', 'NONE',  #954 ) ;
#221 = EDGE_CURVE ( 'NONE', #386, #228, #963, .T. ) ;
#222 = DIRECTION ( 'NONE',  ( -0.0000000000000000000, -1.000000000000000000, -0.0000000000000000000 ) ) ;
#223 = COORDINATED_UNIVERSAL_TIME_OFFSET ( 1, 0, .AHEAD. ) ;
#224 = LINE ( 'NONE', #586, #705 ) ;
#225 = VECTOR ( 'NONE', #599, 1000.000000000000000 ) ;
#226 = CARTESIAN_POINT ( 'NONE',  ( 0.0000000000000000000, 21.19999999999999929, 0.0000000000000000000 ) ) ;
#227 = LINE ( 'NONE', #492, #679 ) ;
#228 = VERTEX_POINT ( 'NONE', #741 ) ;
#229 = EDGE_LOOP ( 'NONE', ( #395, #471, #830, #1068 ) ) ;
#230 = AXIS2_PLACEMENT_3D ( 'NONE', #14, #415, #982 ) ;
#231 = VERTEX_POINT ( 'NONE', #264 ) ;
#232 =( REPRESENTATION_RELATIONSHIP ('NONE','NONE', #478, #205 ) REPRESENTATION_RELATIONSHIP_WITH_TRANSFORMATION ( #427 )SHAPE_REPRESENTATION_RELATIONSHIP( ) );
#233 = APPROVAL_PERSON_ORGANIZATION ( #495, #773, #245 ) ;
#234 = CC_DESIGN_SECURITY_CLASSIFICATION ( #163, ( #1260 ) ) ;
#235 = APPROVAL_STATUS ( 'not_yet_approved' ) ;
#236 = DIRECTION ( 'NONE',  ( 0.0000000000000000000, -1.000000000000000000, 0.0000000000000000000 ) ) ;
#237 = EDGE_CURVE ( 'NONE', #735, #228, #917, .T. ) ;
#238 = APPROVAL_PERSON_ORGANIZATION ( #501, #77, #148 ) ;
#239 = FACE_OUTER_BOUND ( 'NONE', #118, .T. ) ;
#240 = VECTOR ( 'NONE', #1000, 1000.000000000000000 ) ;
#241 = APPROVAL_ROLE ( '' ) ;
#242 = APPROVAL ( #815, 'UNSPECIFIED' ) ;
#243 = CALENDAR_DATE ( 2020, 25, 12 ) ;
#244 = PERSON_AND_ORGANIZATION_ROLE ( 'classification_officer' ) ;
#245 = APPROVAL_ROLE ( '' ) ;
#246 = DIRECTION ( 'NONE',  ( 0.0000000000000000000, -1.000000000000000000, 0.0000000000000000000 ) ) ;
#247 = ORIENTED_EDGE ( 'NONE', *, *, #466, .T. ) ;
#248 = PERSON_AND_ORGANIZATION_ROLE ( 'creator' ) ;
#249 = AXIS2_PLACEMENT_3D ( 'NONE', #964, #1234, #744 ) ;
#250 = DATE_TIME_ROLE ( 'classification_date' ) ;
#251 = LOCAL_TIME ( 20, 15, 49.00000000000000000, #516 ) ;
#252 = VECTOR ( 'NONE', #959, 1000.000000000000000 ) ;
#253 = LINE ( 'NONE', #835, #995 ) ;
#254 = ORIENTED_EDGE ( 'NONE', *, *, #15, .F. ) ;
#255 = LINE ( 'NONE', #295, #1226 ) ;
#256 = ORIENTED_EDGE ( 'NONE', *, *, #800, .T. ) ;
#257 = PLANE ( 'NONE',  #261 ) ;
#258 = PRODUCT_RELATED_PRODUCT_CATEGORY ( 'detail', '', ( #479 ) ) ;
#259 = DIRECTION ( 'NONE',  ( -0.0000000000000000000, -1.000000000000000000, -0.0000000000000000000 ) ) ;
#260 = EDGE_CURVE ( 'NONE', #71, #1151, #1148, .T. ) ;
#261 = AXIS2_PLACEMENT_3D ( 'NONE', #1208, #1120, #802 ) ;
#262 = CALENDAR_DATE ( 2020, 25, 12 ) ;
#263 = DIRECTION ( 'NONE',  ( 0.0000000000000000000, 0.3713906763541015565, -0.9284766908852601919 ) ) ;
#264 = CARTESIAN_POINT ( 'NONE',  ( 0.0000000000000000000, 5.299999999999998934, 0.6500000000000000222 ) ) ;
#265 = SECURITY_CLASSIFICATION ( '', '', #449 ) ;
#266 = EDGE_CURVE ( 'NONE', #22, #1156, #420, .T. ) ;
#267 = COORDINATED_UNIVERSAL_TIME_OFFSET ( 1, 0, .AHEAD. ) ;
#268 = DIRECTION ( 'NONE',  ( 0.0000000000000000000, 0.0000000000000000000, 1.000000000000000000 ) ) ;
#269 = VECTOR ( 'NONE', #789, 1000.000000000000000 ) ;
#270 = ORIENTED_EDGE ( 'NONE', *, *, #734, .F. ) ;
#271 = DIRECTION ( 'NONE',  ( 0.0000000000000000000, -1.000000000000000000, 0.0000000000000000000 ) ) ;
#272 = LOCAL_TIME ( 20, 15, 49.00000000000000000, #535 ) ;
#273 = AXIS2_PLACEMENT_3D ( 'NONE', #280, #847, #842 ) ;
#274 = EDGE_LOOP ( 'NONE', ( #890, #460, #396, #286 ) ) ;
#275 = CARTESIAN_POINT ( 'NONE',  ( -0.6950000000000013944, 3.000000000000000000, -0.8749999999999998890 ) ) ;
#276 = DIRECTION ( 'NONE',  ( 1.000000000000000000, 0.0000000000000000000, 0.0000000000000000000 ) ) ;
#277 = EDGE_CURVE ( 'NONE', #1215, #724, #146, .T. ) ;
#278 = PERSON ( 'NAUO-PER1', 'UNSPECIFIED', 'UNSPECIFIED', ('UNSPECIFIED'), ('UNSPECIFIED'), ('UNSPECIFIED') ) ;
#279 = DIRECTION ( 'NONE',  ( 0.0000000000000000000, 1.000000000000000000, 0.0000000000000000000 ) ) ;
#280 = CARTESIAN_POINT ( 'NONE',  ( -8.823693229401454730, 2.256187637073627350, 11.06368319029512826 ) ) ;
#281 = CC_DESIGN_PERSON_AND_ORGANIZATION_ASSIGNMENT ( #944, #357, ( #17 ) ) ;
#282 = CARTESIAN_POINT ( 'NONE',  ( 0.0000000000000000000, 21.19999999999999929, 0.0000000000000000000 ) ) ;
#283 = ORGANIZATION ( 'UNSPECIFIED', 'UNSPECIFIED', '' ) ;
#284 = LINE ( 'NONE', #1166, #319 ) ;
#285 = VECTOR ( 'NONE', #141, 1000.000000000000000 ) ;
#286 = ORIENTED_EDGE ( 'NONE', *, *, #485, .F. ) ;
#287 = DIRECTION ( 'NONE',  ( 1.668003342285391797E-16, 0.0000000000000000000, 1.000000000000000000 ) ) ;
#288 = LINE ( 'NONE', #680, #996 ) ;
#289 = EDGE_CURVE ( 'NONE', #1054, #331, #641, .T. ) ;
#290 = ORIENTED_EDGE ( 'NONE', *, *, #334, .F. ) ;
#291 = APPROVAL_DATE_TIME ( #552, #782 ) ;
#292 = CARTESIAN_POINT ( 'NONE',  ( 0.6500000000000001332, 21.19999999999999929, 0.5500000000000005995 ) ) ;
#293 = ORIENTED_EDGE ( 'NONE', *, *, #154, .F. ) ;
#294 = ORIENTED_EDGE ( 'NONE', *, *, #63, .F. ) ;
#295 = CARTESIAN_POINT ( 'NONE',  ( 0.6500000000000001332, 0.2000000000000000944, 0.6500000000000000222 ) ) ;
#296 = UNCERTAINTY_MEASURE_WITH_UNIT (LENGTH_MEASURE( 1.000000000000000082E-05 ), #603, 'distance_accuracy_value', 'NONE');
#297 = LOCAL_TIME ( 20, 15, 49.00000000000000000, #560 ) ;
#298 = CARTESIAN_POINT ( 'NONE',  ( -0.9450000000000002842, 5.299999999999999822, 1.274999999999997913 ) ) ;
#299 = APPROVAL ( #806, 'UNKNOWN' ) ;
#300 = LOCAL_TIME ( 20, 15, 49.00000000000000000, #563 ) ;
#301 = ORIENTED_EDGE ( 'NONE', *, *, #404, .F. ) ;
#302 = DIRECTION ( 'NONE',  ( 0.0000000000000000000, 0.0000000000000000000, -1.000000000000000000 ) ) ;
#303 = LINE ( 'NONE', #846, #339 ) ;
#304 = ORIENTED_EDGE ( 'NONE', *, *, #686, .T. ) ;
#305 = DIRECTION ( 'NONE',  ( -0.7071067811865474617, -0.0000000000000000000, -0.7071067811865474617 ) ) ;
#306 = CARTESIAN_POINT ( 'NONE',  ( 0.0000000000000000000, 0.2000000000000000944, 0.6500000000000000222 ) ) ;
#307 = CONTEXT_DEPENDENT_SHAPE_REPRESENTATION ( #29, #613 ) ;
#308 = EDGE_CURVE ( 'NONE', #924, #622, #860, .T. ) ;
#309 = ORIENTED_EDGE ( 'NONE', *, *, #1198, .F. ) ;
#310 = DIRECTION ( 'NONE',  ( -0.0000000000000000000, 0.0000000000000000000, -1.000000000000000000 ) ) ;
#311 = CC_DESIGN_APPROVAL ( #242, ( #170 ) ) ;
#312 = CARTESIAN_POINT ( 'NONE',  ( 0.0000000000000000000, 0.2000000000000000944, 0.5499999999999988232 ) ) ;
#313 = ADVANCED_FACE ( 'NONE', ( #360 ), #1138, .T. ) ;
#314 = APPROVAL_DATE_TIME ( #573, #299 ) ;
#315 = CARTESIAN_POINT ( 'NONE',  ( 1.595000000000000195, 5.299999999999999822, -0.6250000000000014433 ) ) ;
#316 = DIRECTION ( 'NONE',  ( -1.000000000000000000, 0.0000000000000000000, -1.807003620809174139E-16 ) ) ;
#317 = ORIENTED_EDGE ( 'NONE', *, *, #751, .T. ) ;
#318 = ADVANCED_FACE ( 'NONE', ( #1086 ), #941, .T. ) ;
#319 = VECTOR ( 'NONE', #772, 1000.000000000000000 ) ;
#320 = ORIENTED_EDGE ( 'NONE', *, *, #74, .T. ) ;
#321 = LINE ( 'NONE', #929, #610 ) ;
#322 = ORIENTED_EDGE ( 'NONE', *, *, #1104, .T. ) ;
#323 = VECTOR ( 'NONE', #992, 1000.000000000000000 ) ;
#324 = DATE_AND_TIME ( #584, #827 ) ;
#325 = ORIENTED_EDGE ( 'NONE', *, *, #1236, .T. ) ;
#326 = ORIENTED_EDGE ( 'NONE', *, *, #936, .F. ) ;
#327 = DIRECTION ( 'NONE',  ( 1.000000000000000000, 0.0000000000000000000, 0.0000000000000000000 ) ) ;
#328 = CARTESIAN_POINT ( 'NONE',  ( 0.0000000000000000000, 0.2000000000000000944, 0.5499999999999988232 ) ) ;
#329 = CC_DESIGN_SECURITY_CLASSIFICATION ( #976, ( #1257 ) ) ;
#330 = CONTEXT_DEPENDENT_SHAPE_REPRESENTATION ( #232, #1088 ) ;
#331 = VERTEX_POINT ( 'NONE', #617 ) ;
#332 =( REPRESENTATION_RELATIONSHIP ('NONE','NONE', #478, #205 ) REPRESENTATION_RELATIONSHIP_WITH_TRANSFORMATION ( #36 )SHAPE_REPRESENTATION_RELATIONSHIP( ) );
#333 = DIRECTION ( 'NONE',  ( 0.0000000000000000000, -1.000000000000000000, 0.0000000000000000000 ) ) ;
#334 = EDGE_CURVE ( 'NONE', #504, #1061, #582, .T. ) ;
#335 = DATE_TIME_ROLE ( 'classification_date' ) ;
#336 = PERSON_AND_ORGANIZATION_ROLE ( 'classification_officer' ) ;
#337 = CARTESIAN_POINT ( 'NONE',  ( 0.6500000000000001332, 0.2000000000000000944, 0.0000000000000000000 ) ) ;
#338 = APPROVAL_DATE_TIME ( #592, #693 ) ;
#339 = VECTOR ( 'NONE', #382, 1000.000000000000114 ) ;
#340 = ORIENTED_EDGE ( 'NONE', *, *, #125, .F. ) ;
#341 = CC_DESIGN_SECURITY_CLASSIFICATION ( #265, ( #1262 ) ) ;
#342 = EDGE_CURVE ( 'NONE', #331, #504, #113, .T. ) ;
#343 = APPLICATION_CONTEXT ( 'configuration controlled 3d designs of mechanical parts and assemblies' ) ;
#344 = DIRECTION ( 'NONE',  ( 0.3481553119113938166, -0.8703882797784906478, -0.3481553119113938721 ) ) ;
#345 = EDGE_LOOP ( 'NONE', ( #534, #550, #919, #100 ) ) ;
#346 = ADVANCED_FACE ( 'NONE', ( #549 ), #1171, .F. ) ;
#347 = AXIS2_PLACEMENT_3D ( 'NONE', #757, #179, #1230 ) ;
#348 = PERSON_AND_ORGANIZATION_ROLE ( 'design_supplier' ) ;
#349 = DIRECTION ( 'NONE',  ( 0.0000000000000000000, -1.000000000000000000, 0.0000000000000000000 ) ) ;
#350 = DATE_AND_TIME ( #601, #848 ) ;
#351 = VERTEX_POINT ( 'NONE', #660 ) ;
#352 = AXIS2_PLACEMENT_3D ( 'NONE', #182, #1153, #480 ) ;
#353 = APPLICATION_PROTOCOL_DEFINITION ( 'international standard', 'config_control_design', 1994, #1102 ) ;
#354 = EDGE_CURVE ( 'NONE', #145, #394, #826, .T. ) ;
#355 = LINE ( 'NONE', #298, #635 ) ;
#356 = VECTOR ( 'NONE', #530, 1000.000000000000000 ) ;
#357 = PERSON_AND_ORGANIZATION_ROLE ( 'design_supplier' ) ;
#358 = DIRECTION ( 'NONE',  ( -0.0000000000000000000, -1.000000000000000000, -0.0000000000000000000 ) ) ;
#359 = ORIENTED_EDGE ( 'NONE', *, *, #422, .F. ) ;
#360 = FACE_OUTER_BOUND ( 'NONE', #452, .T. ) ;
#361 = CARTESIAN_POINT ( 'NONE',  ( 0.0000000000000000000, 0.0000000000000000000, 0.0000000000000000000 ) ) ;
#362 = EDGE_CURVE ( 'NONE', #119, #754, #795, .T. ) ;
#363 = ORIENTED_EDGE ( 'NONE', *, *, #167, .T. ) ;
#364 = CARTESIAN_POINT ( 'NONE',  ( 0.6500000000000000222, 5.299999999999998934, 0.0000000000000000000 ) ) ;
#365 = DATE_AND_TIME ( #619, #865 ) ;
#366 = ORIENTED_EDGE ( 'NONE', *, *, #167, .F. ) ;
#367 = ADVANCED_FACE ( 'NONE', ( #767 ), #596, .F. ) ;
#368 = DIRECTION ( 'NONE',  ( 0.3481553119113938721, -0.8703882797784905367, 0.3481553119113938166 ) ) ;
#369 = CARTESIAN_POINT ( 'NONE',  ( -0.9450000000000048361, 3.200000000000000178, -0.6249999999999962252 ) ) ;
#370 = APPROVAL_PERSON_ORGANIZATION ( #624, #693, #40 ) ;
#371 = VECTOR ( 'NONE', #498, 1000.000000000000000 ) ;
#372 = LINE ( 'NONE', #1242, #62 ) ;
#373 = AXIS2_PLACEMENT_3D ( 'NONE', #312, #1130, #1159 ) ;
#374 = ORIENTED_EDGE ( 'NONE', *, *, #199, .T. ) ;
#375 = DIRECTION ( 'NONE',  ( 1.000000000000000000, 0.0000000000000000000, 0.0000000000000000000 ) ) ;
#376 = DIRECTION ( 'NONE',  ( 0.0000000000000000000, 1.000000000000000000, 0.0000000000000000000 ) ) ;
#377 = CC_DESIGN_APPROVAL ( #299, ( #163 ) ) ;
#378 = EDGE_CURVE ( 'NONE', #702, #643, #521, .T. ) ;
#379 = CARTESIAN_POINT ( 'NONE',  ( -0.6949999999999983968, 5.299999999999999822, 1.524999999999999911 ) ) ;
#380 = EDGE_LOOP ( 'NONE', ( #256, #1212, #86, #1122 ) ) ;
#381 = CC_DESIGN_PERSON_AND_ORGANIZATION_ASSIGNMENT ( #1162, #911, ( #170 ) ) ;
#382 = DIRECTION ( 'NONE',  ( -0.7071067811865474617, -0.0000000000000000000, -0.7071067811865474617 ) ) ;
#383 = CARTESIAN_POINT ( 'NONE',  ( 0.6500000000000000222, 21.19999999999999929, 0.0000000000000000000 ) ) ;
#384 = VECTOR ( 'NONE', #661, 1000.000000000000114 ) ;
#385 = FACE_OUTER_BOUND ( 'NONE', #539, .T. ) ;
#386 = VERTEX_POINT ( 'NONE', #3 ) ;
#387 = VECTOR ( 'NONE', #1235, 1000.000000000000000 ) ;
#388 = PERSON ( 'UNSPECIFIED', 'UNSPECIFIED', 'UNSPECIFIED', ('UNSPECIFIED'), ('UNSPECIFIED'), ('UNSPECIFIED') ) ;
#389 = ORGANIZATION ( 'NAUO-ORG6', 'UNSPECIFIED', 'UNSPECIFIED' ) ;
#390 = DIRECTION ( 'NONE',  ( 1.000000000000000000, 0.0000000000000000000, 0.0000000000000000000 ) ) ;
#391 = EDGE_LOOP ( 'NONE', ( #1027, #852, #712, #841, #1101 ) ) ;
#392 = VERTEX_POINT ( 'NONE', #194 ) ;
#393 = DESIGN_CONTEXT ( 'detailed design', #343, 'design' ) ;
#394 = VERTEX_POINT ( 'NONE', #95 ) ;
#395 = ORIENTED_EDGE ( 'NONE', *, *, #354, .F. ) ;
#396 = ORIENTED_EDGE ( 'NONE', *, *, #143, .F. ) ;
#397 = DIRECTION ( 'NONE',  ( 0.0000000000000000000, 0.0000000000000000000, -1.000000000000000000 ) ) ;
#398 = CALENDAR_DATE ( 2020, 25, 12 ) ;
#399 = DIRECTION ( 'NONE',  ( 0.3481553119113938721, 0.8703882797784906478, 0.3481553119113938721 ) ) ;
#400 = APPROVAL ( #153, 'UNKNOWN' ) ;
#401 = DIRECTION ( 'NONE',  ( -0.0000000000000000000, 1.000000000000000000, -0.0000000000000000000 ) ) ;
#402 = COORDINATED_UNIVERSAL_TIME_OFFSET ( 1, 0, .AHEAD. ) ;
#403 = VECTOR ( 'NONE', #866, 1000.000000000000000 ) ;
#404 = EDGE_CURVE ( 'NONE', #177, #392, #288, .T. ) ;
#405 = DIRECTION ( 'NONE',  ( -0.7071067811865474617, -0.0000000000000000000, 0.7071067811865474617 ) ) ;
#406 = VECTOR ( 'NONE', #951, 1000.000000000000000 ) ;
#407 = AXIS2_PLACEMENT_3D ( 'NONE', #47, #646, #1023 ) ;
#408 = DIRECTION ( 'NONE',  ( -0.0000000000000000000, 0.0000000000000000000, -1.000000000000000000 ) ) ;
#409 = APPROVAL ( #905, 'UNKNOWN' ) ;
#410 = DIRECTION ( 'NONE',  ( 1.000000000000000000, 0.0000000000000000000, -0.0000000000000000000 ) ) ;
#411 = ORGANIZATION ( 'NAUO-ORG3', 'UNSPECIFIED', 'UNSPECIFIED' ) ;
#412 = CARTESIAN_POINT ( 'NONE',  ( -0.6949999999999983968, 3.000000000000000000, 1.524999999999999911 ) ) ;
#413 = ORIENTED_EDGE ( 'NONE', *, *, #277, .T. ) ;
#414 =( GEOMETRIC_REPRESENTATION_CONTEXT ( 3 ) GLOBAL_UNCERTAINTY_ASSIGNED_CONTEXT ( ( #927 ) ) GLOBAL_UNIT_ASSIGNED_CONTEXT ( ( #169, #1044, #76 ) ) REPRESENTATION_CONTEXT ( 'NONE', 'WORKASPACE' ) );
#415 = DIRECTION ( 'NONE',  ( 0.7071067811865475727, 0.0000000000000000000, 0.7071067811865475727 ) ) ;
#416 = LINE ( 'NONE', #875, #384 ) ;
#417 = VECTOR ( 'NONE', #196, 1000.000000000000000 ) ;
#418 = DIRECTION ( 'NONE',  ( -0.0000000000000000000, 0.0000000000000000000, -1.000000000000000000 ) ) ;
#419 = ORIENTED_EDGE ( 'NONE', *, *, #674, .T. ) ;
#420 = LINE ( 'NONE', #1035, #387 ) ;
#421 = COORDINATED_UNIVERSAL_TIME_OFFSET ( 1, 0, .AHEAD. ) ;
#422 = EDGE_CURVE ( 'NONE', #823, #1012, #1255, .T. ) ;
#423 = ORIENTED_EDGE ( 'NONE', *, *, #1003, .T. ) ;
#424 = ORIENTED_EDGE ( 'NONE', *, *, #143, .T. ) ;
#425 = ORIENTED_EDGE ( 'NONE', *, *, #486, .F. ) ;
#426 = CARTESIAN_POINT ( 'NONE',  ( -0.6949999999999983968, 5.299999999999999822, 1.524999999999999911 ) ) ;
#427 = ITEM_DEFINED_TRANSFORMATION ( 'NONE', 'NONE', #1201,  #1069 ) ;
#428 = EDGE_CURVE ( 'NONE', #228, #208, #255, .T. ) ;
#429 = EDGE_CURVE ( 'NONE', #557, #119, #733, .T. ) ;
#430 = CARTESIAN_POINT ( 'NONE',  ( 0.0000000000000000000, 21.19999999999999929, 0.6500000000000000222 ) ) ;
#431 = DATE_AND_TIME ( #676, #933 ) ;
#432 = VECTOR ( 'NONE', #186, 1000.000000000000000 ) ;
#433 = LINE ( 'NONE', #292, #129 ) ;
#434 = APPROVAL_ROLE ( '' ) ;
#435 = SECURITY_CLASSIFICATION_LEVEL ( 'unclassified' ) ;
#436 = VERTEX_POINT ( 'NONE', #1063 ) ;
#437 = CC_DESIGN_DATE_AND_TIME_ASSIGNMENT ( #350, #1004, ( #163 ) ) ;
#438 = COORDINATED_UNIVERSAL_TIME_OFFSET ( 1, 0, .AHEAD. ) ;
#439 = PERSON_AND_ORGANIZATION_ROLE ( 'design_owner' ) ;
#440 = EDGE_CURVE ( 'NONE', #689, #386, #965, .T. ) ;
#441 = SECURITY_CLASSIFICATION_LEVEL ( 'unclassified' ) ;
#442 = CARTESIAN_POINT ( 'NONE',  ( 1.345000000000001750, 5.299999999999999822, -0.8749999999999998890 ) ) ;
#443 = COORDINATED_UNIVERSAL_TIME_OFFSET ( 1, 0, .AHEAD. ) ;
#444 = CC_DESIGN_PERSON_AND_ORGANIZATION_ASSIGNMENT ( #900, #348, ( #170 ) ) ;
#445 = LINE ( 'NONE', #991, #172 ) ;
#446 = LINE ( 'NONE', #620, #173 ) ;
#447 = VERTEX_POINT ( 'NONE', #783 ) ;
#448 = AXIS2_PLACEMENT_3D ( 'NONE', #442, #25, #349 ) ;
#449 = SECURITY_CLASSIFICATION_LEVEL ( 'unclassified' ) ;
#450 = EDGE_LOOP ( 'NONE', ( #366, #813, #419, #937 ) ) ;
#451 = PRODUCT_DEFINITION_SHAPE ( 'NONE', 'NONE',  #1262 ) ;
#452 = EDGE_LOOP ( 'NONE', ( #1177, #595, #541, #53 ) ) ;
#453 = DATE_TIME_ROLE ( 'classification_date' ) ;
#454 = COORDINATED_UNIVERSAL_TIME_OFFSET ( 1, 0, .AHEAD. ) ;
#455 = CARTESIAN_POINT ( 'NONE',  ( -0.9450000000000005063, 3.200000000000000178, 1.274999999999997913 ) ) ;
#456 = PERSON_AND_ORGANIZATION ( #388, #283 ) ;
#457 = LINE ( 'NONE', #561, #432 ) ;
#458 = LINE ( 'NONE', #769, #1164 ) ;
#459 = CC_DESIGN_APPROVAL ( #400, ( #976 ) ) ;
#460 = ORIENTED_EDGE ( 'NONE', *, *, #1133, .F. ) ;
#461 = CARTESIAN_POINT ( 'NONE',  ( 0.0000000000000000000, 5.299999999999998934, 0.6500000000000000222 ) ) ;
#462 = PLANE ( 'NONE',  #814 ) ;
#463 = EDGE_CURVE ( 'NONE', #823, #351, #227, .T. ) ;
#464 = ORIENTED_EDGE ( 'NONE', *, *, #486, .T. ) ;
#465 = CARTESIAN_POINT ( 'NONE',  ( -4.405000000000000249, 3.000000000000000000, 1.274999999999997913 ) ) ;
#466 = EDGE_CURVE ( 'NONE', #22, #627, #838, .T. ) ;
#467 = CC_DESIGN_APPROVAL ( #409, ( #265 ) ) ;
#468 = DATE_AND_TIME ( #716, #978 ) ;
#469 = DIRECTION ( 'NONE',  ( 1.000000000000000000, -0.0000000000000000000, -0.0000000000000000000 ) ) ;
#470 = LINE ( 'NONE', #798, #207 ) ;
#471 = ORIENTED_EDGE ( 'NONE', *, *, #192, .F. ) ;
#472 = CARTESIAN_POINT ( 'NONE',  ( 0.0000000000000000000, 21.19999999999999929, 0.6500000000000000222 ) ) ;
#473 = PERSON_AND_ORGANIZATION ( #950, #720 ) ;
#474 = ORIENTED_EDGE ( 'NONE', *, *, #1154, .F. ) ;
#475 = AXIS2_PLACEMENT_3D ( 'NONE', #178, #756, #75 ) ;
#476 = ORIENTED_EDGE ( 'NONE', *, *, #816, .T. ) ;
#477 = EDGE_CURVE ( 'NONE', #22, #924, #934, .T. ) ;
#478 = SHAPE_REPRESENTATION ( 'PinHeader 7x21mm', ( #844, #1201, #7, #68, #137, #202, #273, #347 ), #414 ) ;
#479 = PRODUCT ( '1_Male_Pin_2.54_mm', '1_Male_Pin_2.54_mm', '', ( #1011 ) ) ;
#480 = DIRECTION ( 'NONE',  ( 0.0000000000000000000, -1.000000000000000000, 0.0000000000000000000 ) ) ;
#481 = LOCAL_TIME ( 20, 15, 49.00000000000000000, #443 ) ;
#482 = PLANE ( 'NONE',  #743 ) ;
#483 = DIRECTION ( 'NONE',  ( 0.3481553119113947603, -0.8703882797784899816, -0.3481553119113947603 ) ) ;
#484 = CARTESIAN_POINT ( 'NONE',  ( 0.0000000000000000000, 21.19999999999999929, 0.09999999999999939493 ) ) ;
#485 = EDGE_CURVE ( 'NONE', #859, #669, #458, .T. ) ;
#486 = EDGE_CURVE ( 'NONE', #735, #436, #161, .T. ) ;
#487 = PERSON_AND_ORGANIZATION ( #388, #283 ) ;
#488 = VECTOR ( 'NONE', #935, 1000.000000000000000 ) ;
#489 = VECTOR ( 'NONE', #839, 1000.000000000000000 ) ;
#490 = VECTOR ( 'NONE', #775, 1000.000000000000000 ) ;
#491 = ORIENTED_EDGE ( 'NONE', *, *, #466, .F. ) ;
#492 = CARTESIAN_POINT ( 'NONE',  ( 0.0000000000000000000, 0.2000000000000000944, 0.0000000000000000000 ) ) ;
#493 = DIRECTION ( 'NONE',  ( 1.000000000000000000, 0.0000000000000000000, 0.0000000000000000000 ) ) ;
#494 = PLANE ( 'NONE',  #373 ) ;
#495 = PERSON_AND_ORGANIZATION ( #759, #742 ) ;
#496 = AXIS2_PLACEMENT_3D ( 'NONE', #509, #945, #10 ) ;
#497 = DIRECTION ( 'NONE',  ( 1.000000000000000000, 0.0000000000000000000, -0.0000000000000000000 ) ) ;
#498 = DIRECTION ( 'NONE',  ( 0.0000000000000000000, 0.0000000000000000000, -1.000000000000000000 ) ) ;
#499 = CC_DESIGN_PERSON_AND_ORGANIZATION_ASSIGNMENT ( #1046, #336, ( #163 ) ) ;
#500 = CARTESIAN_POINT ( 'NONE',  ( -4.405000000000000249, 3.000000000000000000, 1.274999999999997913 ) ) ;
#501 = PERSON_AND_ORGANIZATION ( #388, #283 ) ;
#502 = VECTOR ( 'NONE', #898, 1000.000000000000000 ) ;
#503 = EDGE_CURVE ( 'NONE', #622, #859, #433, .T. ) ;
#504 = VERTEX_POINT ( 'NONE', #1157 ) ;
#505 = LOCAL_TIME ( 20, 15, 49.00000000000000000, #750 ) ;
#506 = DIRECTION ( 'NONE',  ( -1.000000000000000000, 0.0000000000000000000, 0.0000000000000000000 ) ) ;
#507 = CLOSED_SHELL ( 'NONE', ( #150, #556, #511, #1221, #1076, #650, #699, #313, #1029, #209, #931, #139, #318, #717, #690, #985, #1227, #1013, #604, #514, #109, #54, #346, #367, #1182, #156, #543, #736, #923, #218, #888, #1026 ) ) ;
#508 = SECURITY_CLASSIFICATION ( '', '', #441 ) ;
#509 = CARTESIAN_POINT ( 'NONE',  ( 0.5500000000000005995, 21.19999999999999929, -9.174018382569664376E-17 ) ) ;
#510 = ORIENTED_EDGE ( 'NONE', *, *, #34, .F. ) ;
#511 = ADVANCED_FACE ( 'NONE', ( #902 ), #958, .F. ) ;
#512 = CARTESIAN_POINT ( 'NONE',  ( 1.595000000000000195, 5.299999999999999822, -0.8749999999999998890 ) ) ;
#513 = PLANE ( 'NONE',  #990 ) ;
#514 = ADVANCED_FACE ( 'NONE', ( #1131 ), #1247, .F. ) ;
#515 = CARTESIAN_POINT ( 'NONE',  ( -4.405000000000000249, 3.000000000000000000, -0.6249999999999962252 ) ) ;
#516 = COORDINATED_UNIVERSAL_TIME_OFFSET ( 1, 0, .AHEAD. ) ;
#517 = LINE ( 'NONE', #306, #252 ) ;
#518 = VECTOR ( 'NONE', #358, 1000.000000000000000 ) ;
#519 = CARTESIAN_POINT ( 'NONE',  ( 0.5500000000000005995, 21.19999999999999929, 0.09999999999999939493 ) ) ;
#520 = ORIENTED_EDGE ( 'NONE', *, *, #632, .F. ) ;
#521 = LINE ( 'NONE', #969, #1025 ) ;
#522 = ORIENTED_EDGE ( 'NONE', *, *, #1143, .T. ) ;
#523 = CONTEXT_DEPENDENT_SHAPE_REPRESENTATION ( #805, #989 ) ;
#524 = CC_DESIGN_DATE_AND_TIME_ASSIGNMENT ( #122, #250, ( #976 ) ) ;
#525 = ADVANCED_BREP_SHAPE_REPRESENTATION ( '', ( #1096, #1069 ), #939 ) ;
#526 = ORIENTED_EDGE ( 'NONE', *, *, #440, .F. ) ;
#527 = PERSON_AND_ORGANIZATION_ROLE ( 'classification_officer' ) ;
#528 = LOCAL_TIME ( 20, 15, 49.00000000000000000, #774 ) ;
#529 = AXIS2_PLACEMENT_3D ( 'NONE', #1228, #737, #160 ) ;
#530 = DIRECTION ( 'NONE',  ( -0.0000000000000000000, -0.0000000000000000000, -1.000000000000000000 ) ) ;
#531 = PERSON_AND_ORGANIZATION ( #388, #283 ) ;
#532 = CC_DESIGN_DATE_AND_TIME_ASSIGNMENT ( #667, #812, ( #265 ) ) ;
#533 = LINE ( 'NONE', #168, #269 ) ;
#534 = ORIENTED_EDGE ( 'NONE', *, *, #463, .F. ) ;
#535 = COORDINATED_UNIVERSAL_TIME_OFFSET ( 1, 0, .AHEAD. ) ;
#536 = ORIENTED_EDGE ( 'NONE', *, *, #18, .T. ) ;
#537 = PERSON_AND_ORGANIZATION_ROLE ( 'classification_officer' ) ;
#538 = DIRECTION ( 'NONE',  ( -1.000000000000000000, 0.0000000000000000000, 0.0000000000000000000 ) ) ;
#539 = EDGE_LOOP ( 'NONE', ( #152, #1038, #195, #966, #270 ) ) ;
#540 = APPROVAL_STATUS ( 'not_yet_approved' ) ;
#541 = ORIENTED_EDGE ( 'NONE', *, *, #1077, .F. ) ;
#542 = EDGE_CURVE ( 'NONE', #1151, #702, #626, .T. ) ;
#543 = ADVANCED_FACE ( 'NONE', ( #1100 ), #578, .F. ) ;
#544 = PERSON_AND_ORGANIZATION_ROLE ( 'classification_officer' ) ;
#545 = SHAPE_DEFINITION_REPRESENTATION ( #220, #205 ) ;
#546 = FACE_OUTER_BOUND ( 'NONE', #391, .T. ) ;
#547 = LINE ( 'NONE', #1218, #518 ) ;
#548 = VERTEX_POINT ( 'NONE', #854 ) ;
#549 = FACE_OUTER_BOUND ( 'NONE', #380, .T. ) ;
#550 = ORIENTED_EDGE ( 'NONE', *, *, #936, .T. ) ;
#551 = DESIGN_CONTEXT ( 'detailed design', #1102, 'design' ) ;
#552 = DATE_AND_TIME ( #797, #1058 ) ;
#553 = DIRECTION ( 'NONE',  ( 1.000000000000000000, 0.0000000000000000000, 0.0000000000000000000 ) ) ;
#554 = EDGE_CURVE ( 'NONE', #331, #766, #98, .T. ) ;
#555 = EDGE_CURVE ( 'NONE', #215, #781, #840, .T. ) ;
#556 = ADVANCED_FACE ( 'NONE', ( #1067 ), #576, .T. ) ;
#557 = VERTEX_POINT ( 'NONE', #275 ) ;
#558 = ORIENTED_EDGE ( 'NONE', *, *, #947, .F. ) ;
#559 = CARTESIAN_POINT ( 'NONE',  ( 0.6500000000000003553, 3.200000000000000178, 0.6500000000000000222 ) ) ;
#560 = COORDINATED_UNIVERSAL_TIME_OFFSET ( 1, 0, .AHEAD. ) ;
#561 = CARTESIAN_POINT ( 'NONE',  ( 1.595000000000000195, 3.000000000000000000, 1.274999999999997913 ) ) ;
#562 = DIRECTION ( 'NONE',  ( -0.9284766908852597478, 0.3713906763541026113, 0.0000000000000000000 ) ) ;
#563 = COORDINATED_UNIVERSAL_TIME_OFFSET ( 1, 0, .AHEAD. ) ;
#564 = PLANE ( 'NONE',  #1094 ) ;
#565 = DIRECTION ( 'NONE',  ( -0.0000000000000000000, 1.000000000000000000, 0.0000000000000000000 ) ) ;
#566 = FACE_OUTER_BOUND ( 'NONE', #67, .T. ) ;
#567 = SECURITY_CLASSIFICATION ( '', '', #37 ) ;
#568 = EDGE_LOOP ( 'NONE', ( #922, #916, #185, #1179 ) ) ;
#569 = APPROVAL_PERSON_ORGANIZATION ( #1046, #299, #131 ) ;
#570 = ORIENTED_EDGE ( 'NONE', *, *, #1169, .T. ) ;
#571 = CARTESIAN_POINT ( 'NONE',  ( 0.0000000000000000000, 21.19999999999999929, 0.5500000000000005995 ) ) ;
#572 = EDGE_CURVE ( 'NONE', #781, #71, #372, .T. ) ;
#573 = DATE_AND_TIME ( #817, #1075 ) ;
#574 = CC_DESIGN_PERSON_AND_ORGANIZATION_ASSIGNMENT ( #651, #537, ( #508 ) ) ;
#575 = ORIENTED_EDGE ( 'NONE', *, *, #199, .F. ) ;
#576 = PLANE ( 'NONE',  #605 ) ;
#577 = DIRECTION ( 'NONE',  ( 1.000000000000000000, 0.0000000000000000000, 0.0000000000000000000 ) ) ;
#578 = PLANE ( 'NONE',  #475 ) ;
#579 = VECTOR ( 'NONE', #698, 1000.000000000000000 ) ;
#580 = FACE_OUTER_BOUND ( 'NONE', #972, .T. ) ;
#581 = ORIENTED_EDGE ( 'NONE', *, *, #2, .T. ) ;
#582 = LINE ( 'NONE', #426, #49 ) ;
#583 = ORIENTED_EDGE ( 'NONE', *, *, #428, .T. ) ;
#584 = CALENDAR_DATE ( 2020, 25, 12 ) ;
#585 = CARTESIAN_POINT ( 'NONE',  ( 0.1666666666666673235, 0.03333333333333405452, 0.4833333333333327264 ) ) ;
#586 = CARTESIAN_POINT ( 'NONE',  ( 1.595000000000000195, 3.000000000000000000, -0.8749999999999998890 ) ) ;
#587 = APPROVAL_PERSON_ORGANIZATION ( #832, #400, #828 ) ;
#588 = DIRECTION ( 'NONE',  ( 0.0000000000000000000, 0.0000000000000000000, -1.000000000000000000 ) ) ;
#589 = ORIENTED_EDGE ( 'NONE', *, *, #542, .T. ) ;
#590 = CC_DESIGN_PERSON_AND_ORGANIZATION_ASSIGNMENT ( #832, #928, ( #976 ) ) ;
#591 = CARTESIAN_POINT ( 'NONE',  ( 0.08787878787878893039, 0.2303030303030306758, 0.08787878787878893039 ) ) ;
#592 = DATE_AND_TIME ( #837, #1098 ) ;
#593 = VECTOR ( 'NONE', #971, 1000.000000000000000 ) ;
#594 = VECTOR ( 'NONE', #1060, 1000.000000000000114 ) ;
#595 = ORIENTED_EDGE ( 'NONE', *, *, #134, .F. ) ;
#596 = PLANE ( 'NONE',  #72 ) ;
#597 = CARTESIAN_POINT ( 'NONE',  ( 0.0000000000000000000, 20.94999999999999929, 0.6500000000000000222 ) ) ;
#598 = CC_DESIGN_PERSON_AND_ORGANIZATION_ASSIGNMENT ( #115, #1200, ( #265 ) ) ;
#599 = DIRECTION ( 'NONE',  ( 0.0000000000000000000, -1.000000000000000000, 0.0000000000000000000 ) ) ;
#600 = CARTESIAN_POINT ( 'NONE',  ( 1.336306770598546523, 2.256187637073627350, 11.06368319029513003 ) ) ;
#601 = CALENDAR_DATE ( 2020, 25, 12 ) ;
#602 = CARTESIAN_POINT ( 'NONE',  ( 1.595000000000000195, 5.299999999999999822, 1.275000000000001465 ) ) ;
#603 =( LENGTH_UNIT ( ) NAMED_UNIT ( * ) SI_UNIT ( .MILLI., .METRE. ) );
#604 = ADVANCED_FACE ( 'NONE', ( #566 ), #1140, .F. ) ;
#605 = AXIS2_PLACEMENT_3D ( 'NONE', #850, #171, #752 ) ;
#606 = CARTESIAN_POINT ( 'NONE',  ( 1.345000000000001750, 5.299999999999999822, -0.8749999999999998890 ) ) ;
#607 = CARTESIAN_POINT ( 'NONE',  ( -0.9449999999999998401, 5.299999999999999822, -0.8749999999999998890 ) ) ;
#608 = LINE ( 'NONE', #175, #579 ) ;
#609 = ORIENTED_EDGE ( 'NONE', *, *, #266, .F. ) ;
#610 = VECTOR ( 'NONE', #344, 1000.000000000000000 ) ;
#611 = EDGE_LOOP ( 'NONE', ( #1090, #1020, #583, #1052 ) ) ;
#612 = VECTOR ( 'NONE', #565, 1000.000000000000000 ) ;
#613 = PRODUCT_DEFINITION_SHAPE ( 'NONE', 'NONE',  #1260 ) ;
#614 = ITEM_DEFINED_TRANSFORMATION ( 'NONE', 'NONE', #347,  #1069 ) ;
#615 = EDGE_LOOP ( 'NONE', ( #26, #374, #695, #833 ) ) ;
#616 = DIRECTION ( 'NONE',  ( -1.000000000000000000, 0.0000000000000000000, 0.0000000000000000000 ) ) ;
#617 = CARTESIAN_POINT ( 'NONE',  ( 1.345000000000001750, 5.299999999999999822, 1.524999999999999911 ) ) ;
#618 = EDGE_CURVE ( 'NONE', #1061, #1215, #303, .T. ) ;
#619 = CALENDAR_DATE ( 2020, 25, 12 ) ;
#620 = CARTESIAN_POINT ( 'NONE',  ( 0.0000000000000000000, 21.19999999999999929, 0.09999999999999939493 ) ) ;
#621 = DIRECTION ( 'NONE',  ( 1.000000000000000000, 0.0000000000000000000, -0.0000000000000000000 ) ) ;
#622 = VERTEX_POINT ( 'NONE', #1043 ) ;
#623 = SECURITY_CLASSIFICATION_LEVEL ( 'unclassified' ) ;
#624 = PERSON_AND_ORGANIZATION ( #388, #283 ) ;
#625 = FACE_OUTER_BOUND ( 'NONE', #1115, .T. ) ;
#626 = LINE ( 'NONE', #1049, #872 ) ;
#627 = VERTEX_POINT ( 'NONE', #104 ) ;
#628 = AXIS2_PLACEMENT_3D ( 'NONE', #383, #1050, #654 ) ;
#629 = APPROVAL_ROLE ( '' ) ;
#630 = MECHANICAL_CONTEXT ( 'NONE', #821, 'mechanical' ) ;
#631 = ITEM_DEFINED_TRANSFORMATION ( 'NONE', 'NONE', #137,  #1069 ) ;
#632 = EDGE_CURVE ( 'NONE', #208, #1085, #533, .T. ) ;
#633 = APPROVAL_STATUS ( 'not_yet_approved' ) ;
#634 = CC_DESIGN_DATE_AND_TIME_ASSIGNMENT ( #870, #1207, ( #508 ) ) ;
#635 = VECTOR ( 'NONE', #4, 1000.000000000000000 ) ;
#636 = ORIENTED_EDGE ( 'NONE', *, *, #214, .T. ) ;
#637 = LINE ( 'NONE', #1016, #1114 ) ;
#638 = PERSON_AND_ORGANIZATION_ROLE ( 'creator' ) ;
#639 = PLANE ( 'NONE',  #448 ) ;
#640 = ORIENTED_EDGE ( 'NONE', *, *, #477, .T. ) ;
#641 = LINE ( 'NONE', #66, #612 ) ;
#642 = APPROVAL_DATE_TIME ( #892, #409 ) ;
#643 = VERTEX_POINT ( 'NONE', #27 ) ;
#644 =( REPRESENTATION_RELATIONSHIP ('NONE','NONE', #478, #205 ) REPRESENTATION_RELATIONSHIP_WITH_TRANSFORMATION ( #57 )SHAPE_REPRESENTATION_RELATIONSHIP( ) );
#645 = ORIENTED_EDGE ( 'NONE', *, *, #873, .T. ) ;
#646 = DIRECTION ( 'NONE',  ( -1.000000000000000000, 0.0000000000000000000, 0.0000000000000000000 ) ) ;
#647 = LOCAL_TIME ( 20, 15, 49.00000000000000000, #897 ) ;
#648 = PLANE ( 'NONE',  #529 ) ;
#649 = SECURITY_CLASSIFICATION ( '', '', #726 ) ;
#650 = ADVANCED_FACE ( 'NONE', ( #6 ), #803, .F. ) ;
#651 = PERSON_AND_ORGANIZATION ( #388, #283 ) ;
#652 = VECTOR ( 'NONE', #483, 1000.000000000000000 ) ;
#653 = DIRECTION ( 'NONE',  ( 1.000000000000000000, 0.0000000000000000000, 0.0000000000000000000 ) ) ;
#654 = DIRECTION ( 'NONE',  ( 1.668003342285391797E-16, 0.0000000000000000000, 1.000000000000000000 ) ) ;
#655 = APPROVAL_DATE_TIME ( #907, #1167 ) ;
#656 = SECURITY_CLASSIFICATION ( '', '', #904 ) ;
#657 = CARTESIAN_POINT ( 'NONE',  ( 0.09999999999999939493, 21.19999999999999929, 0.09999999999999939493 ) ) ;
#658 = DIRECTION ( 'NONE',  ( 0.0000000000000000000, 0.3713906763541015565, 0.9284766908852601919 ) ) ;
#659 = PERSON ( 'NAUO-PER7', 'UNSPECIFIED', 'UNSPECIFIED', ('UNSPECIFIED'), ('UNSPECIFIED'), ('UNSPECIFIED') ) ;
#660 = CARTESIAN_POINT ( 'NONE',  ( 0.0000000000000000000, 3.200000000000000178, 0.0000000000000000000 ) ) ;
#661 = DIRECTION ( 'NONE',  ( 0.7071067811865474617, -0.0000000000000000000, -0.7071067811865474617 ) ) ;
#662 = VECTOR ( 'NONE', #784, 1000.000000000000000 ) ;
#663 = LINE ( 'NONE', #1095, #240 ) ;
#664 = ORIENTED_EDGE ( 'NONE', *, *, #103, .F. ) ;
#665 = VECTOR ( 'NONE', #653, 1000.000000000000000 ) ;
#666 = CARTESIAN_POINT ( 'NONE',  ( 1.595000000000000195, 5.299999999999999822, 1.275000000000001465 ) ) ;
#667 = DATE_AND_TIME ( #918, #1180 ) ;
#668 = CARTESIAN_POINT ( 'NONE',  ( 0.6500000000000000222, 20.94999999999999929, 0.0000000000000000000 ) ) ;
#669 = VERTEX_POINT ( 'NONE', #519 ) ;
#670 = ORIENTED_EDGE ( 'NONE', *, *, #1211, .F. ) ;
#671 = EDGE_LOOP ( 'NONE', ( #926, #58, #325, #247 ) ) ;
#672 = APPROVAL_DATE_TIME ( #930, #52 ) ;
#673 = DIRECTION ( 'NONE',  ( -1.668003342285391797E-16, 0.0000000000000000000, -1.000000000000000000 ) ) ;
#674 = EDGE_CURVE ( 'NONE', #682, #754, #1037, .T. ) ;
#675 = CARTESIAN_POINT ( 'NONE',  ( 0.5499999999999989342, 0.2000000000000000944, 0.0000000000000000000 ) ) ;
#676 = CALENDAR_DATE ( 2020, 25, 12 ) ;
#677 = VECTOR ( 'NONE', #588, 1000.000000000000000 ) ;
#678 = PLANE ( 'NONE',  #496 ) ;
#679 = VECTOR ( 'NONE', #960, 1000.000000000000000 ) ;
#680 = CARTESIAN_POINT ( 'NONE',  ( -4.405000000000000249, 3.200000000000000178, 1.274999999999997913 ) ) ;
#681 = DIRECTION ( 'NONE',  ( 0.7071067811865474617, -0.0000000000000000000, 0.7071067811865474617 ) ) ;
#682 = VERTEX_POINT ( 'NONE', #1091 ) ;
#683 = DATE_AND_TIME ( #938, #1199 ) ;
#684 = CARTESIAN_POINT ( 'NONE',  ( 0.0000000000000000000, 0.4500000000000037859, 0.0000000000000000000 ) ) ;
#685 = DIRECTION ( 'NONE',  ( 0.0000000000000000000, 0.0000000000000000000, 1.000000000000000000 ) ) ;
#686 = EDGE_CURVE ( 'NONE', #386, #436, #810, .T. ) ;
#687 = PERSON_AND_ORGANIZATION ( #388, #283 ) ;
#688 = LINE ( 'NONE', #776, #142 ) ;
#689 = VERTEX_POINT ( 'NONE', #799 ) ;
#690 = ADVANCED_FACE ( 'NONE', ( #780 ), #513, .T. ) ;
#691 = VECTOR ( 'NONE', #333, 1000.000000000000000 ) ;
#692 = EDGE_LOOP ( 'NONE', ( #294, #491, #1123, #856 ) ) ;
#693 = APPROVAL ( #633, 'UNSPECIFIED' ) ;
#694 =( NAMED_UNIT ( * ) PLANE_ANGLE_UNIT ( ) SI_UNIT ( $, .RADIAN. ) );
#695 = ORIENTED_EDGE ( 'NONE', *, *, #463, .T. ) ;
#696 = DIRECTION ( 'NONE',  ( 0.0000000000000000000, 1.000000000000000000, 0.0000000000000000000 ) ) ;
#697 = EDGE_LOOP ( 'NONE', ( #91, #38, #522, #636 ) ) ;
#698 = DIRECTION ( 'NONE',  ( 0.0000000000000000000, 0.0000000000000000000, 1.000000000000000000 ) ) ;
#699 = ADVANCED_FACE ( 'NONE', ( #239 ), #998, .T. ) ;
#700 = DIRECTION ( 'NONE',  ( 0.0000000000000000000, -1.000000000000000000, 0.0000000000000000000 ) ) ;
#701 = APPROVAL_PERSON_ORGANIZATION ( #957, #52, #1022 ) ;
#702 = VERTEX_POINT ( 'NONE', #315 ) ;
#703 = DIRECTION ( 'NONE',  ( 0.0000000000000000000, -0.0000000000000000000, 1.000000000000000000 ) ) ;
#704 = DATE_AND_TIME ( #961, #1223 ) ;
#705 = VECTOR ( 'NONE', #1238, 1000.000000000000000 ) ;
#706 = FACE_OUTER_BOUND ( 'NONE', #1121, .T. ) ;
#707 = VECTOR ( 'NONE', #92, 1000.000000000000000 ) ;
#708 = EDGE_LOOP ( 'NONE', ( #213, #174, #997, #874, #293 ) ) ;
#709 = PLANE ( 'NONE',  #407 ) ;
#710 = CC_DESIGN_SECURITY_CLASSIFICATION ( #649, ( #1258 ) ) ;
#711 = CARTESIAN_POINT ( 'NONE',  ( -0.6950000000000013944, 5.299999999999999822, -0.8749999999999998890 ) ) ;
#712 = ORIENTED_EDGE ( 'NONE', *, *, #883, .F. ) ;
#713 = DATE_TIME_ROLE ( 'classification_date' ) ;
#714 = CC_DESIGN_SECURITY_CLASSIFICATION ( #656, ( #1263 ) ) ;
#715 = PERSON_AND_ORGANIZATION_ROLE ( 'creator' ) ;
#716 = CALENDAR_DATE ( 2020, 25, 12 ) ;
#717 = ADVANCED_FACE ( 'NONE', ( #706 ), #16, .T. ) ;
#718 = LINE ( 'NONE', #430, #948 ) ;
#719 = APPROVAL_ROLE ( '' ) ;
#720 = ORGANIZATION ( 'NAUO-ORG5', 'UNSPECIFIED', 'UNSPECIFIED' ) ;
#721 = APPLICATION_PROTOCOL_DEFINITION ( 'international standard', 'config_control_design', 1994, #920 ) ;
#722 = PLANE ( 'NONE',  #126 ) ;
#723 = LINE ( 'NONE', #606, #225 ) ;
#724 = VERTEX_POINT ( 'NONE', #787 ) ;
#725 = AXIS2_PLACEMENT_3D ( 'NONE', #379, #942, #271 ) ;
#726 = SECURITY_CLASSIFICATION_LEVEL ( 'unclassified' ) ;
#727 =( REPRESENTATION_RELATIONSHIP ('NONE','NONE', #478, #205 ) REPRESENTATION_RELATIONSHIP_WITH_TRANSFORMATION ( #970 )SHAPE_REPRESENTATION_RELATIONSHIP( ) );
#728 = DIRECTION ( 'NONE',  ( -1.000000000000000000, 0.0000000000000000000, 0.0000000000000000000 ) ) ;
#729 = APPROVAL_DATE_TIME ( #993, #1172 ) ;
#730 = LINE ( 'NONE', #940, #1224 ) ;
#731 = FACE_OUTER_BOUND ( 'NONE', #1245, .T. ) ;
#732 = CARTESIAN_POINT ( 'NONE',  ( 0.0000000000000000000, 0.4500000000000037859, 0.0000000000000000000 ) ) ;
#733 = LINE ( 'NONE', #191, #707 ) ;
#734 = EDGE_CURVE ( 'NONE', #643, #984, #723, .T. ) ;
#735 = VERTEX_POINT ( 'NONE', #124 ) ;
#736 = ADVANCED_FACE ( 'NONE', ( #1053 ), #1174, .F. ) ;
#737 = DIRECTION ( 'NONE',  ( -0.9284766908852601919, 0.3713906763541015565, 0.0000000000000000000 ) ) ;
#738 = EDGE_LOOP ( 'NONE', ( #48, #764, #863, #796 ) ) ;
#739 = ORIENTED_EDGE ( 'NONE', *, *, #477, .F. ) ;
#740 = CARTESIAN_POINT ( 'NONE',  ( 0.4833333333333328374, 0.03333333333333402676, 0.1666666666666673513 ) ) ;
#741 = CARTESIAN_POINT ( 'NONE',  ( 0.6500000000000001332, 0.4500000000000037859, 0.6500000000000000222 ) ) ;
#742 = ORGANIZATION ( 'NAUO-ORG2', 'UNSPECIFIED', 'UNSPECIFIED' ) ;
#743 = AXIS2_PLACEMENT_3D ( 'NONE', #1048, #956, #375 ) ;
#744 = DIRECTION ( 'NONE',  ( -0.0000000000000000000, 0.0000000000000000000, -1.000000000000000000 ) ) ;
#745 = DIRECTION ( 'NONE',  ( 1.000000000000000000, -0.0000000000000000000, -0.0000000000000000000 ) ) ;
#746 = DATE_AND_TIME ( #1007, #5 ) ;
#747 = SHAPE_REPRESENTATION_RELATIONSHIP ( 'NONE' , 'NONE' ,  #205, #525 ) ;
#748 = ORIENTED_EDGE ( 'NONE', *, *, #342, .T. ) ;
#749 = DIRECTION ( 'NONE',  ( 0.3481553119113947603, 0.8703882797784899816, -0.3481553119113947603 ) ) ;
#750 = COORDINATED_UNIVERSAL_TIME_OFFSET ( 1, 0, .AHEAD. ) ;
#751 = EDGE_CURVE ( 'NONE', #1054, #1061, #1204, .T. ) ;
#752 = DIRECTION ( 'NONE',  ( 0.0000000000000000000, -0.0000000000000000000, -1.000000000000000000 ) ) ;
#753 = PLANE ( 'NONE',  #628 ) ;
#754 = VERTEX_POINT ( 'NONE', #981 ) ;
#755 = CC_DESIGN_APPROVAL ( #693, ( #508 ) ) ;
#756 = DIRECTION ( 'NONE',  ( 0.0000000000000000000, 0.0000000000000000000, -1.000000000000000000 ) ) ;
#757 = CARTESIAN_POINT ( 'NONE',  ( -11.36369322940145388, 2.256187637073627350, 11.06368319029512648 ) ) ;
#758 = PRODUCT_DEFINITION_SHAPE ( 'NONE', 'NONE',  #1258 ) ;
#759 = PERSON ( 'NAUO-PER2', 'UNSPECIFIED', 'UNSPECIFIED', ('UNSPECIFIED'), ('UNSPECIFIED'), ('UNSPECIFIED') ) ;
#760 = DIRECTION ( 'NONE',  ( 1.000000000000000000, 0.0000000000000000000, 0.0000000000000000000 ) ) ;
#761 = CARTESIAN_POINT ( 'NONE',  ( 1.345000000000001750, 3.000000000000000000, 1.524999999999999911 ) ) ;
#762 = APPROVAL_PERSON_ORGANIZATION ( #1018, #1172, #1202 ) ;
#763 = FACE_OUTER_BOUND ( 'NONE', #229, .T. ) ;
#764 = ORIENTED_EDGE ( 'NONE', *, *, #429, .T. ) ;
#765 = LINE ( 'NONE', #732, #1253 ) ;
#766 = VERTEX_POINT ( 'NONE', #602 ) ;
#767 = FACE_OUTER_BOUND ( 'NONE', #345, .T. ) ;
#768 = ORIENTED_EDGE ( 'NONE', *, *, #154, .T. ) ;
#769 = CARTESIAN_POINT ( 'NONE',  ( 0.5500000000000005995, 21.19999999999999929, 1.668003342285381197E-17 ) ) ;
#770 = APPROVAL_PERSON_ORGANIZATION ( #1028, #782, #719 ) ;
#771 = CARTESIAN_POINT ( 'NONE',  ( 0.0000000000000000000, 0.4500000000000037859, 0.0000000000000000000 ) ) ;
#772 = DIRECTION ( 'NONE',  ( 0.0000000000000000000, 0.0000000000000000000, -1.000000000000000000 ) ) ;
#773 = APPROVAL ( #1015, 'UNKNOWN' ) ;
#774 = COORDINATED_UNIVERSAL_TIME_OFFSET ( 1, 0, .AHEAD. ) ;
#775 = DIRECTION ( 'NONE',  ( 0.3481553119113947603, -0.8703882797784899816, 0.3481553119113947603 ) ) ;
#776 = CARTESIAN_POINT ( 'NONE',  ( -0.6949999999999983968, 5.299999999999999822, 1.524999999999999911 ) ) ;
#777 = DIRECTION ( 'NONE',  ( 1.668003342285391797E-16, 0.0000000000000000000, 1.000000000000000000 ) ) ;
#778 = APPROVAL_DATE_TIME ( #1036, #1017 ) ;
#779 = CARTESIAN_POINT ( 'NONE',  ( 0.1000000000000011297, 0.2000000000000000944, 0.1000000000000011297 ) ) ;
#780 = FACE_OUTER_BOUND ( 'NONE', #738, .T. ) ;
#781 = VERTEX_POINT ( 'NONE', #1074 ) ;
#782 = APPROVAL ( #1196, 'UNKNOWN' ) ;
#783 = CARTESIAN_POINT ( 'NONE',  ( 0.6500000000000003553, 3.200000000000000178, 0.0000000000000000000 ) ) ;
#784 = DIRECTION ( 'NONE',  ( 0.3481553119113938721, 0.8703882797784906478, -0.3481553119113938721 ) ) ;
#785 = ORIENTED_EDGE ( 'NONE', *, *, #221, .T. ) ;
#786 = DIRECTION ( 'NONE',  ( 1.000000000000000000, 0.0000000000000000000, 0.0000000000000000000 ) ) ;
#787 = CARTESIAN_POINT ( 'NONE',  ( 1.595000000000000195, 3.000000000000000000, 1.274999999999997913 ) ) ;
#788 = CARTESIAN_POINT ( 'NONE',  ( -4.405000000000000249, 3.200000000000000178, -0.6249999999999962252 ) ) ;
#789 = DIRECTION ( 'NONE',  ( -1.000000000000000000, -0.0000000000000000000, -0.0000000000000000000 ) ) ;
#790 = DIRECTION ( 'NONE',  ( 0.0000000000000000000, 0.0000000000000000000, 1.000000000000000000 ) ) ;
#791 = FACE_OUTER_BOUND ( 'NONE', #615, .T. ) ;
#792 = VECTOR ( 'NONE', #236, 1000.000000000000000 ) ;
#793 = DIRECTION ( 'NONE',  ( 0.0000000000000000000, -0.0000000000000000000, -1.000000000000000000 ) ) ;
#794 = ORIENTED_EDGE ( 'NONE', *, *, #103, .T. ) ;
#795 = LINE ( 'NONE', #101, #1055 ) ;
#796 = ORIENTED_EDGE ( 'NONE', *, *, #734, .T. ) ;
#797 = CALENDAR_DATE ( 2020, 25, 12 ) ;
#798 = CARTESIAN_POINT ( 'NONE',  ( 0.0000000000000000000, 0.2000000000000000944, 0.1000000000000011297 ) ) ;
#799 = CARTESIAN_POINT ( 'NONE',  ( 0.5499999999999989342, 0.2000000000000000944, 0.1000000000000011297 ) ) ;
#800 = EDGE_CURVE ( 'NONE', #1215, #177, #445, .T. ) ;
#801 = ORIENTED_EDGE ( 'NONE', *, *, #15, .T. ) ;
#802 = DIRECTION ( 'NONE',  ( 0.0000000000000000000, -0.0000000000000000000, 1.000000000000000000 ) ) ;
#803 = PLANE ( 'NONE',  #858 ) ;
#804 = VERTEX_POINT ( 'NONE', #597 ) ;
#805 =( REPRESENTATION_RELATIONSHIP ('NONE','NONE', #478, #205 ) REPRESENTATION_RELATIONSHIP_WITH_TRANSFORMATION ( #614 )SHAPE_REPRESENTATION_RELATIONSHIP( ) );
#806 = APPROVAL_STATUS ( 'not_yet_approved' ) ;
#807 = DIRECTION ( 'NONE',  ( 0.0000000000000000000, 0.0000000000000000000, -1.000000000000000000 ) ) ;
#808 = ORIENTED_EDGE ( 'NONE', *, *, #868, .T. ) ;
#809 = APPROVAL_PERSON_ORGANIZATION ( #1066, #1017, #1213 ) ;
#810 = LINE ( 'NONE', #328, #502 ) ;
#811 = EDGE_LOOP ( 'NONE', ( #359, #575, #968, #254 ) ) ;
#812 = DATE_TIME_ROLE ( 'classification_date' ) ;
#813 = ORIENTED_EDGE ( 'NONE', *, *, #932, .T. ) ;
#814 = AXIS2_PLACEMENT_3D ( 'NONE', #1031, #562, #1231 ) ;
#815 = APPROVAL_STATUS ( 'not_yet_approved' ) ;
#816 = EDGE_CURVE ( 'NONE', #804, #622, #913, .T. ) ;
#817 = CALENDAR_DATE ( 2020, 25, 12 ) ;
#818 = EDGE_LOOP ( 'NONE', ( #953, #12, #867, #808, #1024, #987, #664, #88 ) ) ;
#819 = CARTESIAN_POINT ( 'NONE',  ( 0.0000000000000000000, 5.299999999999999822, 0.0000000000000000000 ) ) ;
#820 = CC_DESIGN_SECURITY_CLASSIFICATION ( #508, ( #170 ) ) ;
#821 = APPLICATION_CONTEXT ( 'configuration controlled 3d designs of mechanical parts and assemblies' ) ;
#822 = FACE_OUTER_BOUND ( 'NONE', #450, .T. ) ;
#823 = VERTEX_POINT ( 'NONE', #684 ) ;
#824 = FACE_OUTER_BOUND ( 'NONE', #818, .T. ) ;
#825 = ORIENTED_EDGE ( 'NONE', *, *, #947, .T. ) ;
#826 = LINE ( 'NONE', #1250, #23 ) ;
#827 = LOCAL_TIME ( 20, 15, 49.00000000000000000, #1087 ) ;
#828 = APPROVAL_ROLE ( '' ) ;
#829 = ORIENTED_EDGE ( 'NONE', *, *, #618, .T. ) ;
#830 = ORIENTED_EDGE ( 'NONE', *, *, #1133, .T. ) ;
#831 = CARTESIAN_POINT ( 'NONE',  ( -0.9449999999999998401, 3.200000000000000178, -0.8749999999999998890 ) ) ;
#832 = PERSON_AND_ORGANIZATION ( #278, #1092 ) ;
#833 = ORIENTED_EDGE ( 'NONE', *, *, #1211, .T. ) ;
#834 = DIRECTION ( 'NONE',  ( -1.000000000000000000, 0.0000000000000000000, -0.0000000000000000000 ) ) ;
#835 = CARTESIAN_POINT ( 'NONE',  ( 1.110000000000000764, 3.000000000000000000, -1.110000000000000764 ) ) ;
#836 = CC_DESIGN_APPROVAL ( #773, ( #649 ) ) ;
#837 = CALENDAR_DATE ( 2020, 25, 12 ) ;
#838 = LINE ( 'NONE', #114, #593 ) ;
#839 = DIRECTION ( 'NONE',  ( 0.3481553119113947603, 0.8703882797784899816, 0.3481553119113947603 ) ) ;
#840 = LINE ( 'NONE', #1047, #406 ) ;
#841 = ORIENTED_EDGE ( 'NONE', *, *, #555, .F. ) ;
#842 = DIRECTION ( 'NONE',  ( 1.000000000000000000, 0.0000000000000000000, 0.0000000000000000000 ) ) ;
#843 = CARTESIAN_POINT ( 'NONE',  ( 0.09999999999999939493, 21.19999999999999929, 0.6500000000000000222 ) ) ;
#844 = AXIS2_PLACEMENT_3D ( 'NONE', #361, #1124, #553 ) ;
#845 = CC_DESIGN_APPROVAL ( #782, ( #656 ) ) ;
#846 = CARTESIAN_POINT ( 'NONE',  ( -1.109999999999999210, 3.000000000000000000, 1.109999999999999210 ) ) ;
#847 = DIRECTION ( 'NONE',  ( 0.0000000000000000000, 0.0000000000000000000, 1.000000000000000000 ) ) ;
#848 = LOCAL_TIME ( 20, 15, 49.00000000000000000, #1108 ) ;
#849 = PERSON ( 'NAUO-PER3', 'UNSPECIFIED', 'UNSPECIFIED', ('UNSPECIFIED'), ('UNSPECIFIED'), ('UNSPECIFIED') ) ;
#850 = CARTESIAN_POINT ( 'NONE',  ( 0.0000000000000000000, 3.000000000000000000, 0.0000000000000000000 ) ) ;
#851 = ORIENTED_EDGE ( 'NONE', *, *, #1104, .F. ) ;
#852 = ORIENTED_EDGE ( 'NONE', *, *, #429, .F. ) ;
#853 = DIRECTION ( 'NONE',  ( 0.0000000000000000000, 0.0000000000000000000, 1.000000000000000000 ) ) ;
#854 = CARTESIAN_POINT ( 'NONE',  ( 0.6500000000000001332, 20.94999999999999929, 0.6500000000000000222 ) ) ;
#855 = FACE_OUTER_BOUND ( 'NONE', #811, .T. ) ;
#856 = ORIENTED_EDGE ( 'NONE', *, *, #192, .T. ) ;
#857 = LINE ( 'NONE', #1103, #356 ) ;
#858 = AXIS2_PLACEMENT_3D ( 'NONE', #216, #1191, #621 ) ;
#859 = VERTEX_POINT ( 'NONE', #9 ) ;
#860 = LINE ( 'NONE', #843, #81 ) ;
#861 = CONTEXT_DEPENDENT_SHAPE_REPRESENTATION ( #915, #451 ) ;
#862 = DIRECTION ( 'NONE',  ( 1.000000000000000000, -0.0000000000000000000, 0.0000000000000000000 ) ) ;
#863 = ORIENTED_EDGE ( 'NONE', *, *, #85, .T. ) ;
#864 = CARTESIAN_POINT ( 'NONE',  ( 0.08787878787878747322, 21.16969696969697168, 0.08787878787878748710 ) ) ;
#865 = LOCAL_TIME ( 20, 15, 49.00000000000000000, #1126 ) ;
#866 = DIRECTION ( 'NONE',  ( 1.000000000000000000, 0.0000000000000000000, 0.0000000000000000000 ) ) ;
#867 = ORIENTED_EDGE ( 'NONE', *, *, #674, .F. ) ;
#868 = EDGE_CURVE ( 'NONE', #682, #504, #688, .T. ) ;
#869 = PLANE ( 'NONE',  #249 ) ;
#870 = DATE_AND_TIME ( #1128, #127 ) ;
#871 = VECTOR ( 'NONE', #749, 1000.000000000000000 ) ;
#872 = VECTOR ( 'NONE', #279, 1000.000000000000000 ) ;
#873 = EDGE_CURVE ( 'NONE', #724, #1054, #1176, .T. ) ;
#874 = ORIENTED_EDGE ( 'NONE', *, *, #1192, .F. ) ;
#875 = CARTESIAN_POINT ( 'NONE',  ( -0.7850000000000006972, 3.000000000000000000, -0.7850000000000006972 ) ) ;
#876 = CARTESIAN_POINT ( 'NONE',  ( 0.0000000000000000000, 5.299999999999998934, 0.0000000000000000000 ) ) ;
#877 = AXIS2_PLACEMENT_3D ( 'NONE', #472, #397, #834 ) ;
#878 = DIRECTION ( 'NONE',  ( 0.0000000000000000000, 0.0000000000000000000, 1.000000000000000000 ) ) ;
#879 = CONTEXT_DEPENDENT_SHAPE_REPRESENTATION ( #727, #43 ) ;
#880 = ORIENTED_EDGE ( 'NONE', *, *, #308, .T. ) ;
#881 = DIRECTION ( 'NONE',  ( 0.0000000000000000000, -0.0000000000000000000, 1.000000000000000000 ) ) ;
#882 = CARTESIAN_POINT ( 'NONE',  ( 0.0000000000000000000, 0.0000000000000000000, 0.0000000000000000000 ) ) ;
#883 = EDGE_CURVE ( 'NONE', #781, #557, #416, .T. ) ;
#884 = DIRECTION ( 'NONE',  ( 0.0000000000000000000, 1.000000000000000000, 0.0000000000000000000 ) ) ;
#885 = PRODUCT_RELATED_PRODUCT_CATEGORY ( 'detail', '', ( #1246 ) ) ;
#886 = DIRECTION ( 'NONE',  ( -1.807003620809174139E-16, 0.0000000000000000000, 1.000000000000000000 ) ) ;
#887 = VECTOR ( 'NONE', #405, 1000.000000000000114 ) ;
#888 = ADVANCED_FACE ( 'NONE', ( #1113 ), #869, .F. ) ;
#889 = VECTOR ( 'NONE', #807, 1000.000000000000000 ) ;
#890 = ORIENTED_EDGE ( 'NONE', *, *, #1077, .T. ) ;
#891 = VECTOR ( 'NONE', #376, 1000.000000000000000 ) ;
#892 = DATE_AND_TIME ( #1150, #147 ) ;
#893 = DIRECTION ( 'NONE',  ( 0.0000000000000000000, 1.000000000000000000, 0.0000000000000000000 ) ) ;
#894 = ORIENTED_EDGE ( 'NONE', *, *, #1154, .T. ) ;
#895 = ORIENTED_EDGE ( 'NONE', *, *, #422, .T. ) ;
#896 = CARTESIAN_POINT ( 'NONE',  ( 1.595000000000000195, 5.299999999999999822, 1.524999999999999911 ) ) ;
#897 = COORDINATED_UNIVERSAL_TIME_OFFSET ( 1, 0, .AHEAD. ) ;
#898 = DIRECTION ( 'NONE',  ( -1.000000000000000000, 0.0000000000000000000, 0.0000000000000000000 ) ) ;
#899 = CARTESIAN_POINT ( 'NONE',  ( 1.595000000000000195, 5.299999999999999822, 1.275000000000001465 ) ) ;
#900 = PERSON_AND_ORGANIZATION ( #388, #283 ) ;
#901 = VECTOR ( 'NONE', #259, 1000.000000000000000 ) ;
#902 = FACE_OUTER_BOUND ( 'NONE', #671, .T. ) ;
#903 = CC_DESIGN_DATE_AND_TIME_ASSIGNMENT ( #1032, #713, ( #649 ) ) ;
#904 = SECURITY_CLASSIFICATION_LEVEL ( 'unclassified' ) ;
#905 = APPROVAL_STATUS ( 'not_yet_approved' ) ;
#906 = APPLICATION_PROTOCOL_DEFINITION ( 'international standard', 'config_control_design', 1994, #343 ) ;
#907 = DATE_AND_TIME ( #1170, #166 ) ;
#908 = CC_DESIGN_PERSON_AND_ORGANIZATION_ASSIGNMENT ( #60, #439, ( #479 ) ) ;
#909 = CC_DESIGN_DATE_AND_TIME_ASSIGNMENT ( #324, #335, ( #656 ) ) ;
#910 = ORIENTED_EDGE ( 'NONE', *, *, #485, .T. ) ;
#911 = PERSON_AND_ORGANIZATION_ROLE ( 'creator' ) ;
#912 = CARTESIAN_POINT ( 'NONE',  ( 0.0000000000000000000, 5.299999999999998934, 0.0000000000000000000 ) ) ;
#913 = LINE ( 'NONE', #108, #662 ) ;
#914 = LINE ( 'NONE', #921, #691 ) ;
#915 =( REPRESENTATION_RELATIONSHIP ('NONE','NONE', #478, #205 ) REPRESENTATION_RELATIONSHIP_WITH_TRANSFORMATION ( #952 )SHAPE_REPRESENTATION_RELATIONSHIP( ) );
#916 = ORIENTED_EDGE ( 'NONE', *, *, #572, .T. ) ;
#917 = LINE ( 'NONE', #59, #665 ) ;
#918 = CALENDAR_DATE ( 2020, 25, 12 ) ;
#919 = ORIENTED_EDGE ( 'NONE', *, *, #1065, .T. ) ;
#920 = APPLICATION_CONTEXT ( 'configuration controlled 3d designs of mechanical parts and assemblies' ) ;
#921 = CARTESIAN_POINT ( 'NONE',  ( -0.9449999999999998401, 5.299999999999999822, -0.6250000000000014433 ) ) ;
#922 = ORIENTED_EDGE ( 'NONE', *, *, #555, .T. ) ;
#923 = ADVANCED_FACE ( 'NONE', ( #855 ), #564, .F. ) ;
#924 = VERTEX_POINT ( 'NONE', #657 ) ;
#925 = PRODUCT_DEFINITION_SHAPE ( 'NONE', 'NONE',  #1107 ) ;
#926 = ORIENTED_EDGE ( 'NONE', *, *, #74, .F. ) ;
#927 = UNCERTAINTY_MEASURE_WITH_UNIT (LENGTH_MEASURE( 1.000000000000000082E-05 ), #169, 'distance_accuracy_value', 'NONE');
#928 = PERSON_AND_ORGANIZATION_ROLE ( 'classification_officer' ) ;
#929 = CARTESIAN_POINT ( 'NONE',  ( 0.5621212121212124657, 21.16969696969697168, 0.08787878787878745934 ) ) ;
#930 = DATE_AND_TIME ( #1185, #183 ) ;
#931 = ADVANCED_FACE ( 'NONE', ( #110 ), #73, .T. ) ;
#932 = EDGE_CURVE ( 'NONE', #177, #682, #355, .T. ) ;
#933 = LOCAL_TIME ( 20, 15, 49.00000000000000000, #1189 ) ;
#934 = LINE ( 'NONE', #864, #190 ) ;
#935 = DIRECTION ( 'NONE',  ( -1.000000000000000000, 0.0000000000000000000, 0.0000000000000000000 ) ) ;
#936 = EDGE_CURVE ( 'NONE', #823, #735, #1145, .T. ) ;
#937 = ORIENTED_EDGE ( 'NONE', *, *, #56, .T. ) ;
#938 = CALENDAR_DATE ( 2020, 25, 12 ) ;
#939 =( GEOMETRIC_REPRESENTATION_CONTEXT ( 3 ) GLOBAL_UNCERTAINTY_ASSIGNED_CONTEXT ( ( #296 ) ) GLOBAL_UNIT_ASSIGNED_CONTEXT ( ( #603, #694, #1181 ) ) REPRESENTATION_CONTEXT ( 'NONE', 'WORKASPACE' ) );
#940 = CARTESIAN_POINT ( 'NONE',  ( 0.6500000000000001332, 20.94999999999999929, 0.6500000000000000222 ) ) ;
#941 = PLANE ( 'NONE',  #1073 ) ;
#942 = DIRECTION ( 'NONE',  ( 0.7071067811865475727, 0.0000000000000000000, -0.7071067811865475727 ) ) ;
#943 = AXIS2_PLACEMENT_3D ( 'NONE', #571, #658, #69 ) ;
#944 = PERSON_AND_ORGANIZATION ( #388, #283 ) ;
#945 = DIRECTION ( 'NONE',  ( 0.9284766908852601919, 0.3713906763541015565, -1.548702223630694496E-16 ) ) ;
#946 = VECTOR ( 'NONE', #506, 1000.000000000000000 ) ;
#947 = EDGE_CURVE ( 'NONE', #447, #208, #608, .T. ) ;
#948 = VECTOR ( 'NONE', #222, 1000.000000000000000 ) ;
#949 = EDGE_LOOP ( 'NONE', ( #851, #309, #1183, #536 ) ) ;
#950 = PERSON ( 'NAUO-PER5', 'UNSPECIFIED', 'UNSPECIFIED', ('UNSPECIFIED'), ('UNSPECIFIED'), ('UNSPECIFIED') ) ;
#951 = DIRECTION ( 'NONE',  ( 0.0000000000000000000, -1.000000000000000000, -0.0000000000000000000 ) ) ;
#952 = ITEM_DEFINED_TRANSFORMATION ( 'NONE', 'NONE', #273,  #1069 ) ;
#953 = ORIENTED_EDGE ( 'NONE', *, *, #85, .F. ) ;
#954 = PRODUCT_DEFINITION ( 'UNKNOWN', '', #17, #551 ) ;
#955 = EDGE_LOOP ( 'NONE', ( #424, #609, #640, #510 ) ) ;
#956 = DIRECTION ( 'NONE',  ( -0.0000000000000000000, 0.0000000000000000000, 1.000000000000000000 ) ) ;
#957 = PERSON_AND_ORGANIZATION ( #388, #283 ) ;
#958 = PLANE ( 'NONE',  #211 ) ;
#959 = DIRECTION ( 'NONE',  ( -0.0000000000000000000, 1.000000000000000000, -0.0000000000000000000 ) ) ;
#960 = DIRECTION ( 'NONE',  ( -0.0000000000000000000, 1.000000000000000000, -0.0000000000000000000 ) ) ;
#961 = CALENDAR_DATE ( 2020, 25, 12 ) ;
#962 = LINE ( 'NONE', #1137, #677 ) ;
#963 = LINE ( 'NONE', #162, #489 ) ;
#964 = CARTESIAN_POINT ( 'NONE',  ( 0.1000000000000011297, 0.2000000000000000944, 0.0000000000000000000 ) ) ;
#965 = LINE ( 'NONE', #675, #1193 ) ;
#966 = ORIENTED_EDGE ( 'NONE', *, *, #214, .F. ) ;
#967 = CC_DESIGN_PERSON_AND_ORGANIZATION_ASSIGNMENT ( #495, #1006, ( #649 ) ) ;
#968 = ORIENTED_EDGE ( 'NONE', *, *, #1220, .F. ) ;
#969 = CARTESIAN_POINT ( 'NONE',  ( 1.345000000000001750, 5.299999999999999822, -0.8749999999999998890 ) ) ;
#970 = ITEM_DEFINED_TRANSFORMATION ( 'NONE', 'NONE', #68,  #1069 ) ;
#971 = DIRECTION ( 'NONE',  ( -0.0000000000000000000, -1.000000000000000000, -0.0000000000000000000 ) ) ;
#972 = EDGE_LOOP ( 'NONE', ( #363, #423, #894, #301 ) ) ;
#973 = DIRECTION ( 'NONE',  ( -1.000000000000000000, 0.0000000000000000000, -0.0000000000000000000 ) ) ;
#974 = ORIENTED_EDGE ( 'NONE', *, *, #618, .F. ) ;
#975 = DIRECTION ( 'NONE',  ( -0.7071067811865474617, -0.0000000000000000000, 0.7071067811865474617 ) ) ;
#976 = SECURITY_CLASSIFICATION ( '', '', #46 ) ;
#977 = CARTESIAN_POINT ( 'NONE',  ( 3.876306770598546780, 2.256187637073627350, 11.06368319029513003 ) ) ;
#978 = LOCAL_TIME ( 20, 15, 49.00000000000000000, #1237 ) ;
#979 = CC_DESIGN_PERSON_AND_ORGANIZATION_ASSIGNMENT ( #1028, #244, ( #656 ) ) ;
#980 = VECTOR ( 'NONE', #1106, 1000.000000000000000 ) ;
#981 = CARTESIAN_POINT ( 'NONE',  ( -0.9449999999999998401, 5.299999999999999822, -0.6250000000000014433 ) ) ;
#982 = DIRECTION ( 'NONE',  ( 0.0000000000000000000, -1.000000000000000000, 0.0000000000000000000 ) ) ;
#983 = APPROVAL_DATE_TIME ( #1243, #1 ) ;
#984 = VERTEX_POINT ( 'NONE', #1064 ) ;
#985 = ADVANCED_FACE ( 'NONE', ( #822 ), #988, .T. ) ;
#986 = ORIENTED_EDGE ( 'NONE', *, *, #1014, .F. ) ;
#987 = ORIENTED_EDGE ( 'NONE', *, *, #554, .T. ) ;
#988 = PLANE ( 'NONE',  #94 ) ;
#989 = PRODUCT_DEFINITION_SHAPE ( 'NONE', 'NONE',  #1263 ) ;
#990 = AXIS2_PLACEMENT_3D ( 'NONE', #512, #418, #1080 ) ;
#991 = CARTESIAN_POINT ( 'NONE',  ( -0.9450000000000002842, 5.299999999999999822, 1.274999999999997913 ) ) ;
#992 = DIRECTION ( 'NONE',  ( -1.000000000000000000, 0.0000000000000000000, 0.0000000000000000000 ) ) ;
#993 = DATE_AND_TIME ( #1251, #251 ) ;
#994 = LINE ( 'NONE', #1030, #1019 ) ;
#995 = VECTOR ( 'NONE', #55, 1000.000000000000114 ) ;
#996 = VECTOR ( 'NONE', #1165, 1000.000000000000000 ) ;
#997 = ORIENTED_EDGE ( 'NONE', *, *, #873, .F. ) ;
#998 = PLANE ( 'NONE',  #1118 ) ;
#999 = DATE_TIME_ROLE ( 'classification_date' ) ;
#1000 = DIRECTION ( 'NONE',  ( 1.000000000000000000, -0.0000000000000000000, -0.0000000000000000000 ) ) ;
#1001 = ORIENTED_EDGE ( 'NONE', *, *, #34, .T. ) ;
#1002 = APPROVAL_DATE_TIME ( #83, #773 ) ;
#1003 = EDGE_CURVE ( 'NONE', #215, #1151, #44, .T. ) ;
#1004 = DATE_TIME_ROLE ( 'classification_date' ) ;
#1005 = AXIS2_PLACEMENT_3D ( 'NONE', #1161, #201, #102 ) ;
#1006 = PERSON_AND_ORGANIZATION_ROLE ( 'classification_officer' ) ;
#1007 = CALENDAR_DATE ( 2020, 25, 12 ) ;
#1008 = VECTOR ( 'NONE', #121, 1000.000000000000000 ) ;
#1009 = ORIENTED_EDGE ( 'NONE', *, *, #751, .F. ) ;
#1010 = DATE_AND_TIME ( #11, #272 ) ;
#1011 = MECHANICAL_CONTEXT ( 'NONE', #920, 'mechanical' ) ;
#1012 = VERTEX_POINT ( 'NONE', #779 ) ;
#1013 = ADVANCED_FACE ( 'NONE', ( #546 ), #1175, .F. ) ;
#1014 = EDGE_CURVE ( 'NONE', #436, #1012, #284, .T. ) ;
#1015 = APPROVAL_STATUS ( 'not_yet_approved' ) ;
#1016 = CARTESIAN_POINT ( 'NONE',  ( 0.0000000000000000000, 20.94999999999999929, 0.6500000000000000222 ) ) ;
#1017 = APPROVAL ( #540, 'UNSPECIFIED' ) ;
#1018 = PERSON_AND_ORGANIZATION ( #388, #283 ) ;
#1019 = VECTOR ( 'NONE', #368, 1000.000000000000114 ) ;
#1020 = ORIENTED_EDGE ( 'NONE', *, *, #237, .T. ) ;
#1021 = LINE ( 'NONE', #831, #285 ) ;
#1022 = APPROVAL_ROLE ( '' ) ;
#1023 = DIRECTION ( 'NONE',  ( 0.0000000000000000000, 0.0000000000000000000, 1.000000000000000000 ) ) ;
#1024 = ORIENTED_EDGE ( 'NONE', *, *, #342, .F. ) ;
#1025 = VECTOR ( 'NONE', #305, 1000.000000000000114 ) ;
#1026 = ADVANCED_FACE ( 'NONE', ( #1051 ), #494, .F. ) ;
#1027 = ORIENTED_EDGE ( 'NONE', *, *, #362, .F. ) ;
#1028 = PERSON_AND_ORGANIZATION ( #659, #24 ) ;
#1029 = ADVANCED_FACE ( 'NONE', ( #20 ), #678, .T. ) ;
#1030 = CARTESIAN_POINT ( 'NONE',  ( 0.4833333333333346138, 21.36666666666666714, 0.4833333333333345028 ) ) ;
#1031 = CARTESIAN_POINT ( 'NONE',  ( 0.5499999999999989342, 0.2000000000000000944, 0.0000000000000000000 ) ) ;
#1032 = DATE_AND_TIME ( #28, #297 ) ;
#1033 = SECURITY_CLASSIFICATION ( '', '', #435 ) ;
#1034 = PLANE ( 'NONE',  #1005 ) ;
#1035 = CARTESIAN_POINT ( 'NONE',  ( 0.6500000000000000222, 20.94999999999999929, 0.0000000000000000000 ) ) ;
#1036 = DATE_AND_TIME ( #33, #300 ) ;
#1037 = LINE ( 'NONE', #1089, #1008 ) ;
#1038 = ORIENTED_EDGE ( 'NONE', *, *, #542, .F. ) ;
#1039 = PLANE ( 'NONE',  #877 ) ;
#1040 = DIRECTION ( 'NONE',  ( 0.0000000000000000000, 0.0000000000000000000, 1.000000000000000000 ) ) ;
#1041 = CC_DESIGN_PERSON_AND_ORGANIZATION_ASSIGNMENT ( #19, #1109, ( #1246 ) ) ;
#1042 = ORIENTED_EDGE ( 'NONE', *, *, #1236, .F. ) ;
#1043 = CARTESIAN_POINT ( 'NONE',  ( 0.09999999999999939493, 21.19999999999999929, 0.5500000000000005995 ) ) ;
#1044 =( NAMED_UNIT ( * ) PLANE_ANGLE_UNIT ( ) SI_UNIT ( $, .RADIAN. ) );
#1045 = PERSON ( 'NAUO-PER6', 'UNSPECIFIED', 'UNSPECIFIED', ('UNSPECIFIED'), ('UNSPECIFIED'), ('UNSPECIFIED') ) ;
#1046 = PERSON_AND_ORGANIZATION ( #1144, #41 ) ;
#1047 = CARTESIAN_POINT ( 'NONE',  ( -0.9450000000000050582, 5.299999999999999822, -0.6249999999999962252 ) ) ;
#1048 = CARTESIAN_POINT ( 'NONE',  ( 0.0000000000000000000, 0.2000000000000000944, 0.0000000000000000000 ) ) ;
#1049 = CARTESIAN_POINT ( 'NONE',  ( 1.595000000000000195, 5.299999999999999822, -0.6250000000000014433 ) ) ;
#1050 = DIRECTION ( 'NONE',  ( -1.000000000000000000, 0.0000000000000000000, 1.668003342285391797E-16 ) ) ;
#1051 = FACE_OUTER_BOUND ( 'NONE', #112, .T. ) ;
#1052 = ORIENTED_EDGE ( 'NONE', *, *, #632, .T. ) ;
#1053 = FACE_OUTER_BOUND ( 'NONE', #105, .T. ) ;
#1054 = VERTEX_POINT ( 'NONE', #761 ) ;
#1055 = VECTOR ( 'NONE', #975, 1000.000000000000114 ) ;
#1056 = ORIENTED_EDGE ( 'NONE', *, *, #354, .T. ) ;
#1057 = DIRECTION ( 'NONE',  ( 1.000000000000000000, 0.0000000000000000000, 0.0000000000000000000 ) ) ;
#1058 = LOCAL_TIME ( 20, 15, 49.00000000000000000, #50 ) ;
#1059 = CARTESIAN_POINT ( 'NONE',  ( -1.203693229401453513, 2.256187637073627350, 11.06368319029512826 ) ) ;
#1060 = DIRECTION ( 'NONE',  ( 0.7071067811865474617, -0.0000000000000000000, -0.7071067811865474617 ) ) ;
#1061 = VERTEX_POINT ( 'NONE', #412 ) ;
#1062 = CARTESIAN_POINT ( 'NONE',  ( -0.9450000000000005063, 3.000000000000000000, 1.274999999999997913 ) ) ;
#1063 = CARTESIAN_POINT ( 'NONE',  ( 0.1000000000000011297, 0.2000000000000000944, 0.5499999999999988232 ) ) ;
#1064 = CARTESIAN_POINT ( 'NONE',  ( 1.345000000000001750, 3.000000000000000000, -0.8749999999999998890 ) ) ;
#1065 = EDGE_CURVE ( 'NONE', #735, #1085, #517, .T. ) ;
#1066 = PERSON_AND_ORGANIZATION ( #388, #283 ) ;
#1067 = FACE_OUTER_BOUND ( 'NONE', #116, .T. ) ;
#1068 = ORIENTED_EDGE ( 'NONE', *, *, #1198, .T. ) ;
#1069 = AXIS2_PLACEMENT_3D ( 'NONE', #882, #206, #786 ) ;
#1070 = DIRECTION ( 'NONE',  ( 0.0000000000000000000, -0.0000000000000000000, 1.000000000000000000 ) ) ;
#1071 = ORIENTED_EDGE ( 'NONE', *, *, #308, .F. ) ;
#1072 = CARTESIAN_POINT ( 'NONE',  ( 0.0000000000000000000, 3.200000000000000178, 0.6500000000000000222 ) ) ;
#1073 = AXIS2_PLACEMENT_3D ( 'NONE', #1239, #700, #793 ) ;
#1074 = CARTESIAN_POINT ( 'NONE',  ( -0.9450000000000048361, 3.000000000000000000, -0.6249999999999962252 ) ) ;
#1075 = LOCAL_TIME ( 20, 15, 49.00000000000000000, #70 ) ;
#1076 = ADVANCED_FACE ( 'NONE', ( #763 ), #753, .F. ) ;
#1077 = EDGE_CURVE ( 'NONE', #859, #548, #994, .T. ) ;
#1078 = ORIENTED_EDGE ( 'NONE', *, *, #237, .F. ) ;
#1079 = ORIENTED_EDGE ( 'NONE', *, *, #932, .F. ) ;
#1080 = DIRECTION ( 'NONE',  ( -1.000000000000000000, 0.0000000000000000000, 0.0000000000000000000 ) ) ;
#1081 = CC_DESIGN_APPROVAL ( #1017, ( #954 ) ) ;
#1082 = DIRECTION ( 'NONE',  ( 1.000000000000000000, -0.0000000000000000000, -0.0000000000000000000 ) ) ;
#1083 = VECTOR ( 'NONE', #790, 1000.000000000000000 ) ;
#1084 = LINE ( 'NONE', #899, #792 ) ;
#1085 = VERTEX_POINT ( 'NONE', #1072 ) ;
#1086 = FACE_OUTER_BOUND ( 'NONE', #697, .T. ) ;
#1087 = COORDINATED_UNIVERSAL_TIME_OFFSET ( 1, 0, .AHEAD. ) ;
#1088 = PRODUCT_DEFINITION_SHAPE ( 'NONE', 'NONE',  #1257 ) ;
#1089 = CARTESIAN_POINT ( 'NONE',  ( -0.9449999999999998401, 5.299999999999999822, -0.8749999999999998890 ) ) ;
#1090 = ORIENTED_EDGE ( 'NONE', *, *, #1065, .F. ) ;
#1091 = CARTESIAN_POINT ( 'NONE',  ( -0.9450000000000002842, 5.299999999999999822, 1.274999999999997913 ) ) ;
#1092 = ORGANIZATION ( 'NAUO-ORG1', 'UNSPECIFIED', 'UNSPECIFIED' ) ;
#1093 = ORIENTED_EDGE ( 'NONE', *, *, #1169, .F. ) ;
#1094 = AXIS2_PLACEMENT_3D ( 'NONE', #65, #193, #862 ) ;
#1095 = CARTESIAN_POINT ( 'NONE',  ( 1.595000000000000195, 5.299999999999999822, -0.8749999999999998890 ) ) ;
#1096 = MANIFOLD_SOLID_BREP ( 'Chamfer5', #507 ) ;
#1097 = CC_DESIGN_SECURITY_CLASSIFICATION ( #1033, ( #1259 ) ) ;
#1098 = LOCAL_TIME ( 20, 15, 49.00000000000000000, #96 ) ;
#1099 = SHAPE_DEFINITION_REPRESENTATION ( #925, #478 ) ;
#1100 = FACE_OUTER_BOUND ( 'NONE', #611, .T. ) ;
#1101 = ORIENTED_EDGE ( 'NONE', *, *, #56, .F. ) ;
#1102 = APPLICATION_CONTEXT ( 'configuration controlled 3d designs of mechanical parts and assemblies' ) ;
#1103 = CARTESIAN_POINT ( 'NONE',  ( 0.0000000000000000000, 3.200000000000000178, 0.0000000000000000000 ) ) ;
#1104 = EDGE_CURVE ( 'NONE', #394, #231, #1252, .T. ) ;
#1105 = APPROVAL_STATUS ( 'not_yet_approved' ) ;
#1106 = DIRECTION ( 'NONE',  ( -0.0000000000000000000, 1.000000000000000000, -0.0000000000000000000 ) ) ;
#1107 = PRODUCT_DEFINITION ( 'UNKNOWN', '', #170, #393 ) ;
#1108 = COORDINATED_UNIVERSAL_TIME_OFFSET ( 1, 0, .AHEAD. ) ;
#1109 = PERSON_AND_ORGANIZATION_ROLE ( 'design_owner' ) ;
#1110 = DIRECTION ( 'NONE',  ( 0.0000000000000000000, -0.0000000000000000000, -1.000000000000000000 ) ) ;
#1111 = APPLICATION_PROTOCOL_DEFINITION ( 'international standard', 'config_control_design', 1994, #821 ) ;
#1112 = CARTESIAN_POINT ( 'NONE',  ( 0.6500000000000001332, 0.4500000000000037859, 0.0000000000000000000 ) ) ;
#1113 = FACE_OUTER_BOUND ( 'NONE', #155, .T. ) ;
#1114 = VECTOR ( 'NONE', #538, 1000.000000000000000 ) ;
#1115 = EDGE_LOOP ( 'NONE', ( #748, #1214, #1009, #87 ) ) ;
#1116 = VECTOR ( 'NONE', #745, 1000.000000000000000 ) ;
#1117 = APPROVAL_PERSON_ORGANIZATION ( #115, #409, #629 ) ;
#1118 = AXIS2_PLACEMENT_3D ( 'NONE', #226, #884, #703 ) ;
#1119 = SECURITY_CLASSIFICATION_LEVEL ( 'unclassified' ) ;
#1120 = DIRECTION ( 'NONE',  ( 0.0000000000000000000, 1.000000000000000000, 0.0000000000000000000 ) ) ;
#1121 = EDGE_LOOP ( 'NONE', ( #474, #589, #794, #768 ) ) ;
#1122 = ORIENTED_EDGE ( 'NONE', *, *, #277, .F. ) ;
#1123 = ORIENTED_EDGE ( 'NONE', *, *, #266, .T. ) ;
#1124 = DIRECTION ( 'NONE',  ( 0.0000000000000000000, 0.0000000000000000000, 1.000000000000000000 ) ) ;
#1125 = SECURITY_CLASSIFICATION ( '', '', #1119 ) ;
#1126 = COORDINATED_UNIVERSAL_TIME_OFFSET ( 1, 0, .AHEAD. ) ;
#1127 = AXIS2_PLACEMENT_3D ( 'NONE', #515, #302, #973 ) ;
#1128 = CALENDAR_DATE ( 2020, 25, 12 ) ;
#1129 = LINE ( 'NONE', #740, #871 ) ;
#1130 = DIRECTION ( 'NONE',  ( 0.0000000000000000000, 0.3713906763541026113, -0.9284766908852597478 ) ) ;
#1131 = FACE_OUTER_BOUND ( 'NONE', #708, .T. ) ;
#1132 = ORIENTED_EDGE ( 'NONE', *, *, #221, .F. ) ;
#1133 = EDGE_CURVE ( 'NONE', #1156, #548, #730, .T. ) ;
#1134 = CARTESIAN_POINT ( 'NONE',  ( -3.743693229401453326, 2.256187637073627350, 11.06368319029512826 ) ) ;
#1135 = CARTESIAN_POINT ( 'NONE',  ( 1.595000000000000195, 5.299999999999999822, -0.6250000000000014433 ) ) ;
#1136 = AXIS2_PLACEMENT_3D ( 'NONE', #107, #685, #1173 ) ;
#1137 = CARTESIAN_POINT ( 'NONE',  ( 0.6500000000000001332, 0.4500000000000037859, 0.0000000000000000000 ) ) ;
#1138 = PLANE ( 'NONE',  #943 ) ;
#1139 = APPROVAL_PERSON_ORGANIZATION ( #136, #1167, #434 ) ;
#1140 = PLANE ( 'NONE',  #725 ) ;
#1141 = ORIENTED_EDGE ( 'NONE', *, *, #428, .F. ) ;
#1142 = CARTESIAN_POINT ( 'NONE',  ( 0.0000000000000000000, 3.200000000000000178, 0.0000000000000000000 ) ) ;
#1143 = EDGE_CURVE ( 'NONE', #557, #984, #224, .T. ) ;
#1144 = PERSON ( 'NAUO-PER4', 'UNSPECIFIED', 'UNSPECIFIED', ('UNSPECIFIED'), ('UNSPECIFIED'), ('UNSPECIFIED') ) ;
#1145 = LINE ( 'NONE', #771, #1083 ) ;
#1146 = LINE ( 'NONE', #912, #889 ) ;
#1147 = ORIENTED_EDGE ( 'NONE', *, *, #800, .F. ) ;
#1148 = LINE ( 'NONE', #1135, #891 ) ;
#1149 = CC_DESIGN_PERSON_AND_ORGANIZATION_ASSIGNMENT ( #531, #638, ( #954 ) ) ;
#1150 = CALENDAR_DATE ( 2020, 25, 12 ) ;
#1151 = VERTEX_POINT ( 'NONE', #93 ) ;
#1152 = PRODUCT_DEFINITION_SHAPE ( 'NONE', 'NONE',  #1261 ) ;
#1153 = DIRECTION ( 'NONE',  ( -0.7071067811865475727, -0.0000000000000000000, -0.7071067811865475727 ) ) ;
#1154 = EDGE_CURVE ( 'NONE', #1151, #392, #189, .T. ) ;
#1155 = ORIENTED_EDGE ( 'NONE', *, *, #868, .F. ) ;
#1156 = VERTEX_POINT ( 'NONE', #668 ) ;
#1157 = CARTESIAN_POINT ( 'NONE',  ( -0.6949999999999983968, 5.299999999999999822, 1.524999999999999911 ) ) ;
#1158 = CC_DESIGN_DATE_AND_TIME_ASSIGNMENT ( #1219, #135, ( #1125 ) ) ;
#1159 = DIRECTION ( 'NONE',  ( -1.000000000000000000, 0.0000000000000000000, 0.0000000000000000000 ) ) ;
#1160 = DIRECTION ( 'NONE',  ( 0.0000000000000000000, 0.0000000000000000000, 1.000000000000000000 ) ) ;
#1161 = CARTESIAN_POINT ( 'NONE',  ( 1.595000000000000195, 5.299999999999999822, 1.524999999999999911 ) ) ;
#1162 = PERSON_AND_ORGANIZATION ( #388, #283 ) ;
#1163 = LINE ( 'NONE', #1142, #403 ) ;
#1164 = VECTOR ( 'NONE', #673, 1000.000000000000000 ) ;
#1165 = DIRECTION ( 'NONE',  ( 1.000000000000000000, -0.0000000000000000000, -0.0000000000000000000 ) ) ;
#1166 = CARTESIAN_POINT ( 'NONE',  ( 0.1000000000000011297, 0.2000000000000000944, 0.0000000000000000000 ) ) ;
#1167 = APPROVAL ( #1194, 'UNKNOWN' ) ;
#1168 = CARTESIAN_POINT ( 'NONE',  ( 0.0000000000000000000, 20.94999999999999929, 0.0000000000000000000 ) ) ;
#1169 = EDGE_CURVE ( 'NONE', #228, #149, #962, .T. ) ;
#1170 = CALENDAR_DATE ( 2020, 25, 12 ) ;
#1171 = PLANE ( 'NONE',  #1206 ) ;
#1172 = APPROVAL ( #235, 'UNSPECIFIED' ) ;
#1173 = DIRECTION ( 'NONE',  ( 1.000000000000000000, 0.0000000000000000000, 0.0000000000000000000 ) ) ;
#1174 = PLANE ( 'NONE',  #117 ) ;
#1175 = PLANE ( 'NONE',  #230 ) ;
#1176 = LINE ( 'NONE', #1256, #887 ) ;
#1177 = ORIENTED_EDGE ( 'NONE', *, *, #816, .F. ) ;
#1178 = FACE_OUTER_BOUND ( 'NONE', #568, .T. ) ;
#1179 = ORIENTED_EDGE ( 'NONE', *, *, #1003, .F. ) ;
#1180 = LOCAL_TIME ( 20, 15, 49.00000000000000000, #176 ) ;
#1181 =( NAMED_UNIT ( * ) SI_UNIT ( $, .STERADIAN. ) SOLID_ANGLE_UNIT ( ) );
#1182 = ADVANCED_FACE ( 'NONE', ( #791 ), #482, .F. ) ;
#1183 = ORIENTED_EDGE ( 'NONE', *, *, #134, .T. ) ;
#1184 = DIRECTION ( 'NONE',  ( 1.000000000000000000, 0.0000000000000000000, -0.0000000000000000000 ) ) ;
#1185 = CALENDAR_DATE ( 2020, 25, 12 ) ;
#1186 = PLANE ( 'NONE',  #1127 ) ;
#1187 = DIRECTION ( 'NONE',  ( 0.0000000000000000000, -1.000000000000000000, 0.0000000000000000000 ) ) ;
#1188 = CC_DESIGN_PERSON_AND_ORGANIZATION_ASSIGNMENT ( #687, #544, ( #1125 ) ) ;
#1189 = COORDINATED_UNIVERSAL_TIME_OFFSET ( 1, 0, .AHEAD. ) ;
#1190 = VECTOR ( 'NONE', #1244, 1000.000000000000000 ) ;
#1191 = DIRECTION ( 'NONE',  ( 0.0000000000000000000, 0.0000000000000000000, 1.000000000000000000 ) ) ;
#1192 = EDGE_CURVE ( 'NONE', #392, #724, #457, .T. ) ;
#1193 = VECTOR ( 'NONE', #1160, 1000.000000000000000 ) ;
#1194 = APPROVAL_STATUS ( 'not_yet_approved' ) ;
#1195 = DIRECTION ( 'NONE',  ( 0.0000000000000000000, 0.0000000000000000000, 1.000000000000000000 ) ) ;
#1196 = APPROVAL_STATUS ( 'not_yet_approved' ) ;
#1197 = CC_DESIGN_SECURITY_CLASSIFICATION ( #567, ( #1261 ) ) ;
#1198 = EDGE_CURVE ( 'NONE', #548, #394, #158, .T. ) ;
#1199 = LOCAL_TIME ( 20, 15, 49.00000000000000000, #197 ) ;
#1200 = PERSON_AND_ORGANIZATION_ROLE ( 'classification_officer' ) ;
#1201 = AXIS2_PLACEMENT_3D ( 'NONE', #977, #878, #493 ) ;
#1202 = APPROVAL_ROLE ( '' ) ;
#1203 = PERSON_AND_ORGANIZATION ( #388, #283 ) ;
#1204 = LINE ( 'NONE', #13, #946 ) ;
#1205 = LINE ( 'NONE', #876, #417 ) ;
#1206 = AXIS2_PLACEMENT_3D ( 'NONE', #500, #1070, #410 ) ;
#1207 = DATE_TIME_ROLE ( 'classification_date' ) ;
#1208 = CARTESIAN_POINT ( 'NONE',  ( -4.405000000000000249, 3.200000000000000178, 1.274999999999997913 ) ) ;
#1209 = EDGE_LOOP ( 'NONE', ( #180, #1093, #1132, #526 ) ) ;
#1210 = CONTEXT_DEPENDENT_SHAPE_REPRESENTATION ( #332, #1152 ) ;
#1211 = EDGE_CURVE ( 'NONE', #351, #447, #1163, .T. ) ;
#1212 = ORIENTED_EDGE ( 'NONE', *, *, #404, .T. ) ;
#1213 = APPROVAL_ROLE ( '' ) ;
#1214 = ORIENTED_EDGE ( 'NONE', *, *, #334, .T. ) ;
#1215 = VERTEX_POINT ( 'NONE', #1062 ) ;
#1216 = CC_DESIGN_DATE_AND_TIME_ASSIGNMENT ( #746, #42, ( #954 ) ) ;
#1217 = APPROVAL_ROLE ( '' ) ;
#1218 = CARTESIAN_POINT ( 'NONE',  ( 0.6500000000000000222, 21.19999999999999929, 0.0000000000000000000 ) ) ;
#1219 = DATE_AND_TIME ( #219, #481 ) ;
#1220 = EDGE_CURVE ( 'NONE', #689, #149, #1129, .T. ) ;
#1221 = ADVANCED_FACE ( 'NONE', ( #128 ), #1039, .F. ) ;
#1222 = APPROVAL_STATUS ( 'not_yet_approved' ) ;
#1223 = LOCAL_TIME ( 20, 15, 49.00000000000000000, #223 ) ;
#1224 = VECTOR ( 'NONE', #287, 1000.000000000000000 ) ;
#1225 = FACE_OUTER_BOUND ( 'NONE', #1209, .T. ) ;
#1226 = VECTOR ( 'NONE', #401, 1000.000000000000000 ) ;
#1227 = ADVANCED_FACE ( 'NONE', ( #625 ), #1034, .T. ) ;
#1228 = CARTESIAN_POINT ( 'NONE',  ( 0.09999999999999939493, 21.19999999999999929, 0.0000000000000000000 ) ) ;
#1229 = AXIS2_PLACEMENT_3D ( 'NONE', #484, #263, #577 ) ;
#1230 = DIRECTION ( 'NONE',  ( 1.000000000000000000, 0.0000000000000000000, 0.0000000000000000000 ) ) ;
#1231 = DIRECTION ( 'NONE',  ( 0.0000000000000000000, -0.0000000000000000000, 1.000000000000000000 ) ) ;
#1232 = CC_DESIGN_APPROVAL ( #1167, ( #1033 ) ) ;
#1233 = CONTEXT_DEPENDENT_SHAPE_REPRESENTATION ( #644, #758 ) ;
#1234 = DIRECTION ( 'NONE',  ( 0.9284766908852597478, 0.3713906763541026113, 0.0000000000000000000 ) ) ;
#1235 = DIRECTION ( 'NONE',  ( 1.000000000000000000, 0.0000000000000000000, 0.0000000000000000000 ) ) ;
#1236 = EDGE_CURVE ( 'NONE', #804, #22, #97, .T. ) ;
#1237 = COORDINATED_UNIVERSAL_TIME_OFFSET ( 1, 0, .AHEAD. ) ;
#1238 = DIRECTION ( 'NONE',  ( 1.000000000000000000, -0.0000000000000000000, -0.0000000000000000000 ) ) ;
#1239 = CARTESIAN_POINT ( 'NONE',  ( 0.0000000000000000000, 3.000000000000000000, 0.0000000000000000000 ) ) ;
#1240 = CC_DESIGN_APPROVAL ( #1172, ( #1107 ) ) ;
#1241 = LINE ( 'NONE', #337, #980 ) ;
#1242 = CARTESIAN_POINT ( 'NONE',  ( -4.405000000000000249, 3.000000000000000000, -0.6249999999999962252 ) ) ;
#1243 = DATE_AND_TIME ( #243, #505 ) ;
#1244 = DIRECTION ( 'NONE',  ( -0.0000000000000000000, -0.0000000000000000000, 1.000000000000000000 ) ) ;
#1245 = EDGE_LOOP ( 'NONE', ( #476, #1071, #739, #1042 ) ) ;
#1246 = PRODUCT ( 'PinHeader 7x21mm', 'PinHeader 7x21mm', '', ( #630 ) ) ;
#1247 = PLANE ( 'NONE',  #352 ) ;
#1248 = AXIS2_PLACEMENT_3D ( 'NONE', #212, #1184, #310 ) ;
#1249 = DIRECTION ( 'NONE',  ( 1.000000000000000000, 0.0000000000000000000, 0.0000000000000000000 ) ) ;
#1250 = CARTESIAN_POINT ( 'NONE',  ( 0.6500000000000000222, 5.299999999999998934, 0.0000000000000000000 ) ) ;
#1251 = CALENDAR_DATE ( 2020, 25, 12 ) ;
#1252 = LINE ( 'NONE', #461, #488 ) ;
#1253 = VECTOR ( 'NONE', #728, 1000.000000000000000 ) ;
#1254 = DIRECTION ( 'NONE',  ( 0.0000000000000000000, 0.0000000000000000000, 1.000000000000000000 ) ) ;
#1255 = LINE ( 'NONE', #591, #490 ) ;
#1256 = CARTESIAN_POINT ( 'NONE',  ( 1.435000000000000719, 3.000000000000000000, 1.435000000000000719 ) ) ;
#1257 = NEXT_ASSEMBLY_USAGE_OCCURRENCE ( 'NAUO1', ' ', ' ', #1107, #954, $ ) ;
#1258 = NEXT_ASSEMBLY_USAGE_OCCURRENCE ( 'NAUO2', ' ', ' ', #1107, #954, $ ) ;
#1259 = NEXT_ASSEMBLY_USAGE_OCCURRENCE ( 'NAUO3', ' ', ' ', #1107, #954, $ ) ;
#1260 = NEXT_ASSEMBLY_USAGE_OCCURRENCE ( 'NAUO4', ' ', ' ', #1107, #954, $ ) ;
#1261 = NEXT_ASSEMBLY_USAGE_OCCURRENCE ( 'NAUO5', ' ', ' ', #1107, #954, $ ) ;
#1262 = NEXT_ASSEMBLY_USAGE_OCCURRENCE ( 'NAUO6', ' ', ' ', #1107, #954, $ ) ;
#1263 = NEXT_ASSEMBLY_USAGE_OCCURRENCE ( 'NAUO7', ' ', ' ', #1107, #954, $ ) ;
ENDSEC;
END-ISO-10303-21;
