(module footprints:SIM5300EA (layer F.Cu) (tedit 5AAA2B20)
  (fp_text reference U2 (at -11.2 13.6) (layer F.SilkS) hide
    (effects (font (size 1 1) (thickness 0.15)))
  )
  (fp_text value SIM5300EA (at -8.8 -14.4) (layer F.Fab)
    (effects (font (size 1 1) (thickness 0.15)))
  )
  (fp_line (start -12 -9) (end -12 -12) (layer F.SilkS) (width 0.15))
  (fp_line (start -12 -12) (end -9 -12) (layer F.SilkS) (width 0.15))
  (fp_line (start -12 9) (end -12 12) (layer F.SilkS) (width 0.15))
  (fp_line (start -12 12) (end -9 12) (layer F.SilkS) (width 0.15))
  (fp_line (start 9 -12) (end 12 -12) (layer F.SilkS) (width 0.15))
  (fp_line (start 12 -12) (end 12 -9) (layer F.SilkS) (width 0.15))
  (fp_line (start 9 12) (end 12 12) (layer F.SilkS) (width 0.15))
  (fp_line (start 12 12) (end 12 9) (layer F.SilkS) (width 0.15))
  (fp_line (start -9 -12.5) (end -12.5 -12.5) (layer F.CrtYd) (width 0.15))
  (fp_line (start -12.5 -12.5) (end -12.5 -9) (layer F.CrtYd) (width 0.15))
  (fp_line (start -12.5 -9) (end -13.5 -9) (layer F.CrtYd) (width 0.15))
  (fp_line (start -13.5 -9) (end -13.5 9) (layer F.CrtYd) (width 0.15))
  (fp_line (start -13.5 9) (end -12.5 9) (layer F.CrtYd) (width 0.15))
  (fp_line (start -12.5 9) (end -12.5 12.5) (layer F.CrtYd) (width 0.15))
  (fp_line (start -12.5 12.5) (end -9 12.5) (layer F.CrtYd) (width 0.15))
  (fp_line (start -9 12.5) (end -9 13.5) (layer F.CrtYd) (width 0.15))
  (fp_line (start -9 13.5) (end 9 13.5) (layer F.CrtYd) (width 0.15))
  (fp_line (start 9 13.5) (end 9 12.5) (layer F.CrtYd) (width 0.15))
  (fp_line (start 9 12.5) (end 12.5 12.5) (layer F.CrtYd) (width 0.15))
  (fp_line (start 12.5 12.5) (end 12.5 9) (layer F.CrtYd) (width 0.15))
  (fp_line (start 12.5 9) (end 13.5 9) (layer F.CrtYd) (width 0.15))
  (fp_line (start 13.5 9) (end 13.5 -9) (layer F.CrtYd) (width 0.15))
  (fp_line (start 13.5 -9) (end 12.5 -9) (layer F.CrtYd) (width 0.15))
  (fp_line (start 12.5 -9) (end 12.5 -12.5) (layer F.CrtYd) (width 0.15))
  (fp_line (start 12.5 -12.5) (end 9 -12.5) (layer F.CrtYd) (width 0.15))
  (fp_line (start 9 -12.5) (end 9 -13.5) (layer F.CrtYd) (width 0.15))
  (fp_line (start 9 -13.5) (end -9 -13.5) (layer F.CrtYd) (width 0.15))
  (fp_line (start -9 -13.5) (end -9 -12.5) (layer F.CrtYd) (width 0.15))
  (fp_line (start -10.7 -8.6) (end -9.5 -8.6) (layer F.CrtYd) (width 0.15))
  (fp_line (start -9.5 -8.6) (end -9.5 -7.4) (layer F.CrtYd) (width 0.15))
  (fp_line (start -9.5 -7.4) (end -10.7 -7.4) (layer F.CrtYd) (width 0.15))
  (fp_line (start -10.7 -7.4) (end -10.7 -8.6) (layer F.CrtYd) (width 0.15))
  (fp_line (start -12 -10) (end -13 -10) (layer F.SilkS) (width 0.15))
  (fp_line (start -13 -10) (end -13 -9) (layer F.SilkS) (width 0.15))
  (fp_line (start -13 -9) (end -12 -9) (layer F.SilkS) (width 0.15))
  (fp_line (start 7.7 -3) (end 7.7 3.3) (layer F.CrtYd) (width 0.15))
  (fp_line (start 7.7 3.3) (end 1.3 3.3) (layer F.CrtYd) (width 0.15))
  (fp_line (start 1.3 3.3) (end 1.3 -3) (layer F.CrtYd) (width 0.15))
  (fp_line (start 1.3 -3) (end 7.7 -3) (layer F.CrtYd) (width 0.15))
  (pad 68 smd oval (at -8 -12 270) (size 2 0.6) (layers F.Cu F.Paste F.Mask))
  (pad 67 smd oval (at -7 -12 270) (size 2 0.6) (layers F.Cu F.Paste F.Mask))
  (pad 66 smd oval (at -6 -12 270) (size 2 0.6) (layers F.Cu F.Paste F.Mask))
  (pad 65 smd oval (at -5 -12 270) (size 2 0.6) (layers F.Cu F.Paste F.Mask))
  (pad 64 smd oval (at -4 -12 270) (size 2 0.6) (layers F.Cu F.Paste F.Mask))
  (pad 63 smd oval (at -3 -12 270) (size 2 0.6) (layers F.Cu F.Paste F.Mask))
  (pad 62 smd oval (at -2 -12 270) (size 2 0.6) (layers F.Cu F.Paste F.Mask))
  (pad 61 smd oval (at -1 -12 270) (size 2 0.6) (layers F.Cu F.Paste F.Mask))
  (pad 60 smd oval (at 0 -12 270) (size 2 0.6) (layers F.Cu F.Paste F.Mask))
  (pad 59 smd oval (at 1 -12 270) (size 2 0.6) (layers F.Cu F.Paste F.Mask))
  (pad 58 smd oval (at 2 -12 270) (size 2 0.6) (layers F.Cu F.Paste F.Mask))
  (pad 57 smd oval (at 3 -12 270) (size 2 0.6) (layers F.Cu F.Paste F.Mask))
  (pad 56 smd oval (at 4 -12 270) (size 2 0.6) (layers F.Cu F.Paste F.Mask))
  (pad 55 smd oval (at 5 -12 270) (size 2 0.6) (layers F.Cu F.Paste F.Mask))
  (pad 54 smd oval (at 6 -12 270) (size 2 0.6) (layers F.Cu F.Paste F.Mask))
  (pad 53 smd oval (at 7 -12 270) (size 2 0.6) (layers F.Cu F.Paste F.Mask))
  (pad 52 smd oval (at 8 -12 270) (size 2 0.6) (layers F.Cu F.Paste F.Mask))
  (pad 51 smd oval (at 12 -8 180) (size 2 0.6) (layers F.Cu F.Paste F.Mask))
  (pad 50 smd oval (at 12 -7 180) (size 2 0.6) (layers F.Cu F.Paste F.Mask))
  (pad 49 smd oval (at 12 -6 180) (size 2 0.6) (layers F.Cu F.Paste F.Mask))
  (pad 48 smd oval (at 12 -5 180) (size 2 0.6) (layers F.Cu F.Paste F.Mask))
  (pad 47 smd oval (at 12 -4 180) (size 2 0.6) (layers F.Cu F.Paste F.Mask))
  (pad 46 smd oval (at 12 -3 180) (size 2 0.6) (layers F.Cu F.Paste F.Mask))
  (pad 45 smd oval (at 12 -2 180) (size 2 0.6) (layers F.Cu F.Paste F.Mask))
  (pad 44 smd oval (at 12 -1 180) (size 2 0.6) (layers F.Cu F.Paste F.Mask))
  (pad 43 smd oval (at 12 0 180) (size 2 0.6) (layers F.Cu F.Paste F.Mask))
  (pad 42 smd oval (at 12 1 180) (size 2 0.6) (layers F.Cu F.Paste F.Mask))
  (pad 41 smd oval (at 12 2 180) (size 2 0.6) (layers F.Cu F.Paste F.Mask))
  (pad 40 smd oval (at 12 3 180) (size 2 0.6) (layers F.Cu F.Paste F.Mask))
  (pad 39 smd oval (at 12 4 180) (size 2 0.6) (layers F.Cu F.Paste F.Mask))
  (pad 38 smd oval (at 12 5 180) (size 2 0.6) (layers F.Cu F.Paste F.Mask))
  (pad 37 smd oval (at 12 6 180) (size 2 0.6) (layers F.Cu F.Paste F.Mask))
  (pad 36 smd oval (at 12 7 180) (size 2 0.6) (layers F.Cu F.Paste F.Mask))
  (pad 35 smd oval (at 12 8 180) (size 2 0.6) (layers F.Cu F.Paste F.Mask))
  (pad 34 smd oval (at 8 12 90) (size 2 0.6) (layers F.Cu F.Paste F.Mask))
  (pad 33 smd oval (at 7 12 90) (size 2 0.6) (layers F.Cu F.Paste F.Mask))
  (pad 32 smd oval (at 6 12 90) (size 2 0.6) (layers F.Cu F.Paste F.Mask))
  (pad 31 smd oval (at 5 12 90) (size 2 0.6) (layers F.Cu F.Paste F.Mask))
  (pad 30 smd oval (at 4 12 90) (size 2 0.6) (layers F.Cu F.Paste F.Mask))
  (pad 29 smd oval (at 3 12 90) (size 2 0.6) (layers F.Cu F.Paste F.Mask))
  (pad 28 smd oval (at 2 12 90) (size 2 0.6) (layers F.Cu F.Paste F.Mask))
  (pad 27 smd oval (at 1 12 90) (size 2 0.6) (layers F.Cu F.Paste F.Mask))
  (pad 26 smd oval (at 0 12 90) (size 2 0.6) (layers F.Cu F.Paste F.Mask))
  (pad 25 smd oval (at -1 12 90) (size 2 0.6) (layers F.Cu F.Paste F.Mask))
  (pad 24 smd oval (at -2 12 90) (size 2 0.6) (layers F.Cu F.Paste F.Mask))
  (pad 23 smd oval (at -3 12 90) (size 2 0.6) (layers F.Cu F.Paste F.Mask))
  (pad 22 smd oval (at -4 12 90) (size 2 0.6) (layers F.Cu F.Paste F.Mask))
  (pad 21 smd oval (at -5 12 90) (size 2 0.6) (layers F.Cu F.Paste F.Mask))
  (pad 20 smd oval (at -6 12 90) (size 2 0.6) (layers F.Cu F.Paste F.Mask))
  (pad 19 smd oval (at -7 12 90) (size 2 0.6) (layers F.Cu F.Paste F.Mask))
  (pad 18 smd oval (at -8 12 90) (size 2 0.6) (layers F.Cu F.Paste F.Mask))
  (pad 17 smd oval (at -12 8) (size 2 0.6) (layers F.Cu F.Paste F.Mask))
  (pad 16 smd oval (at -12 7) (size 2 0.6) (layers F.Cu F.Paste F.Mask))
  (pad 15 smd oval (at -12 6) (size 2 0.6) (layers F.Cu F.Paste F.Mask))
  (pad 14 smd oval (at -12 5) (size 2 0.6) (layers F.Cu F.Paste F.Mask))
  (pad 13 smd oval (at -12 4) (size 2 0.6) (layers F.Cu F.Paste F.Mask))
  (pad 12 smd oval (at -12 3) (size 2 0.6) (layers F.Cu F.Paste F.Mask))
  (pad 11 smd oval (at -12 2) (size 2 0.6) (layers F.Cu F.Paste F.Mask))
  (pad 10 smd oval (at -12 1) (size 2 0.6) (layers F.Cu F.Paste F.Mask))
  (pad 9 smd oval (at -12 0) (size 2 0.6) (layers F.Cu F.Paste F.Mask))
  (pad 8 smd oval (at -12 -1) (size 2 0.6) (layers F.Cu F.Paste F.Mask))
  (pad 7 smd oval (at -12 -2) (size 2 0.6) (layers F.Cu F.Paste F.Mask))
  (pad 6 smd oval (at -12 -3) (size 2 0.6) (layers F.Cu F.Paste F.Mask))
  (pad 5 smd oval (at -12 -4) (size 2 0.6) (layers F.Cu F.Paste F.Mask))
  (pad 4 smd oval (at -12 -5) (size 2 0.6) (layers F.Cu F.Paste F.Mask))
  (pad 3 smd oval (at -12 -6) (size 2 0.6) (layers F.Cu F.Paste F.Mask))
  (pad 2 smd oval (at -12 -7) (size 2 0.6) (layers F.Cu F.Paste F.Mask))
  (pad 1 smd oval (at -12 -8) (size 2 0.6) (layers F.Cu F.Paste F.Mask))
)
