(module Varistor:RV_Disc_D7mm_W3.6mm_P5mm (layer F.Cu) (tedit 5CF453B2)
  (descr "Varistor, diameter 7mm, width 3.6mm, pitch 5mm")
  (tags "varistor SIOV")
  (fp_text reference RV1 (at 2.5 3.53333) (layer F.SilkS) hide
    (effects (font (size 1 1) (thickness 0.15)))
  )
  (fp_text value 07D391K (at 2.5 -2.06667) (layer F.Fab) hide
    (effects (font (size 1 1) (thickness 0.15)))
  )
  (fp_text user %R (at 2.5 0.733) (layer F.Fab)
    (effects (font (size 1 1) (thickness 0.15)))
  )
  (fp_line (start -1.25 2.78) (end 6.25 2.78) (layer F.CrtYd) (width 0.05))
  (fp_line (start -1.25 -1.32) (end 6.25 -1.32) (layer F.CrtYd) (width 0.05))
  (fp_line (start 6.25 -1.32) (end 6.25 2.78) (layer F.CrtYd) (width 0.05))
  (fp_line (start -1.25 -1.32) (end -1.25 2.78) (layer F.CrtYd) (width 0.05))
  (fp_line (start -1 2.53333) (end 6 2.53333) (layer F.SilkS) (width 0.15))
  (fp_line (start -1 -1.06667) (end 6 -1.06667) (layer F.SilkS) (width 0.15))
  (fp_line (start 6 -1.06667) (end 6 2.53333) (layer F.SilkS) (width 0.15))
  (fp_line (start -1 -1.06667) (end -1 2.53333) (layer F.SilkS) (width 0.15))
  (fp_line (start -1 2.53333) (end 6 2.53333) (layer F.Fab) (width 0.1))
  (fp_line (start -1 -1.06667) (end 6 -1.06667) (layer F.Fab) (width 0.1))
  (fp_line (start 6 -1.06667) (end 6 2.53333) (layer F.Fab) (width 0.1))
  (fp_line (start -1 -1.06667) (end -1 2.53333) (layer F.Fab) (width 0.1))
  (pad 2 thru_hole circle (at 5 1.46667) (size 1.6 1.6) (drill 0.6) (layers *.Cu *.Mask))
  (pad 1 thru_hole circle (at 0 0) (size 1.6 1.6) (drill 0.6) (layers *.Cu *.Mask))
  (model ${KISYS3DMOD}/Varistor.3dshapes/RV_Disc_D7mm_W3.6mm_P5mm.wrl
    (at (xyz 0 0 0))
    (scale (xyz 1 1 1))
    (rotate (xyz 0 0 0))
  )
  (model ${KISYS3DMOD}/Capacitor_THT.3dshapes/C_Disc_D7.0mm_W2.5mm_P5.00mm.step
    (at (xyz 0 0 0))
    (scale (xyz 1 1 1))
    (rotate (xyz 0 0 15))
  )
)
