Main.c:139:6:USB_HandleEP1_TX	32	static
Main.c:160:6:USB_HandleEP2_RX	24	static
Main.c:45:6:SysTick_ISR	24	static
Main.c:99:6:Suspend	0	static
Main.c:108:6:DMA_CH1_ISR	36	static
Main.c:177:14:USB_SetConfiguration	16	static
Main.c:196:6:Setup	16	static
Main.c:263:6:Sleep	0	static
Main.c:268:6:Loop	36	static
