(module Housings_QFP:LQFP-32_7x7mm_Pitch0.8mm (layer F.Cu) (tedit 5CF4563D)
  (descr "LQFP32: plastic low profile quad flat package; 32 leads; body 7 x 7 x 1.4 mm (see NXP sot358-1_po.pdf and sot358-1_fr.pdf)")
  (tags "QFP 0.8")
  (attr smd)
  (fp_text reference U13 (at 0 -5.85) (layer F.SilkS) hide
    (effects (font (size 1 1) (thickness 0.15)))
  )
  (fp_text value STM32F042 (at 0 5.85) (layer F.Fab) hide
    (effects (font (size 1 1) (thickness 0.15)))
  )
  (fp_line (start -3.625 -3.4) (end -4.85 -3.4) (layer F.SilkS) (width 0.15))
  (fp_line (start 3.625 -3.625) (end 3.325 -3.625) (layer F.SilkS) (width 0.15))
  (fp_line (start 3.625 3.625) (end 3.325 3.625) (layer F.SilkS) (width 0.15))
  (fp_line (start -3.625 3.625) (end -3.325 3.625) (layer F.SilkS) (width 0.15))
  (fp_line (start -3.625 -3.625) (end -3.325 -3.625) (layer F.SilkS) (width 0.15))
  (fp_line (start -3.625 3.625) (end -3.625 3.325) (layer F.SilkS) (width 0.15))
  (fp_line (start 3.625 3.625) (end 3.625 3.325) (layer F.SilkS) (width 0.15))
  (fp_line (start 3.625 -3.625) (end 3.625 -3.325) (layer F.SilkS) (width 0.15))
  (fp_line (start -3.625 -3.625) (end -3.625 -3.4) (layer F.SilkS) (width 0.15))
  (fp_line (start -5.1 5.1) (end 5.1 5.1) (layer F.CrtYd) (width 0.05))
  (fp_line (start -5.1 -5.1) (end 5.1 -5.1) (layer F.CrtYd) (width 0.05))
  (fp_line (start 5.1 -5.1) (end 5.1 5.1) (layer F.CrtYd) (width 0.05))
  (fp_line (start -5.1 -5.1) (end -5.1 5.1) (layer F.CrtYd) (width 0.05))
  (fp_line (start -3.5 -2.5) (end -2.5 -3.5) (layer F.Fab) (width 0.15))
  (fp_line (start -3.5 3.5) (end -3.5 -2.5) (layer F.Fab) (width 0.15))
  (fp_line (start 3.5 3.5) (end -3.5 3.5) (layer F.Fab) (width 0.15))
  (fp_line (start 3.5 -3.5) (end 3.5 3.5) (layer F.Fab) (width 0.15))
  (fp_line (start -2.5 -3.5) (end 3.5 -3.5) (layer F.Fab) (width 0.15))
  (fp_text user %R (at 0 0) (layer F.Fab)
    (effects (font (size 1 1) (thickness 0.15)))
  )
  (pad 32 smd rect (at -2.8 -4.25 90) (size 1.2 0.6) (layers F.Cu F.Paste F.Mask))
  (pad 31 smd rect (at -2 -4.25 90) (size 1.2 0.6) (layers F.Cu F.Paste F.Mask))
  (pad 30 smd rect (at -1.2 -4.25 90) (size 1.2 0.6) (layers F.Cu F.Paste F.Mask))
  (pad 29 smd rect (at -0.4 -4.25 90) (size 1.2 0.6) (layers F.Cu F.Paste F.Mask))
  (pad 28 smd rect (at 0.4 -4.25 90) (size 1.2 0.6) (layers F.Cu F.Paste F.Mask))
  (pad 27 smd rect (at 1.2 -4.25 90) (size 1.2 0.6) (layers F.Cu F.Paste F.Mask))
  (pad 26 smd rect (at 2 -4.25 90) (size 1.2 0.6) (layers F.Cu F.Paste F.Mask))
  (pad 25 smd rect (at 2.8 -4.25 90) (size 1.2 0.6) (layers F.Cu F.Paste F.Mask))
  (pad 24 smd rect (at 4.25 -2.8) (size 1.2 0.6) (layers F.Cu F.Paste F.Mask))
  (pad 23 smd rect (at 4.25 -2) (size 1.2 0.6) (layers F.Cu F.Paste F.Mask))
  (pad 22 smd rect (at 4.25 -1.2) (size 1.2 0.6) (layers F.Cu F.Paste F.Mask))
  (pad 21 smd rect (at 4.25 -0.4) (size 1.2 0.6) (layers F.Cu F.Paste F.Mask))
  (pad 20 smd rect (at 4.25 0.4) (size 1.2 0.6) (layers F.Cu F.Paste F.Mask))
  (pad 19 smd rect (at 4.25 1.2) (size 1.2 0.6) (layers F.Cu F.Paste F.Mask))
  (pad 18 smd rect (at 4.25 2) (size 1.2 0.6) (layers F.Cu F.Paste F.Mask))
  (pad 17 smd rect (at 4.25 2.8) (size 1.2 0.6) (layers F.Cu F.Paste F.Mask))
  (pad 16 smd rect (at 2.8 4.25 90) (size 1.2 0.6) (layers F.Cu F.Paste F.Mask))
  (pad 15 smd rect (at 2 4.25 90) (size 1.2 0.6) (layers F.Cu F.Paste F.Mask))
  (pad 14 smd rect (at 1.2 4.25 90) (size 1.2 0.6) (layers F.Cu F.Paste F.Mask))
  (pad 13 smd rect (at 0.4 4.25 90) (size 1.2 0.6) (layers F.Cu F.Paste F.Mask))
  (pad 12 smd rect (at -0.4 4.25 90) (size 1.2 0.6) (layers F.Cu F.Paste F.Mask))
  (pad 11 smd rect (at -1.2 4.25 90) (size 1.2 0.6) (layers F.Cu F.Paste F.Mask))
  (pad 10 smd rect (at -2 4.25 90) (size 1.2 0.6) (layers F.Cu F.Paste F.Mask))
  (pad 9 smd rect (at -2.8 4.25 90) (size 1.2 0.6) (layers F.Cu F.Paste F.Mask))
  (pad 8 smd rect (at -4.25 2.8) (size 1.2 0.6) (layers F.Cu F.Paste F.Mask))
  (pad 7 smd rect (at -4.25 2) (size 1.2 0.6) (layers F.Cu F.Paste F.Mask))
  (pad 6 smd rect (at -4.25 1.2) (size 1.2 0.6) (layers F.Cu F.Paste F.Mask))
  (pad 5 smd rect (at -4.25 0.4) (size 1.2 0.6) (layers F.Cu F.Paste F.Mask))
  (pad 4 smd rect (at -4.25 -0.4) (size 1.2 0.6) (layers F.Cu F.Paste F.Mask))
  (pad 3 smd rect (at -4.25 -1.2) (size 1.2 0.6) (layers F.Cu F.Paste F.Mask))
  (pad 2 smd rect (at -4.25 -2) (size 1.2 0.6) (layers F.Cu F.Paste F.Mask))
  (pad 1 smd rect (at -4.25 -2.8) (size 1.2 0.6) (layers F.Cu F.Paste F.Mask))
  (model ${KISYS3DMOD}/Package_QFP.3dshapes/LQFP-32_7x7mm_P0.8mm.step
    (at (xyz 0 0 0))
    (scale (xyz 1 1 1))
    (rotate (xyz 0 0 0))
  )
)
