G04 #@! TF.GenerationSoftware,KiCad,Pcbnew,5.0.2+dfsg1-1~bpo9+1*
G04 #@! TF.CreationDate,2019-06-17T00:41:48+02:00*
G04 #@! TF.ProjectId,3Phase,33506861-7365-42e6-9b69-6361645f7063,rev?*
G04 #@! TF.SameCoordinates,Original*
G04 #@! TF.FileFunction,Soldermask,Bot*
G04 #@! TF.FilePolarity,Negative*
%FSLAX46Y46*%
G04 Gerber Fmt 4.6, Leading zero omitted, Abs format (unit mm)*
G04 Created by KiCad (PCBNEW 5.0.2+dfsg1-1~bpo9+1) date lun 17 jun 2019 00:41:48 CEST*
%MOMM*%
%LPD*%
G01*
G04 APERTURE LIST*
%ADD10C,0.100000*%
G04 APERTURE END LIST*
D10*
G04 #@! TO.C,SW2*
X148504200Y-86958800D02*
G75*
G03X148504200Y-86958800I-1143000J0D01*
G01*
X154000200Y-89458800D02*
G75*
G03X154000200Y-89458800I-889000J0D01*
G01*
X149500200Y-89458800D02*
G75*
G03X149500200Y-89458800I-889000J0D01*
G01*
X155504200Y-86958800D02*
G75*
G03X155504200Y-86958800I-1143000J0D01*
G01*
G36*
X153250651Y-88517927D02*
X153388305Y-88545308D01*
X153561194Y-88616921D01*
X153716790Y-88720887D01*
X153849113Y-88853210D01*
X153953079Y-89008806D01*
X154024692Y-89181695D01*
X154061200Y-89365233D01*
X154061200Y-89552367D01*
X154024692Y-89735905D01*
X153953079Y-89908794D01*
X153849113Y-90064390D01*
X153716790Y-90196713D01*
X153561194Y-90300679D01*
X153388305Y-90372292D01*
X153250651Y-90399673D01*
X153204768Y-90408800D01*
X153017632Y-90408800D01*
X152971749Y-90399673D01*
X152834095Y-90372292D01*
X152661206Y-90300679D01*
X152505610Y-90196713D01*
X152373287Y-90064390D01*
X152269321Y-89908794D01*
X152197708Y-89735905D01*
X152161200Y-89552367D01*
X152161200Y-89365233D01*
X152197708Y-89181695D01*
X152269321Y-89008806D01*
X152373287Y-88853210D01*
X152505610Y-88720887D01*
X152661206Y-88616921D01*
X152834095Y-88545308D01*
X152971749Y-88517927D01*
X153017632Y-88508800D01*
X153204768Y-88508800D01*
X153250651Y-88517927D01*
X153250651Y-88517927D01*
G37*
G36*
X148750651Y-88517927D02*
X148888305Y-88545308D01*
X149061194Y-88616921D01*
X149216790Y-88720887D01*
X149349113Y-88853210D01*
X149453079Y-89008806D01*
X149524692Y-89181695D01*
X149561200Y-89365233D01*
X149561200Y-89552367D01*
X149524692Y-89735905D01*
X149453079Y-89908794D01*
X149349113Y-90064390D01*
X149216790Y-90196713D01*
X149061194Y-90300679D01*
X148888305Y-90372292D01*
X148750651Y-90399673D01*
X148704768Y-90408800D01*
X148517632Y-90408800D01*
X148471749Y-90399673D01*
X148334095Y-90372292D01*
X148161206Y-90300679D01*
X148005610Y-90196713D01*
X147873287Y-90064390D01*
X147769321Y-89908794D01*
X147697708Y-89735905D01*
X147661200Y-89552367D01*
X147661200Y-89365233D01*
X147697708Y-89181695D01*
X147769321Y-89008806D01*
X147873287Y-88853210D01*
X148005610Y-88720887D01*
X148161206Y-88616921D01*
X148334095Y-88545308D01*
X148471749Y-88517927D01*
X148517632Y-88508800D01*
X148704768Y-88508800D01*
X148750651Y-88517927D01*
X148750651Y-88517927D01*
G37*
G36*
X209581016Y-86456543D02*
X209877364Y-86515490D01*
X210191294Y-86645524D01*
X210473824Y-86834305D01*
X210714095Y-87074576D01*
X210902876Y-87357106D01*
X211032910Y-87671036D01*
X211076643Y-87890899D01*
X211093102Y-87973645D01*
X211100215Y-87997095D01*
X211111766Y-88018705D01*
X211127312Y-88037647D01*
X211146254Y-88053193D01*
X211167865Y-88064744D01*
X211191314Y-88071857D01*
X211215700Y-88074259D01*
X211240086Y-88071857D01*
X211263536Y-88064744D01*
X211285146Y-88053193D01*
X211304088Y-88037647D01*
X211319634Y-88018705D01*
X211331185Y-87997094D01*
X211338298Y-87973645D01*
X211354757Y-87890899D01*
X211398490Y-87671036D01*
X211528524Y-87357106D01*
X211717305Y-87074576D01*
X211957576Y-86834305D01*
X212240106Y-86645524D01*
X212554036Y-86515490D01*
X212850384Y-86456543D01*
X212887301Y-86449200D01*
X213227099Y-86449200D01*
X213264016Y-86456543D01*
X213560364Y-86515490D01*
X213874294Y-86645524D01*
X214156824Y-86834305D01*
X214397095Y-87074576D01*
X214585876Y-87357106D01*
X214715910Y-87671036D01*
X214759643Y-87890899D01*
X214782200Y-88004301D01*
X214782200Y-88344099D01*
X214780766Y-88351306D01*
X214715910Y-88677364D01*
X214585876Y-88991294D01*
X214397095Y-89273824D01*
X214156824Y-89514095D01*
X213874294Y-89702876D01*
X213560364Y-89832910D01*
X213264016Y-89891857D01*
X213227099Y-89899200D01*
X212887301Y-89899200D01*
X212850384Y-89891857D01*
X212554036Y-89832910D01*
X212240106Y-89702876D01*
X211957576Y-89514095D01*
X211717305Y-89273824D01*
X211528524Y-88991294D01*
X211398490Y-88677364D01*
X211338298Y-88374755D01*
X211331185Y-88351305D01*
X211319634Y-88329695D01*
X211304088Y-88310753D01*
X211285146Y-88295207D01*
X211263535Y-88283656D01*
X211240086Y-88276543D01*
X211215700Y-88274141D01*
X211191314Y-88276543D01*
X211167864Y-88283656D01*
X211146254Y-88295207D01*
X211127312Y-88310753D01*
X211111766Y-88329695D01*
X211100215Y-88351306D01*
X211093102Y-88374755D01*
X211032910Y-88677364D01*
X210902876Y-88991294D01*
X210714095Y-89273824D01*
X210473824Y-89514095D01*
X210191294Y-89702876D01*
X209877364Y-89832910D01*
X209581016Y-89891857D01*
X209544099Y-89899200D01*
X209204301Y-89899200D01*
X209167384Y-89891857D01*
X208871036Y-89832910D01*
X208557106Y-89702876D01*
X208274576Y-89514095D01*
X208034305Y-89273824D01*
X207845524Y-88991294D01*
X207715490Y-88677364D01*
X207650634Y-88351306D01*
X207649200Y-88344099D01*
X207649200Y-88004301D01*
X207671757Y-87890899D01*
X207715490Y-87671036D01*
X207845524Y-87357106D01*
X208034305Y-87074576D01*
X208274576Y-86834305D01*
X208557106Y-86645524D01*
X208871036Y-86515490D01*
X209167384Y-86456543D01*
X209204301Y-86449200D01*
X209544099Y-86449200D01*
X209581016Y-86456543D01*
X209581016Y-86456543D01*
G37*
G36*
X220884016Y-86456543D02*
X221180364Y-86515490D01*
X221494294Y-86645524D01*
X221776824Y-86834305D01*
X222017095Y-87074576D01*
X222205876Y-87357106D01*
X222335910Y-87671036D01*
X222379643Y-87890899D01*
X222402200Y-88004301D01*
X222402200Y-88344099D01*
X222400766Y-88351306D01*
X222335910Y-88677364D01*
X222205876Y-88991294D01*
X222017095Y-89273824D01*
X221776824Y-89514095D01*
X221494294Y-89702876D01*
X221180364Y-89832910D01*
X220884016Y-89891857D01*
X220847099Y-89899200D01*
X220507301Y-89899200D01*
X220470384Y-89891857D01*
X220174036Y-89832910D01*
X219860106Y-89702876D01*
X219577576Y-89514095D01*
X219337305Y-89273824D01*
X219148524Y-88991294D01*
X219018490Y-88677364D01*
X218953634Y-88351306D01*
X218952200Y-88344099D01*
X218952200Y-88004301D01*
X218974757Y-87890899D01*
X219018490Y-87671036D01*
X219148524Y-87357106D01*
X219337305Y-87074576D01*
X219577576Y-86834305D01*
X219860106Y-86645524D01*
X220174036Y-86515490D01*
X220470384Y-86456543D01*
X220507301Y-86449200D01*
X220847099Y-86449200D01*
X220884016Y-86456543D01*
X220884016Y-86456543D01*
G37*
G36*
X198278016Y-86456543D02*
X198574364Y-86515490D01*
X198888294Y-86645524D01*
X199170824Y-86834305D01*
X199411095Y-87074576D01*
X199599876Y-87357106D01*
X199729910Y-87671036D01*
X199773643Y-87890899D01*
X199790102Y-87973645D01*
X199797215Y-87997095D01*
X199808766Y-88018705D01*
X199824312Y-88037647D01*
X199843254Y-88053193D01*
X199864865Y-88064744D01*
X199888314Y-88071857D01*
X199912700Y-88074259D01*
X199937086Y-88071857D01*
X199960536Y-88064744D01*
X199982146Y-88053193D01*
X200001088Y-88037647D01*
X200016634Y-88018705D01*
X200028185Y-87997094D01*
X200035298Y-87973645D01*
X200051757Y-87890899D01*
X200095490Y-87671036D01*
X200225524Y-87357106D01*
X200414305Y-87074576D01*
X200654576Y-86834305D01*
X200937106Y-86645524D01*
X201251036Y-86515490D01*
X201547384Y-86456543D01*
X201584301Y-86449200D01*
X201924099Y-86449200D01*
X201961016Y-86456543D01*
X202257364Y-86515490D01*
X202571294Y-86645524D01*
X202853824Y-86834305D01*
X203094095Y-87074576D01*
X203282876Y-87357106D01*
X203412910Y-87671036D01*
X203456643Y-87890899D01*
X203479200Y-88004301D01*
X203479200Y-88344099D01*
X203477766Y-88351306D01*
X203412910Y-88677364D01*
X203282876Y-88991294D01*
X203094095Y-89273824D01*
X202853824Y-89514095D01*
X202571294Y-89702876D01*
X202257364Y-89832910D01*
X201961016Y-89891857D01*
X201924099Y-89899200D01*
X201584301Y-89899200D01*
X201547384Y-89891857D01*
X201251036Y-89832910D01*
X200937106Y-89702876D01*
X200654576Y-89514095D01*
X200414305Y-89273824D01*
X200225524Y-88991294D01*
X200095490Y-88677364D01*
X200035298Y-88374755D01*
X200028185Y-88351305D01*
X200016634Y-88329695D01*
X200001088Y-88310753D01*
X199982146Y-88295207D01*
X199960535Y-88283656D01*
X199937086Y-88276543D01*
X199912700Y-88274141D01*
X199888314Y-88276543D01*
X199864864Y-88283656D01*
X199843254Y-88295207D01*
X199824312Y-88310753D01*
X199808766Y-88329695D01*
X199797215Y-88351306D01*
X199790102Y-88374755D01*
X199729910Y-88677364D01*
X199599876Y-88991294D01*
X199411095Y-89273824D01*
X199170824Y-89514095D01*
X198888294Y-89702876D01*
X198574364Y-89832910D01*
X198278016Y-89891857D01*
X198241099Y-89899200D01*
X197901301Y-89899200D01*
X197864384Y-89891857D01*
X197568036Y-89832910D01*
X197254106Y-89702876D01*
X196971576Y-89514095D01*
X196731305Y-89273824D01*
X196542524Y-88991294D01*
X196412490Y-88677364D01*
X196347634Y-88351306D01*
X196346200Y-88344099D01*
X196346200Y-88004301D01*
X196368757Y-87890899D01*
X196412490Y-87671036D01*
X196542524Y-87357106D01*
X196731305Y-87074576D01*
X196971576Y-86834305D01*
X197254106Y-86645524D01*
X197568036Y-86515490D01*
X197864384Y-86456543D01*
X197901301Y-86449200D01*
X198241099Y-86449200D01*
X198278016Y-86456543D01*
X198278016Y-86456543D01*
G37*
G36*
X186975016Y-86456543D02*
X187271364Y-86515490D01*
X187585294Y-86645524D01*
X187867824Y-86834305D01*
X188108095Y-87074576D01*
X188296876Y-87357106D01*
X188426910Y-87671036D01*
X188470643Y-87890899D01*
X188487102Y-87973645D01*
X188494215Y-87997095D01*
X188505766Y-88018705D01*
X188521312Y-88037647D01*
X188540254Y-88053193D01*
X188561865Y-88064744D01*
X188585314Y-88071857D01*
X188609700Y-88074259D01*
X188634086Y-88071857D01*
X188657536Y-88064744D01*
X188679146Y-88053193D01*
X188698088Y-88037647D01*
X188713634Y-88018705D01*
X188725185Y-87997094D01*
X188732298Y-87973645D01*
X188748757Y-87890899D01*
X188792490Y-87671036D01*
X188922524Y-87357106D01*
X189111305Y-87074576D01*
X189351576Y-86834305D01*
X189634106Y-86645524D01*
X189948036Y-86515490D01*
X190244384Y-86456543D01*
X190281301Y-86449200D01*
X190621099Y-86449200D01*
X190658016Y-86456543D01*
X190954364Y-86515490D01*
X191268294Y-86645524D01*
X191550824Y-86834305D01*
X191791095Y-87074576D01*
X191979876Y-87357106D01*
X192109910Y-87671036D01*
X192153643Y-87890899D01*
X192176200Y-88004301D01*
X192176200Y-88344099D01*
X192174766Y-88351306D01*
X192109910Y-88677364D01*
X191979876Y-88991294D01*
X191791095Y-89273824D01*
X191550824Y-89514095D01*
X191268294Y-89702876D01*
X190954364Y-89832910D01*
X190658016Y-89891857D01*
X190621099Y-89899200D01*
X190281301Y-89899200D01*
X190244384Y-89891857D01*
X189948036Y-89832910D01*
X189634106Y-89702876D01*
X189351576Y-89514095D01*
X189111305Y-89273824D01*
X188922524Y-88991294D01*
X188792490Y-88677364D01*
X188732298Y-88374755D01*
X188725185Y-88351305D01*
X188713634Y-88329695D01*
X188698088Y-88310753D01*
X188679146Y-88295207D01*
X188657535Y-88283656D01*
X188634086Y-88276543D01*
X188609700Y-88274141D01*
X188585314Y-88276543D01*
X188561864Y-88283656D01*
X188540254Y-88295207D01*
X188521312Y-88310753D01*
X188505766Y-88329695D01*
X188494215Y-88351306D01*
X188487102Y-88374755D01*
X188426910Y-88677364D01*
X188296876Y-88991294D01*
X188108095Y-89273824D01*
X187867824Y-89514095D01*
X187585294Y-89702876D01*
X187271364Y-89832910D01*
X186975016Y-89891857D01*
X186938099Y-89899200D01*
X186598301Y-89899200D01*
X186561384Y-89891857D01*
X186265036Y-89832910D01*
X185951106Y-89702876D01*
X185668576Y-89514095D01*
X185428305Y-89273824D01*
X185239524Y-88991294D01*
X185109490Y-88677364D01*
X185044634Y-88351306D01*
X185043200Y-88344099D01*
X185043200Y-88004301D01*
X185065757Y-87890899D01*
X185109490Y-87671036D01*
X185239524Y-87357106D01*
X185428305Y-87074576D01*
X185668576Y-86834305D01*
X185951106Y-86645524D01*
X186265036Y-86515490D01*
X186561384Y-86456543D01*
X186598301Y-86449200D01*
X186938099Y-86449200D01*
X186975016Y-86456543D01*
X186975016Y-86456543D01*
G37*
G36*
X179355016Y-86456543D02*
X179651364Y-86515490D01*
X179965294Y-86645524D01*
X180247824Y-86834305D01*
X180488095Y-87074576D01*
X180676876Y-87357106D01*
X180806910Y-87671036D01*
X180850643Y-87890899D01*
X180873200Y-88004301D01*
X180873200Y-88344099D01*
X180871766Y-88351306D01*
X180806910Y-88677364D01*
X180676876Y-88991294D01*
X180488095Y-89273824D01*
X180247824Y-89514095D01*
X179965294Y-89702876D01*
X179651364Y-89832910D01*
X179355016Y-89891857D01*
X179318099Y-89899200D01*
X178978301Y-89899200D01*
X178941384Y-89891857D01*
X178645036Y-89832910D01*
X178331106Y-89702876D01*
X178048576Y-89514095D01*
X177808305Y-89273824D01*
X177619524Y-88991294D01*
X177489490Y-88677364D01*
X177424634Y-88351306D01*
X177423200Y-88344099D01*
X177423200Y-88004301D01*
X177445757Y-87890899D01*
X177489490Y-87671036D01*
X177619524Y-87357106D01*
X177808305Y-87074576D01*
X178048576Y-86834305D01*
X178331106Y-86645524D01*
X178645036Y-86515490D01*
X178941384Y-86456543D01*
X178978301Y-86449200D01*
X179318099Y-86449200D01*
X179355016Y-86456543D01*
X179355016Y-86456543D01*
G37*
G36*
X171265029Y-85998469D02*
X171265032Y-85998470D01*
X171265033Y-85998470D01*
X171453534Y-86055651D01*
X171453536Y-86055652D01*
X171453539Y-86055653D01*
X171627258Y-86148507D01*
X171779528Y-86273472D01*
X171904491Y-86425740D01*
X171904492Y-86425742D01*
X171997349Y-86599465D01*
X172011321Y-86645526D01*
X172054531Y-86787970D01*
X172069000Y-86934876D01*
X172069000Y-88833124D01*
X172054531Y-88980030D01*
X171997348Y-89168537D01*
X171904491Y-89342260D01*
X171779528Y-89494528D01*
X171627260Y-89619491D01*
X171471258Y-89702876D01*
X171453535Y-89712349D01*
X171265034Y-89769530D01*
X171265033Y-89769530D01*
X171265030Y-89769531D01*
X171069000Y-89788838D01*
X170872971Y-89769531D01*
X170872968Y-89769530D01*
X170872967Y-89769530D01*
X170684466Y-89712349D01*
X170666743Y-89702876D01*
X170510741Y-89619491D01*
X170358473Y-89494528D01*
X170233510Y-89342260D01*
X170140653Y-89168537D01*
X170083470Y-88980030D01*
X170069000Y-88833123D01*
X170069000Y-86934877D01*
X170083469Y-86787971D01*
X170083470Y-86787967D01*
X170140651Y-86599466D01*
X170140652Y-86599464D01*
X170140653Y-86599461D01*
X170233507Y-86425742D01*
X170358472Y-86273472D01*
X170510740Y-86148509D01*
X170684463Y-86055652D01*
X170684465Y-86055651D01*
X170872966Y-85998470D01*
X170872967Y-85998470D01*
X170872970Y-85998469D01*
X171069000Y-85979162D01*
X171265029Y-85998469D01*
X171265029Y-85998469D01*
G37*
G36*
X167455029Y-85998469D02*
X167455032Y-85998470D01*
X167455033Y-85998470D01*
X167643534Y-86055651D01*
X167643536Y-86055652D01*
X167643539Y-86055653D01*
X167817258Y-86148507D01*
X167969528Y-86273472D01*
X168094491Y-86425740D01*
X168094492Y-86425742D01*
X168187349Y-86599465D01*
X168201321Y-86645526D01*
X168244531Y-86787970D01*
X168259000Y-86934876D01*
X168259000Y-88833124D01*
X168244531Y-88980030D01*
X168187348Y-89168537D01*
X168094491Y-89342260D01*
X167969528Y-89494528D01*
X167817260Y-89619491D01*
X167661258Y-89702876D01*
X167643535Y-89712349D01*
X167455034Y-89769530D01*
X167455033Y-89769530D01*
X167455030Y-89769531D01*
X167259000Y-89788838D01*
X167062971Y-89769531D01*
X167062968Y-89769530D01*
X167062967Y-89769530D01*
X166874466Y-89712349D01*
X166856743Y-89702876D01*
X166700741Y-89619491D01*
X166548473Y-89494528D01*
X166423510Y-89342260D01*
X166330653Y-89168537D01*
X166273470Y-88980030D01*
X166259000Y-88833123D01*
X166259000Y-86934877D01*
X166273469Y-86787971D01*
X166273470Y-86787967D01*
X166330651Y-86599466D01*
X166330652Y-86599464D01*
X166330653Y-86599461D01*
X166423507Y-86425742D01*
X166548472Y-86273472D01*
X166700740Y-86148509D01*
X166874463Y-86055652D01*
X166874465Y-86055651D01*
X167062966Y-85998470D01*
X167062967Y-85998470D01*
X167062970Y-85998469D01*
X167259000Y-85979162D01*
X167455029Y-85998469D01*
X167455029Y-85998469D01*
G37*
G36*
X163645029Y-85998469D02*
X163645032Y-85998470D01*
X163645033Y-85998470D01*
X163833534Y-86055651D01*
X163833536Y-86055652D01*
X163833539Y-86055653D01*
X164007258Y-86148507D01*
X164159528Y-86273472D01*
X164284491Y-86425740D01*
X164284492Y-86425742D01*
X164377349Y-86599465D01*
X164391321Y-86645526D01*
X164434531Y-86787970D01*
X164449000Y-86934876D01*
X164449000Y-88833124D01*
X164434531Y-88980030D01*
X164377348Y-89168537D01*
X164284491Y-89342260D01*
X164159528Y-89494528D01*
X164007260Y-89619491D01*
X163851258Y-89702876D01*
X163833535Y-89712349D01*
X163645034Y-89769530D01*
X163645033Y-89769530D01*
X163645030Y-89769531D01*
X163449000Y-89788838D01*
X163252971Y-89769531D01*
X163252968Y-89769530D01*
X163252967Y-89769530D01*
X163064466Y-89712349D01*
X163046743Y-89702876D01*
X162890741Y-89619491D01*
X162738473Y-89494528D01*
X162613510Y-89342260D01*
X162520653Y-89168537D01*
X162463470Y-88980030D01*
X162449000Y-88833123D01*
X162449000Y-86934877D01*
X162463469Y-86787971D01*
X162463470Y-86787967D01*
X162520651Y-86599466D01*
X162520652Y-86599464D01*
X162520653Y-86599461D01*
X162613507Y-86425742D01*
X162738472Y-86273472D01*
X162890740Y-86148509D01*
X163064463Y-86055652D01*
X163064465Y-86055651D01*
X163252966Y-85998470D01*
X163252967Y-85998470D01*
X163252970Y-85998469D01*
X163449000Y-85979162D01*
X163645029Y-85998469D01*
X163645029Y-85998469D01*
G37*
G36*
X160639000Y-89784000D02*
X158639000Y-89784000D01*
X158639000Y-85984000D01*
X160639000Y-85984000D01*
X160639000Y-89784000D01*
X160639000Y-89784000D01*
G37*
G36*
X154711226Y-85804915D02*
X154929612Y-85895373D01*
X155126158Y-86026701D01*
X155293299Y-86193842D01*
X155424627Y-86390388D01*
X155515085Y-86608774D01*
X155561200Y-86840609D01*
X155561200Y-87076991D01*
X155515085Y-87308826D01*
X155424627Y-87527212D01*
X155293299Y-87723758D01*
X155126158Y-87890899D01*
X154929612Y-88022227D01*
X154711226Y-88112685D01*
X154479391Y-88158800D01*
X154243009Y-88158800D01*
X154011174Y-88112685D01*
X153792788Y-88022227D01*
X153596242Y-87890899D01*
X153429101Y-87723758D01*
X153297773Y-87527212D01*
X153207315Y-87308826D01*
X153161200Y-87076991D01*
X153161200Y-86840609D01*
X153207315Y-86608774D01*
X153297773Y-86390388D01*
X153429101Y-86193842D01*
X153596242Y-86026701D01*
X153792788Y-85895373D01*
X154011174Y-85804915D01*
X154243009Y-85758800D01*
X154479391Y-85758800D01*
X154711226Y-85804915D01*
X154711226Y-85804915D01*
G37*
G36*
X147711226Y-85804915D02*
X147929612Y-85895373D01*
X148126158Y-86026701D01*
X148293299Y-86193842D01*
X148424627Y-86390388D01*
X148515085Y-86608774D01*
X148561200Y-86840609D01*
X148561200Y-87076991D01*
X148515085Y-87308826D01*
X148424627Y-87527212D01*
X148293299Y-87723758D01*
X148126158Y-87890899D01*
X147929612Y-88022227D01*
X147711226Y-88112685D01*
X147479391Y-88158800D01*
X147243009Y-88158800D01*
X147011174Y-88112685D01*
X146792788Y-88022227D01*
X146596242Y-87890899D01*
X146429101Y-87723758D01*
X146297773Y-87527212D01*
X146207315Y-87308826D01*
X146161200Y-87076991D01*
X146161200Y-86840609D01*
X146207315Y-86608774D01*
X146297773Y-86390388D01*
X146429101Y-86193842D01*
X146596242Y-86026701D01*
X146792788Y-85895373D01*
X147011174Y-85804915D01*
X147243009Y-85758800D01*
X147479391Y-85758800D01*
X147711226Y-85804915D01*
X147711226Y-85804915D01*
G37*
G36*
X157818721Y-82954586D02*
X157982509Y-83022429D01*
X158129920Y-83120926D01*
X158255274Y-83246280D01*
X158353771Y-83393691D01*
X158421614Y-83557479D01*
X158456200Y-83731356D01*
X158456200Y-83908644D01*
X158421614Y-84082521D01*
X158353771Y-84246309D01*
X158255274Y-84393720D01*
X158129920Y-84519074D01*
X157982509Y-84617571D01*
X157818721Y-84685414D01*
X157644844Y-84720000D01*
X157467556Y-84720000D01*
X157293679Y-84685414D01*
X157129891Y-84617571D01*
X156982480Y-84519074D01*
X156857126Y-84393720D01*
X156758629Y-84246309D01*
X156690786Y-84082521D01*
X156656200Y-83908644D01*
X156656200Y-83731356D01*
X156690786Y-83557479D01*
X156758629Y-83393691D01*
X156857126Y-83246280D01*
X156982480Y-83120926D01*
X157129891Y-83022429D01*
X157293679Y-82954586D01*
X157467556Y-82920000D01*
X157644844Y-82920000D01*
X157818721Y-82954586D01*
X157818721Y-82954586D01*
G37*
G36*
X153932521Y-82954586D02*
X154096309Y-83022429D01*
X154243720Y-83120926D01*
X154369074Y-83246280D01*
X154467571Y-83393691D01*
X154535414Y-83557479D01*
X154570000Y-83731356D01*
X154570000Y-83908644D01*
X154535414Y-84082521D01*
X154467571Y-84246309D01*
X154369074Y-84393720D01*
X154243720Y-84519074D01*
X154096309Y-84617571D01*
X153932521Y-84685414D01*
X153758644Y-84720000D01*
X153581356Y-84720000D01*
X153407479Y-84685414D01*
X153243691Y-84617571D01*
X153096280Y-84519074D01*
X152970926Y-84393720D01*
X152872429Y-84246309D01*
X152804586Y-84082521D01*
X152770000Y-83908644D01*
X152770000Y-83731356D01*
X152804586Y-83557479D01*
X152872429Y-83393691D01*
X152970926Y-83246280D01*
X153096280Y-83120926D01*
X153243691Y-83022429D01*
X153407479Y-82954586D01*
X153581356Y-82920000D01*
X153758644Y-82920000D01*
X153932521Y-82954586D01*
X153932521Y-82954586D01*
G37*
G36*
X149858196Y-81172958D02*
X150094780Y-81270954D01*
X150307705Y-81413226D01*
X150488774Y-81594295D01*
X150631046Y-81807220D01*
X150729042Y-82043804D01*
X150779000Y-82294960D01*
X150779000Y-82551040D01*
X150729042Y-82802196D01*
X150631046Y-83038780D01*
X150488774Y-83251705D01*
X150307705Y-83432774D01*
X150094780Y-83575046D01*
X149858196Y-83673042D01*
X149607040Y-83723000D01*
X149350960Y-83723000D01*
X149099804Y-83673042D01*
X148863220Y-83575046D01*
X148650295Y-83432774D01*
X148469226Y-83251705D01*
X148326954Y-83038780D01*
X148228958Y-82802196D01*
X148179000Y-82551040D01*
X148179000Y-82294960D01*
X148228958Y-82043804D01*
X148326954Y-81807220D01*
X148469226Y-81594295D01*
X148650295Y-81413226D01*
X148863220Y-81270954D01*
X149099804Y-81172958D01*
X149350960Y-81123000D01*
X149607040Y-81123000D01*
X149858196Y-81172958D01*
X149858196Y-81172958D01*
G37*
G36*
X183728177Y-80974200D02*
X183844053Y-80997249D01*
X184000563Y-81062078D01*
X184070991Y-81109137D01*
X184141420Y-81156196D01*
X184261204Y-81275980D01*
X184355323Y-81416839D01*
X184420151Y-81573348D01*
X184453200Y-81739496D01*
X184453200Y-81908904D01*
X184420151Y-82075052D01*
X184355323Y-82231561D01*
X184261204Y-82372420D01*
X184141420Y-82492204D01*
X184070991Y-82539263D01*
X184000563Y-82586322D01*
X183844053Y-82651151D01*
X183760978Y-82667675D01*
X183677904Y-82684200D01*
X183508496Y-82684200D01*
X183425422Y-82667675D01*
X183342347Y-82651151D01*
X183185837Y-82586322D01*
X183115410Y-82539264D01*
X183044980Y-82492204D01*
X182925196Y-82372420D01*
X182831077Y-82231561D01*
X182766249Y-82075052D01*
X182733200Y-81908904D01*
X182733200Y-81739496D01*
X182766249Y-81573348D01*
X182831077Y-81416839D01*
X182925196Y-81275980D01*
X183044980Y-81156196D01*
X183115409Y-81109137D01*
X183185837Y-81062078D01*
X183342347Y-80997249D01*
X183458223Y-80974200D01*
X183508496Y-80964200D01*
X183677904Y-80964200D01*
X183728177Y-80974200D01*
X183728177Y-80974200D01*
G37*
G36*
X217637177Y-80974200D02*
X217753053Y-80997249D01*
X217909563Y-81062078D01*
X217979991Y-81109137D01*
X218050420Y-81156196D01*
X218170204Y-81275980D01*
X218264323Y-81416839D01*
X218329151Y-81573348D01*
X218362200Y-81739496D01*
X218362200Y-81908904D01*
X218329151Y-82075052D01*
X218264323Y-82231561D01*
X218170204Y-82372420D01*
X218050420Y-82492204D01*
X217979991Y-82539263D01*
X217909563Y-82586322D01*
X217753053Y-82651151D01*
X217669978Y-82667675D01*
X217586904Y-82684200D01*
X217417496Y-82684200D01*
X217334422Y-82667675D01*
X217251347Y-82651151D01*
X217094837Y-82586322D01*
X217024410Y-82539264D01*
X216953980Y-82492204D01*
X216834196Y-82372420D01*
X216740077Y-82231561D01*
X216675249Y-82075052D01*
X216642200Y-81908904D01*
X216642200Y-81739496D01*
X216675249Y-81573348D01*
X216740077Y-81416839D01*
X216834196Y-81275980D01*
X216953980Y-81156196D01*
X217024409Y-81109137D01*
X217094837Y-81062078D01*
X217251347Y-80997249D01*
X217367223Y-80974200D01*
X217417496Y-80964200D01*
X217586904Y-80964200D01*
X217637177Y-80974200D01*
X217637177Y-80974200D01*
G37*
G36*
X195031177Y-80974200D02*
X195147053Y-80997249D01*
X195303563Y-81062078D01*
X195373991Y-81109137D01*
X195444420Y-81156196D01*
X195564204Y-81275980D01*
X195658323Y-81416839D01*
X195723151Y-81573348D01*
X195756200Y-81739496D01*
X195756200Y-81908904D01*
X195723151Y-82075052D01*
X195658323Y-82231561D01*
X195564204Y-82372420D01*
X195444420Y-82492204D01*
X195373991Y-82539263D01*
X195303563Y-82586322D01*
X195147053Y-82651151D01*
X195063978Y-82667675D01*
X194980904Y-82684200D01*
X194811496Y-82684200D01*
X194728422Y-82667675D01*
X194645347Y-82651151D01*
X194488837Y-82586322D01*
X194418410Y-82539264D01*
X194347980Y-82492204D01*
X194228196Y-82372420D01*
X194134077Y-82231561D01*
X194069249Y-82075052D01*
X194036200Y-81908904D01*
X194036200Y-81739496D01*
X194069249Y-81573348D01*
X194134077Y-81416839D01*
X194228196Y-81275980D01*
X194347980Y-81156196D01*
X194418409Y-81109137D01*
X194488837Y-81062078D01*
X194645347Y-80997249D01*
X194761223Y-80974200D01*
X194811496Y-80964200D01*
X194980904Y-80964200D01*
X195031177Y-80974200D01*
X195031177Y-80974200D01*
G37*
G36*
X206334177Y-80974200D02*
X206450053Y-80997249D01*
X206606563Y-81062078D01*
X206676991Y-81109137D01*
X206747420Y-81156196D01*
X206867204Y-81275980D01*
X206961323Y-81416839D01*
X207026151Y-81573348D01*
X207059200Y-81739496D01*
X207059200Y-81908904D01*
X207026151Y-82075052D01*
X206961323Y-82231561D01*
X206867204Y-82372420D01*
X206747420Y-82492204D01*
X206676991Y-82539263D01*
X206606563Y-82586322D01*
X206450053Y-82651151D01*
X206366978Y-82667675D01*
X206283904Y-82684200D01*
X206114496Y-82684200D01*
X206031422Y-82667675D01*
X205948347Y-82651151D01*
X205791837Y-82586322D01*
X205721410Y-82539264D01*
X205650980Y-82492204D01*
X205531196Y-82372420D01*
X205437077Y-82231561D01*
X205372249Y-82075052D01*
X205339200Y-81908904D01*
X205339200Y-81739496D01*
X205372249Y-81573348D01*
X205437077Y-81416839D01*
X205531196Y-81275980D01*
X205650980Y-81156196D01*
X205721409Y-81109137D01*
X205791837Y-81062078D01*
X205948347Y-80997249D01*
X206064223Y-80974200D01*
X206114496Y-80964200D01*
X206283904Y-80964200D01*
X206334177Y-80974200D01*
X206334177Y-80974200D01*
G37*
G36*
X193206200Y-82674200D02*
X191506200Y-82674200D01*
X191506200Y-80974200D01*
X193206200Y-80974200D01*
X193206200Y-82674200D01*
X193206200Y-82674200D01*
G37*
G36*
X215812200Y-82674200D02*
X214112200Y-82674200D01*
X214112200Y-80974200D01*
X215812200Y-80974200D01*
X215812200Y-82674200D01*
X215812200Y-82674200D01*
G37*
G36*
X204509200Y-82674200D02*
X202809200Y-82674200D01*
X202809200Y-80974200D01*
X204509200Y-80974200D01*
X204509200Y-82674200D01*
X204509200Y-82674200D01*
G37*
G36*
X181903200Y-82674200D02*
X180203200Y-82674200D01*
X180203200Y-80974200D01*
X181903200Y-80974200D01*
X181903200Y-82674200D01*
X181903200Y-82674200D01*
G37*
G36*
X205096978Y-78440724D02*
X205180053Y-78457249D01*
X205336563Y-78522078D01*
X205338673Y-78523488D01*
X205477420Y-78616196D01*
X205597204Y-78735980D01*
X205691323Y-78876839D01*
X205756151Y-79033348D01*
X205789200Y-79199496D01*
X205789200Y-79368904D01*
X205756151Y-79535052D01*
X205691323Y-79691561D01*
X205597204Y-79832420D01*
X205477420Y-79952204D01*
X205406990Y-79999264D01*
X205336563Y-80046322D01*
X205180053Y-80111151D01*
X205096978Y-80127675D01*
X205013904Y-80144200D01*
X204844496Y-80144200D01*
X204761422Y-80127675D01*
X204678347Y-80111151D01*
X204521837Y-80046322D01*
X204451409Y-79999263D01*
X204380980Y-79952204D01*
X204261196Y-79832420D01*
X204167077Y-79691561D01*
X204102249Y-79535052D01*
X204069200Y-79368904D01*
X204069200Y-79199496D01*
X204102249Y-79033348D01*
X204167077Y-78876839D01*
X204261196Y-78735980D01*
X204380980Y-78616196D01*
X204519727Y-78523488D01*
X204521837Y-78522078D01*
X204678347Y-78457249D01*
X204761422Y-78440725D01*
X204844496Y-78424200D01*
X205013904Y-78424200D01*
X205096978Y-78440724D01*
X205096978Y-78440724D01*
G37*
G36*
X207636978Y-78440724D02*
X207720053Y-78457249D01*
X207876563Y-78522078D01*
X207878673Y-78523488D01*
X208017420Y-78616196D01*
X208137204Y-78735980D01*
X208231323Y-78876839D01*
X208296151Y-79033348D01*
X208329200Y-79199496D01*
X208329200Y-79368904D01*
X208296151Y-79535052D01*
X208231323Y-79691561D01*
X208137204Y-79832420D01*
X208017420Y-79952204D01*
X207946990Y-79999264D01*
X207876563Y-80046322D01*
X207720053Y-80111151D01*
X207636978Y-80127675D01*
X207553904Y-80144200D01*
X207384496Y-80144200D01*
X207301422Y-80127675D01*
X207218347Y-80111151D01*
X207061837Y-80046322D01*
X206991409Y-79999263D01*
X206920980Y-79952204D01*
X206801196Y-79832420D01*
X206707077Y-79691561D01*
X206642249Y-79535052D01*
X206609200Y-79368904D01*
X206609200Y-79199496D01*
X206642249Y-79033348D01*
X206707077Y-78876839D01*
X206801196Y-78735980D01*
X206920980Y-78616196D01*
X207059727Y-78523488D01*
X207061837Y-78522078D01*
X207218347Y-78457249D01*
X207301422Y-78440725D01*
X207384496Y-78424200D01*
X207553904Y-78424200D01*
X207636978Y-78440724D01*
X207636978Y-78440724D01*
G37*
G36*
X196333978Y-78440724D02*
X196417053Y-78457249D01*
X196573563Y-78522078D01*
X196575673Y-78523488D01*
X196714420Y-78616196D01*
X196834204Y-78735980D01*
X196928323Y-78876839D01*
X196993151Y-79033348D01*
X197026200Y-79199496D01*
X197026200Y-79368904D01*
X196993151Y-79535052D01*
X196928323Y-79691561D01*
X196834204Y-79832420D01*
X196714420Y-79952204D01*
X196643990Y-79999264D01*
X196573563Y-80046322D01*
X196417053Y-80111151D01*
X196333978Y-80127675D01*
X196250904Y-80144200D01*
X196081496Y-80144200D01*
X195998422Y-80127675D01*
X195915347Y-80111151D01*
X195758837Y-80046322D01*
X195688409Y-79999263D01*
X195617980Y-79952204D01*
X195498196Y-79832420D01*
X195404077Y-79691561D01*
X195339249Y-79535052D01*
X195306200Y-79368904D01*
X195306200Y-79199496D01*
X195339249Y-79033348D01*
X195404077Y-78876839D01*
X195498196Y-78735980D01*
X195617980Y-78616196D01*
X195756727Y-78523488D01*
X195758837Y-78522078D01*
X195915347Y-78457249D01*
X195998422Y-78440725D01*
X196081496Y-78424200D01*
X196250904Y-78424200D01*
X196333978Y-78440724D01*
X196333978Y-78440724D01*
G37*
G36*
X193793978Y-78440724D02*
X193877053Y-78457249D01*
X194033563Y-78522078D01*
X194035673Y-78523488D01*
X194174420Y-78616196D01*
X194294204Y-78735980D01*
X194388323Y-78876839D01*
X194453151Y-79033348D01*
X194486200Y-79199496D01*
X194486200Y-79368904D01*
X194453151Y-79535052D01*
X194388323Y-79691561D01*
X194294204Y-79832420D01*
X194174420Y-79952204D01*
X194103990Y-79999264D01*
X194033563Y-80046322D01*
X193877053Y-80111151D01*
X193793978Y-80127675D01*
X193710904Y-80144200D01*
X193541496Y-80144200D01*
X193458422Y-80127675D01*
X193375347Y-80111151D01*
X193218837Y-80046322D01*
X193148409Y-79999263D01*
X193077980Y-79952204D01*
X192958196Y-79832420D01*
X192864077Y-79691561D01*
X192799249Y-79535052D01*
X192766200Y-79368904D01*
X192766200Y-79199496D01*
X192799249Y-79033348D01*
X192864077Y-78876839D01*
X192958196Y-78735980D01*
X193077980Y-78616196D01*
X193216727Y-78523488D01*
X193218837Y-78522078D01*
X193375347Y-78457249D01*
X193458422Y-78440725D01*
X193541496Y-78424200D01*
X193710904Y-78424200D01*
X193793978Y-78440724D01*
X193793978Y-78440724D01*
G37*
G36*
X182490978Y-78440724D02*
X182574053Y-78457249D01*
X182730563Y-78522078D01*
X182732673Y-78523488D01*
X182871420Y-78616196D01*
X182991204Y-78735980D01*
X183085323Y-78876839D01*
X183150151Y-79033348D01*
X183183200Y-79199496D01*
X183183200Y-79368904D01*
X183150151Y-79535052D01*
X183085323Y-79691561D01*
X182991204Y-79832420D01*
X182871420Y-79952204D01*
X182800990Y-79999264D01*
X182730563Y-80046322D01*
X182574053Y-80111151D01*
X182490978Y-80127675D01*
X182407904Y-80144200D01*
X182238496Y-80144200D01*
X182155422Y-80127675D01*
X182072347Y-80111151D01*
X181915837Y-80046322D01*
X181845409Y-79999263D01*
X181774980Y-79952204D01*
X181655196Y-79832420D01*
X181561077Y-79691561D01*
X181496249Y-79535052D01*
X181463200Y-79368904D01*
X181463200Y-79199496D01*
X181496249Y-79033348D01*
X181561077Y-78876839D01*
X181655196Y-78735980D01*
X181774980Y-78616196D01*
X181913727Y-78523488D01*
X181915837Y-78522078D01*
X182072347Y-78457249D01*
X182155422Y-78440725D01*
X182238496Y-78424200D01*
X182407904Y-78424200D01*
X182490978Y-78440724D01*
X182490978Y-78440724D01*
G37*
G36*
X216399978Y-78440724D02*
X216483053Y-78457249D01*
X216639563Y-78522078D01*
X216641673Y-78523488D01*
X216780420Y-78616196D01*
X216900204Y-78735980D01*
X216994323Y-78876839D01*
X217059151Y-79033348D01*
X217092200Y-79199496D01*
X217092200Y-79368904D01*
X217059151Y-79535052D01*
X216994323Y-79691561D01*
X216900204Y-79832420D01*
X216780420Y-79952204D01*
X216709990Y-79999264D01*
X216639563Y-80046322D01*
X216483053Y-80111151D01*
X216399978Y-80127675D01*
X216316904Y-80144200D01*
X216147496Y-80144200D01*
X216064422Y-80127675D01*
X215981347Y-80111151D01*
X215824837Y-80046322D01*
X215754409Y-79999263D01*
X215683980Y-79952204D01*
X215564196Y-79832420D01*
X215470077Y-79691561D01*
X215405249Y-79535052D01*
X215372200Y-79368904D01*
X215372200Y-79199496D01*
X215405249Y-79033348D01*
X215470077Y-78876839D01*
X215564196Y-78735980D01*
X215683980Y-78616196D01*
X215822727Y-78523488D01*
X215824837Y-78522078D01*
X215981347Y-78457249D01*
X216064422Y-78440725D01*
X216147496Y-78424200D01*
X216316904Y-78424200D01*
X216399978Y-78440724D01*
X216399978Y-78440724D01*
G37*
G36*
X185030978Y-78440724D02*
X185114053Y-78457249D01*
X185270563Y-78522078D01*
X185272673Y-78523488D01*
X185411420Y-78616196D01*
X185531204Y-78735980D01*
X185625323Y-78876839D01*
X185690151Y-79033348D01*
X185723200Y-79199496D01*
X185723200Y-79368904D01*
X185690151Y-79535052D01*
X185625323Y-79691561D01*
X185531204Y-79832420D01*
X185411420Y-79952204D01*
X185340990Y-79999264D01*
X185270563Y-80046322D01*
X185114053Y-80111151D01*
X185030978Y-80127675D01*
X184947904Y-80144200D01*
X184778496Y-80144200D01*
X184695422Y-80127675D01*
X184612347Y-80111151D01*
X184455837Y-80046322D01*
X184385409Y-79999263D01*
X184314980Y-79952204D01*
X184195196Y-79832420D01*
X184101077Y-79691561D01*
X184036249Y-79535052D01*
X184003200Y-79368904D01*
X184003200Y-79199496D01*
X184036249Y-79033348D01*
X184101077Y-78876839D01*
X184195196Y-78735980D01*
X184314980Y-78616196D01*
X184453727Y-78523488D01*
X184455837Y-78522078D01*
X184612347Y-78457249D01*
X184695422Y-78440725D01*
X184778496Y-78424200D01*
X184947904Y-78424200D01*
X185030978Y-78440724D01*
X185030978Y-78440724D01*
G37*
G36*
X218939978Y-78440724D02*
X219023053Y-78457249D01*
X219179563Y-78522078D01*
X219181673Y-78523488D01*
X219320420Y-78616196D01*
X219440204Y-78735980D01*
X219534323Y-78876839D01*
X219599151Y-79033348D01*
X219632200Y-79199496D01*
X219632200Y-79368904D01*
X219599151Y-79535052D01*
X219534323Y-79691561D01*
X219440204Y-79832420D01*
X219320420Y-79952204D01*
X219249990Y-79999264D01*
X219179563Y-80046322D01*
X219023053Y-80111151D01*
X218939978Y-80127675D01*
X218856904Y-80144200D01*
X218687496Y-80144200D01*
X218604422Y-80127675D01*
X218521347Y-80111151D01*
X218364837Y-80046322D01*
X218294409Y-79999263D01*
X218223980Y-79952204D01*
X218104196Y-79832420D01*
X218010077Y-79691561D01*
X217945249Y-79535052D01*
X217912200Y-79368904D01*
X217912200Y-79199496D01*
X217945249Y-79033348D01*
X218010077Y-78876839D01*
X218104196Y-78735980D01*
X218223980Y-78616196D01*
X218362727Y-78523488D01*
X218364837Y-78522078D01*
X218521347Y-78457249D01*
X218604422Y-78440725D01*
X218687496Y-78424200D01*
X218856904Y-78424200D01*
X218939978Y-78440724D01*
X218939978Y-78440724D01*
G37*
G36*
X159285391Y-77954586D02*
X159449179Y-78022429D01*
X159596590Y-78120926D01*
X159721944Y-78246280D01*
X159820441Y-78393691D01*
X159888284Y-78557479D01*
X159922870Y-78731356D01*
X159922870Y-78908644D01*
X159888284Y-79082521D01*
X159820441Y-79246309D01*
X159721944Y-79393720D01*
X159596590Y-79519074D01*
X159449179Y-79617571D01*
X159285391Y-79685414D01*
X159111514Y-79720000D01*
X158934226Y-79720000D01*
X158760349Y-79685414D01*
X158596561Y-79617571D01*
X158449150Y-79519074D01*
X158323796Y-79393720D01*
X158225299Y-79246309D01*
X158157456Y-79082521D01*
X158122870Y-78908644D01*
X158122870Y-78731356D01*
X158157456Y-78557479D01*
X158225299Y-78393691D01*
X158323796Y-78246280D01*
X158449150Y-78120926D01*
X158596561Y-78022429D01*
X158760349Y-77954586D01*
X158934226Y-77920000D01*
X159111514Y-77920000D01*
X159285391Y-77954586D01*
X159285391Y-77954586D01*
G37*
G36*
X155399191Y-77954586D02*
X155562979Y-78022429D01*
X155710390Y-78120926D01*
X155835744Y-78246280D01*
X155934241Y-78393691D01*
X156002084Y-78557479D01*
X156036670Y-78731356D01*
X156036670Y-78908644D01*
X156002084Y-79082521D01*
X155934241Y-79246309D01*
X155835744Y-79393720D01*
X155710390Y-79519074D01*
X155562979Y-79617571D01*
X155399191Y-79685414D01*
X155225314Y-79720000D01*
X155048026Y-79720000D01*
X154874149Y-79685414D01*
X154710361Y-79617571D01*
X154562950Y-79519074D01*
X154437596Y-79393720D01*
X154339099Y-79246309D01*
X154271256Y-79082521D01*
X154236670Y-78908644D01*
X154236670Y-78731356D01*
X154271256Y-78557479D01*
X154339099Y-78393691D01*
X154437596Y-78246280D01*
X154562950Y-78120926D01*
X154710361Y-78022429D01*
X154874149Y-77954586D01*
X155048026Y-77920000D01*
X155225314Y-77920000D01*
X155399191Y-77954586D01*
X155399191Y-77954586D01*
G37*
G36*
X147193845Y-76742401D02*
X147438896Y-76816736D01*
X147664736Y-76937451D01*
X147862687Y-77099904D01*
X148025140Y-77297855D01*
X148145855Y-77523695D01*
X148220190Y-77768746D01*
X148245290Y-78023591D01*
X148220190Y-78278436D01*
X148145855Y-78523487D01*
X148025140Y-78749327D01*
X147862687Y-78947278D01*
X147664736Y-79109731D01*
X147438896Y-79230446D01*
X147193845Y-79304781D01*
X147002864Y-79323591D01*
X146875136Y-79323591D01*
X146684155Y-79304781D01*
X146439104Y-79230446D01*
X146213264Y-79109731D01*
X146015313Y-78947278D01*
X145852860Y-78749327D01*
X145732145Y-78523487D01*
X145657810Y-78278436D01*
X145632710Y-78023591D01*
X145657810Y-77768746D01*
X145732145Y-77523695D01*
X145852860Y-77297855D01*
X146015313Y-77099904D01*
X146213264Y-76937451D01*
X146439104Y-76816736D01*
X146684155Y-76742401D01*
X146875136Y-76723591D01*
X147002864Y-76723591D01*
X147193845Y-76742401D01*
X147193845Y-76742401D01*
G37*
G36*
X149625857Y-71014772D02*
X149826042Y-71097691D01*
X149826045Y-71097693D01*
X150005413Y-71217543D01*
X150006213Y-71218078D01*
X150159422Y-71371287D01*
X150279809Y-71551458D01*
X150362728Y-71751643D01*
X150405000Y-71964158D01*
X150405000Y-72180842D01*
X150362728Y-72393357D01*
X150279809Y-72593542D01*
X150159422Y-72773713D01*
X150006213Y-72926922D01*
X149826042Y-73047309D01*
X149625857Y-73130228D01*
X149413342Y-73172500D01*
X149196658Y-73172500D01*
X148984143Y-73130228D01*
X148783958Y-73047309D01*
X148603787Y-72926922D01*
X148450578Y-72773713D01*
X148330191Y-72593542D01*
X148247272Y-72393357D01*
X148205000Y-72180842D01*
X148205000Y-71964158D01*
X148247272Y-71751643D01*
X148330191Y-71551458D01*
X148450578Y-71371287D01*
X148603787Y-71218078D01*
X148604588Y-71217543D01*
X148783955Y-71097693D01*
X148783958Y-71097691D01*
X148984143Y-71014772D01*
X149196658Y-70972500D01*
X149413342Y-70972500D01*
X149625857Y-71014772D01*
X149625857Y-71014772D01*
G37*
G36*
X144991000Y-73172500D02*
X142791000Y-73172500D01*
X142791000Y-70972500D01*
X144991000Y-70972500D01*
X144991000Y-73172500D01*
X144991000Y-73172500D01*
G37*
G36*
X139211857Y-71014772D02*
X139412042Y-71097691D01*
X139412045Y-71097693D01*
X139591413Y-71217543D01*
X139592213Y-71218078D01*
X139745422Y-71371287D01*
X139865809Y-71551458D01*
X139948728Y-71751643D01*
X139991000Y-71964158D01*
X139991000Y-72180842D01*
X139948728Y-72393357D01*
X139865809Y-72593542D01*
X139745422Y-72773713D01*
X139592213Y-72926922D01*
X139412042Y-73047309D01*
X139211857Y-73130228D01*
X138999342Y-73172500D01*
X138782658Y-73172500D01*
X138570143Y-73130228D01*
X138369958Y-73047309D01*
X138189787Y-72926922D01*
X138036578Y-72773713D01*
X137916191Y-72593542D01*
X137833272Y-72393357D01*
X137791000Y-72180842D01*
X137791000Y-71964158D01*
X137833272Y-71751643D01*
X137916191Y-71551458D01*
X138036578Y-71371287D01*
X138189787Y-71218078D01*
X138190588Y-71217543D01*
X138369955Y-71097693D01*
X138369958Y-71097691D01*
X138570143Y-71014772D01*
X138782658Y-70972500D01*
X138999342Y-70972500D01*
X139211857Y-71014772D01*
X139211857Y-71014772D01*
G37*
G36*
X155405000Y-73172500D02*
X153205000Y-73172500D01*
X153205000Y-70972500D01*
X155405000Y-70972500D01*
X155405000Y-73172500D01*
X155405000Y-73172500D01*
G37*
G36*
X159860759Y-66807577D02*
X160201270Y-66875309D01*
X160628943Y-67052457D01*
X161013838Y-67309636D01*
X161341164Y-67636962D01*
X161598343Y-68021857D01*
X161775491Y-68449530D01*
X161865800Y-68903545D01*
X161865800Y-69366455D01*
X161775491Y-69820470D01*
X161598343Y-70248143D01*
X161341164Y-70633038D01*
X161013838Y-70960364D01*
X160628943Y-71217543D01*
X160201270Y-71394691D01*
X159860759Y-71462423D01*
X159747256Y-71485000D01*
X159284344Y-71485000D01*
X159170841Y-71462423D01*
X158830330Y-71394691D01*
X158402657Y-71217543D01*
X158017762Y-70960364D01*
X157690436Y-70633038D01*
X157433257Y-70248143D01*
X157256109Y-69820470D01*
X157165800Y-69366455D01*
X157165800Y-68903545D01*
X157256109Y-68449530D01*
X157433257Y-68021857D01*
X157690436Y-67636962D01*
X158017762Y-67309636D01*
X158402657Y-67052457D01*
X158830330Y-66875309D01*
X159170841Y-66807577D01*
X159284344Y-66785000D01*
X159747256Y-66785000D01*
X159860759Y-66807577D01*
X159860759Y-66807577D01*
G37*
G36*
X195260759Y-66807577D02*
X195601270Y-66875309D01*
X196028943Y-67052457D01*
X196413838Y-67309636D01*
X196741164Y-67636962D01*
X196998343Y-68021857D01*
X197175491Y-68449530D01*
X197265800Y-68903545D01*
X197265800Y-69366455D01*
X197175491Y-69820470D01*
X196998343Y-70248143D01*
X196741164Y-70633038D01*
X196413838Y-70960364D01*
X196028943Y-71217543D01*
X195601270Y-71394691D01*
X195260759Y-71462423D01*
X195147256Y-71485000D01*
X194684344Y-71485000D01*
X194570841Y-71462423D01*
X194230330Y-71394691D01*
X193802657Y-71217543D01*
X193417762Y-70960364D01*
X193090436Y-70633038D01*
X192833257Y-70248143D01*
X192656109Y-69820470D01*
X192565800Y-69366455D01*
X192565800Y-68903545D01*
X192656109Y-68449530D01*
X192833257Y-68021857D01*
X193090436Y-67636962D01*
X193417762Y-67309636D01*
X193802657Y-67052457D01*
X194230330Y-66875309D01*
X194570841Y-66807577D01*
X194684344Y-66785000D01*
X195147256Y-66785000D01*
X195260759Y-66807577D01*
X195260759Y-66807577D01*
G37*
G36*
X168588321Y-69299586D02*
X168752109Y-69367429D01*
X168899520Y-69465926D01*
X169024874Y-69591280D01*
X169123371Y-69738691D01*
X169191214Y-69902479D01*
X169225800Y-70076356D01*
X169225800Y-70253644D01*
X169191214Y-70427521D01*
X169123371Y-70591309D01*
X169024874Y-70738720D01*
X168899520Y-70864074D01*
X168752109Y-70962571D01*
X168588321Y-71030414D01*
X168414444Y-71065000D01*
X168237156Y-71065000D01*
X168063279Y-71030414D01*
X167899491Y-70962571D01*
X167752080Y-70864074D01*
X167626726Y-70738720D01*
X167528229Y-70591309D01*
X167460386Y-70427521D01*
X167425800Y-70253644D01*
X167425800Y-70076356D01*
X167460386Y-69902479D01*
X167528229Y-69738691D01*
X167626726Y-69591280D01*
X167752080Y-69465926D01*
X167899491Y-69367429D01*
X168063279Y-69299586D01*
X168237156Y-69265000D01*
X168414444Y-69265000D01*
X168588321Y-69299586D01*
X168588321Y-69299586D01*
G37*
G36*
X166048321Y-69299586D02*
X166212109Y-69367429D01*
X166359520Y-69465926D01*
X166484874Y-69591280D01*
X166583371Y-69738691D01*
X166651214Y-69902479D01*
X166685800Y-70076356D01*
X166685800Y-70253644D01*
X166651214Y-70427521D01*
X166583371Y-70591309D01*
X166484874Y-70738720D01*
X166359520Y-70864074D01*
X166212109Y-70962571D01*
X166048321Y-71030414D01*
X165874444Y-71065000D01*
X165697156Y-71065000D01*
X165523279Y-71030414D01*
X165359491Y-70962571D01*
X165212080Y-70864074D01*
X165086726Y-70738720D01*
X164988229Y-70591309D01*
X164920386Y-70427521D01*
X164885800Y-70253644D01*
X164885800Y-70076356D01*
X164920386Y-69902479D01*
X164988229Y-69738691D01*
X165086726Y-69591280D01*
X165212080Y-69465926D01*
X165359491Y-69367429D01*
X165523279Y-69299586D01*
X165697156Y-69265000D01*
X165874444Y-69265000D01*
X166048321Y-69299586D01*
X166048321Y-69299586D01*
G37*
G36*
X138987432Y-64835522D02*
X139157081Y-64886985D01*
X139313433Y-64970556D01*
X139450475Y-65083025D01*
X139562944Y-65220067D01*
X139646515Y-65376419D01*
X139697978Y-65546068D01*
X139715354Y-65722500D01*
X139697978Y-65898932D01*
X139646515Y-66068581D01*
X139562944Y-66224933D01*
X139450475Y-66361975D01*
X139313433Y-66474444D01*
X139157081Y-66558015D01*
X138987432Y-66609478D01*
X138855211Y-66622500D01*
X138766789Y-66622500D01*
X138634568Y-66609478D01*
X138464919Y-66558015D01*
X138308567Y-66474444D01*
X138171525Y-66361975D01*
X138059056Y-66224933D01*
X137975485Y-66068581D01*
X137924022Y-65898932D01*
X137906646Y-65722500D01*
X137924022Y-65546068D01*
X137975485Y-65376419D01*
X138059056Y-65220067D01*
X138171525Y-65083025D01*
X138308567Y-64970556D01*
X138464919Y-64886985D01*
X138634568Y-64835522D01*
X138766789Y-64822500D01*
X138855211Y-64822500D01*
X138987432Y-64835522D01*
X138987432Y-64835522D01*
G37*
G36*
X141527432Y-64835522D02*
X141697081Y-64886985D01*
X141853433Y-64970556D01*
X141990475Y-65083025D01*
X142102944Y-65220067D01*
X142186515Y-65376419D01*
X142237978Y-65546068D01*
X142255354Y-65722500D01*
X142237978Y-65898932D01*
X142186515Y-66068581D01*
X142102944Y-66224933D01*
X141990475Y-66361975D01*
X141853433Y-66474444D01*
X141697081Y-66558015D01*
X141527432Y-66609478D01*
X141395211Y-66622500D01*
X141306789Y-66622500D01*
X141174568Y-66609478D01*
X141004919Y-66558015D01*
X140848567Y-66474444D01*
X140711525Y-66361975D01*
X140599056Y-66224933D01*
X140515485Y-66068581D01*
X140464022Y-65898932D01*
X140446646Y-65722500D01*
X140464022Y-65546068D01*
X140515485Y-65376419D01*
X140599056Y-65220067D01*
X140711525Y-65083025D01*
X140848567Y-64970556D01*
X141004919Y-64886985D01*
X141174568Y-64835522D01*
X141306789Y-64822500D01*
X141395211Y-64822500D01*
X141527432Y-64835522D01*
X141527432Y-64835522D01*
G37*
G36*
X146607432Y-64835522D02*
X146777081Y-64886985D01*
X146933433Y-64970556D01*
X147070475Y-65083025D01*
X147182944Y-65220067D01*
X147266515Y-65376419D01*
X147317978Y-65546068D01*
X147335354Y-65722500D01*
X147317978Y-65898932D01*
X147266515Y-66068581D01*
X147182944Y-66224933D01*
X147070475Y-66361975D01*
X146933433Y-66474444D01*
X146777081Y-66558015D01*
X146607432Y-66609478D01*
X146475211Y-66622500D01*
X146386789Y-66622500D01*
X146254568Y-66609478D01*
X146084919Y-66558015D01*
X145928567Y-66474444D01*
X145791525Y-66361975D01*
X145679056Y-66224933D01*
X145595485Y-66068581D01*
X145544022Y-65898932D01*
X145526646Y-65722500D01*
X145544022Y-65546068D01*
X145595485Y-65376419D01*
X145679056Y-65220067D01*
X145791525Y-65083025D01*
X145928567Y-64970556D01*
X146084919Y-64886985D01*
X146254568Y-64835522D01*
X146386789Y-64822500D01*
X146475211Y-64822500D01*
X146607432Y-64835522D01*
X146607432Y-64835522D01*
G37*
G36*
X144067432Y-64835522D02*
X144237081Y-64886985D01*
X144393433Y-64970556D01*
X144530475Y-65083025D01*
X144642944Y-65220067D01*
X144726515Y-65376419D01*
X144777978Y-65546068D01*
X144795354Y-65722500D01*
X144777978Y-65898932D01*
X144726515Y-66068581D01*
X144642944Y-66224933D01*
X144530475Y-66361975D01*
X144393433Y-66474444D01*
X144237081Y-66558015D01*
X144067432Y-66609478D01*
X143935211Y-66622500D01*
X143846789Y-66622500D01*
X143714568Y-66609478D01*
X143544919Y-66558015D01*
X143388567Y-66474444D01*
X143251525Y-66361975D01*
X143139056Y-66224933D01*
X143055485Y-66068581D01*
X143004022Y-65898932D01*
X142986646Y-65722500D01*
X143004022Y-65546068D01*
X143055485Y-65376419D01*
X143139056Y-65220067D01*
X143251525Y-65083025D01*
X143388567Y-64970556D01*
X143544919Y-64886985D01*
X143714568Y-64835522D01*
X143846789Y-64822500D01*
X143935211Y-64822500D01*
X144067432Y-64835522D01*
X144067432Y-64835522D01*
G37*
G36*
X138987432Y-57215522D02*
X139157081Y-57266985D01*
X139313433Y-57350556D01*
X139450475Y-57463025D01*
X139562944Y-57600067D01*
X139646515Y-57756419D01*
X139697978Y-57926068D01*
X139715354Y-58102500D01*
X139697978Y-58278932D01*
X139646515Y-58448581D01*
X139562944Y-58604933D01*
X139450475Y-58741975D01*
X139313433Y-58854444D01*
X139157081Y-58938015D01*
X138987432Y-58989478D01*
X138855211Y-59002500D01*
X138766789Y-59002500D01*
X138634568Y-58989478D01*
X138464919Y-58938015D01*
X138308567Y-58854444D01*
X138171525Y-58741975D01*
X138059056Y-58604933D01*
X137975485Y-58448581D01*
X137924022Y-58278932D01*
X137906646Y-58102500D01*
X137924022Y-57926068D01*
X137975485Y-57756419D01*
X138059056Y-57600067D01*
X138171525Y-57463025D01*
X138308567Y-57350556D01*
X138464919Y-57266985D01*
X138634568Y-57215522D01*
X138766789Y-57202500D01*
X138855211Y-57202500D01*
X138987432Y-57215522D01*
X138987432Y-57215522D01*
G37*
G36*
X147331000Y-59002500D02*
X145531000Y-59002500D01*
X145531000Y-57202500D01*
X147331000Y-57202500D01*
X147331000Y-59002500D01*
X147331000Y-59002500D01*
G37*
G36*
X141527432Y-57215522D02*
X141697081Y-57266985D01*
X141853433Y-57350556D01*
X141990475Y-57463025D01*
X142102944Y-57600067D01*
X142186515Y-57756419D01*
X142237978Y-57926068D01*
X142255354Y-58102500D01*
X142237978Y-58278932D01*
X142186515Y-58448581D01*
X142102944Y-58604933D01*
X141990475Y-58741975D01*
X141853433Y-58854444D01*
X141697081Y-58938015D01*
X141527432Y-58989478D01*
X141395211Y-59002500D01*
X141306789Y-59002500D01*
X141174568Y-58989478D01*
X141004919Y-58938015D01*
X140848567Y-58854444D01*
X140711525Y-58741975D01*
X140599056Y-58604933D01*
X140515485Y-58448581D01*
X140464022Y-58278932D01*
X140446646Y-58102500D01*
X140464022Y-57926068D01*
X140515485Y-57756419D01*
X140599056Y-57600067D01*
X140711525Y-57463025D01*
X140848567Y-57350556D01*
X141004919Y-57266985D01*
X141174568Y-57215522D01*
X141306789Y-57202500D01*
X141395211Y-57202500D01*
X141527432Y-57215522D01*
X141527432Y-57215522D01*
G37*
G36*
X144067432Y-57215522D02*
X144237081Y-57266985D01*
X144393433Y-57350556D01*
X144530475Y-57463025D01*
X144642944Y-57600067D01*
X144726515Y-57756419D01*
X144777978Y-57926068D01*
X144795354Y-58102500D01*
X144777978Y-58278932D01*
X144726515Y-58448581D01*
X144642944Y-58604933D01*
X144530475Y-58741975D01*
X144393433Y-58854444D01*
X144237081Y-58938015D01*
X144067432Y-58989478D01*
X143935211Y-59002500D01*
X143846789Y-59002500D01*
X143714568Y-58989478D01*
X143544919Y-58938015D01*
X143388567Y-58854444D01*
X143251525Y-58741975D01*
X143139056Y-58604933D01*
X143055485Y-58448581D01*
X143004022Y-58278932D01*
X142986646Y-58102500D01*
X143004022Y-57926068D01*
X143055485Y-57756419D01*
X143139056Y-57600067D01*
X143251525Y-57463025D01*
X143388567Y-57350556D01*
X143544919Y-57266985D01*
X143714568Y-57215522D01*
X143846789Y-57202500D01*
X143935211Y-57202500D01*
X144067432Y-57215522D01*
X144067432Y-57215522D01*
G37*
G36*
X142208326Y-49896800D02*
X142343565Y-49923701D01*
X142598349Y-50029236D01*
X142824597Y-50180411D01*
X142827651Y-50182451D01*
X143022649Y-50377449D01*
X143175865Y-50606753D01*
X143281399Y-50861536D01*
X143335200Y-51132011D01*
X143335200Y-51407789D01*
X143281399Y-51678264D01*
X143175865Y-51933047D01*
X143022649Y-52162351D01*
X142827651Y-52357349D01*
X142827648Y-52357351D01*
X142598349Y-52510564D01*
X142343565Y-52616099D01*
X142208326Y-52643000D01*
X142073089Y-52669900D01*
X141797311Y-52669900D01*
X141662073Y-52642999D01*
X141526835Y-52616099D01*
X141272051Y-52510564D01*
X141042752Y-52357351D01*
X141042749Y-52357349D01*
X140847751Y-52162351D01*
X140694535Y-51933047D01*
X140589001Y-51678264D01*
X140535200Y-51407789D01*
X140535200Y-51132011D01*
X140589001Y-50861536D01*
X140694535Y-50606753D01*
X140847751Y-50377449D01*
X141042749Y-50182451D01*
X141045803Y-50180411D01*
X141272051Y-50029236D01*
X141526835Y-49923701D01*
X141662074Y-49896800D01*
X141797311Y-49869900D01*
X142073089Y-49869900D01*
X142208326Y-49896800D01*
X142208326Y-49896800D01*
G37*
G36*
X142208326Y-44896800D02*
X142343565Y-44923701D01*
X142598349Y-45029236D01*
X142824597Y-45180411D01*
X142827651Y-45182451D01*
X143022649Y-45377449D01*
X143175865Y-45606753D01*
X143281399Y-45861536D01*
X143335200Y-46132011D01*
X143335200Y-46407789D01*
X143281399Y-46678264D01*
X143175865Y-46933047D01*
X143022649Y-47162351D01*
X142827651Y-47357349D01*
X142827648Y-47357351D01*
X142598349Y-47510564D01*
X142343565Y-47616099D01*
X142208326Y-47643000D01*
X142073089Y-47669900D01*
X141797311Y-47669900D01*
X141662074Y-47643000D01*
X141526835Y-47616099D01*
X141272051Y-47510564D01*
X141042752Y-47357351D01*
X141042749Y-47357349D01*
X140847751Y-47162351D01*
X140694535Y-46933047D01*
X140589001Y-46678264D01*
X140535200Y-46407789D01*
X140535200Y-46132011D01*
X140589001Y-45861536D01*
X140694535Y-45606753D01*
X140847751Y-45377449D01*
X141042749Y-45182451D01*
X141045803Y-45180411D01*
X141272051Y-45029236D01*
X141526835Y-44923701D01*
X141662073Y-44896801D01*
X141797311Y-44869900D01*
X142073089Y-44869900D01*
X142208326Y-44896800D01*
X142208326Y-44896800D01*
G37*
G36*
X230794600Y-45806400D02*
X228894600Y-45806400D01*
X228894600Y-43906400D01*
X230794600Y-43906400D01*
X230794600Y-45806400D01*
X230794600Y-45806400D01*
G37*
G36*
X226233857Y-41639672D02*
X226434042Y-41722591D01*
X226614213Y-41842978D01*
X226767422Y-41996187D01*
X226887809Y-42176358D01*
X226970728Y-42376543D01*
X227013000Y-42589058D01*
X227013000Y-42805742D01*
X226970728Y-43018257D01*
X226887809Y-43218442D01*
X226767422Y-43398613D01*
X226614213Y-43551822D01*
X226434042Y-43672209D01*
X226233857Y-43755128D01*
X226021342Y-43797400D01*
X225804658Y-43797400D01*
X225592143Y-43755128D01*
X225391958Y-43672209D01*
X225211787Y-43551822D01*
X225058578Y-43398613D01*
X224938191Y-43218442D01*
X224855272Y-43018257D01*
X224813000Y-42805742D01*
X224813000Y-42589058D01*
X224855272Y-42376543D01*
X224938191Y-42176358D01*
X225058578Y-41996187D01*
X225211787Y-41842978D01*
X225391958Y-41722591D01*
X225592143Y-41639672D01*
X225804658Y-41597400D01*
X226021342Y-41597400D01*
X226233857Y-41639672D01*
X226233857Y-41639672D01*
G37*
G36*
X219413000Y-43797400D02*
X217213000Y-43797400D01*
X217213000Y-41597400D01*
X219413000Y-41597400D01*
X219413000Y-43797400D01*
X219413000Y-43797400D01*
G37*
G36*
X229961048Y-41373273D02*
X230030832Y-41380146D01*
X230120370Y-41407307D01*
X230209909Y-41434468D01*
X230374947Y-41522683D01*
X230519601Y-41641399D01*
X230638317Y-41786053D01*
X230726532Y-41951091D01*
X230740213Y-41996191D01*
X230780854Y-42130168D01*
X230799196Y-42316400D01*
X230784354Y-42467100D01*
X230780854Y-42502631D01*
X230726532Y-42681709D01*
X230638317Y-42846747D01*
X230519601Y-42991401D01*
X230374947Y-43110117D01*
X230209909Y-43198332D01*
X230143614Y-43218442D01*
X230030832Y-43252654D01*
X229891266Y-43266400D01*
X229797934Y-43266400D01*
X229728152Y-43259527D01*
X229658368Y-43252654D01*
X229545586Y-43218442D01*
X229479291Y-43198332D01*
X229314253Y-43110117D01*
X229169599Y-42991401D01*
X229050883Y-42846747D01*
X228962668Y-42681709D01*
X228908346Y-42502631D01*
X228904847Y-42467100D01*
X228890004Y-42316400D01*
X228908346Y-42130168D01*
X228948987Y-41996191D01*
X228962668Y-41951091D01*
X229050883Y-41786053D01*
X229169599Y-41641399D01*
X229314253Y-41522683D01*
X229479291Y-41434468D01*
X229568830Y-41407307D01*
X229658368Y-41380146D01*
X229728152Y-41373273D01*
X229797934Y-41366400D01*
X229891266Y-41366400D01*
X229961048Y-41373273D01*
X229961048Y-41373273D01*
G37*
G36*
X139787200Y-42467100D02*
X137987200Y-42467100D01*
X137987200Y-40667100D01*
X139787200Y-40667100D01*
X139787200Y-42467100D01*
X139787200Y-42467100D01*
G37*
G36*
X145095221Y-39431686D02*
X145259009Y-39499529D01*
X145406420Y-39598026D01*
X145531774Y-39723380D01*
X145630271Y-39870791D01*
X145698114Y-40034579D01*
X145732700Y-40208456D01*
X145732700Y-40385744D01*
X145698114Y-40559621D01*
X145630271Y-40723409D01*
X145531774Y-40870820D01*
X145406420Y-40996174D01*
X145259009Y-41094671D01*
X145095221Y-41162514D01*
X144921344Y-41197100D01*
X144744056Y-41197100D01*
X144570179Y-41162514D01*
X144406391Y-41094671D01*
X144258980Y-40996174D01*
X144133626Y-40870820D01*
X144035129Y-40723409D01*
X143967286Y-40559621D01*
X143932700Y-40385744D01*
X143932700Y-40208456D01*
X143967286Y-40034579D01*
X144035129Y-39870791D01*
X144133626Y-39723380D01*
X144258980Y-39598026D01*
X144406391Y-39499529D01*
X144570179Y-39431686D01*
X144744056Y-39397100D01*
X144921344Y-39397100D01*
X145095221Y-39431686D01*
X145095221Y-39431686D01*
G37*
G36*
X148232700Y-41197100D02*
X146432700Y-41197100D01*
X146432700Y-39397100D01*
X148232700Y-39397100D01*
X148232700Y-41197100D01*
X148232700Y-41197100D01*
G37*
G36*
X229961048Y-38833273D02*
X230030832Y-38840146D01*
X230120370Y-38867307D01*
X230209909Y-38894468D01*
X230374947Y-38982683D01*
X230519601Y-39101399D01*
X230638317Y-39246053D01*
X230726532Y-39411091D01*
X230726532Y-39411092D01*
X230780854Y-39590168D01*
X230799196Y-39776400D01*
X230780854Y-39962632D01*
X230759029Y-40034579D01*
X230726532Y-40141709D01*
X230638317Y-40306747D01*
X230519601Y-40451401D01*
X230374947Y-40570117D01*
X230209909Y-40658332D01*
X230181004Y-40667100D01*
X230030832Y-40712654D01*
X229891266Y-40726400D01*
X229797934Y-40726400D01*
X229658368Y-40712654D01*
X229508196Y-40667100D01*
X229479291Y-40658332D01*
X229314253Y-40570117D01*
X229169599Y-40451401D01*
X229050883Y-40306747D01*
X228962668Y-40141709D01*
X228930171Y-40034579D01*
X228908346Y-39962632D01*
X228890004Y-39776400D01*
X228908346Y-39590168D01*
X228962668Y-39411092D01*
X228962668Y-39411091D01*
X229050883Y-39246053D01*
X229169599Y-39101399D01*
X229314253Y-38982683D01*
X229479291Y-38894468D01*
X229568830Y-38867307D01*
X229658368Y-38840146D01*
X229797934Y-38826400D01*
X229891266Y-38826400D01*
X229961048Y-38833273D01*
X229961048Y-38833273D01*
G37*
G36*
X139149721Y-38201686D02*
X139313509Y-38269529D01*
X139460920Y-38368026D01*
X139586274Y-38493380D01*
X139684771Y-38640791D01*
X139752614Y-38804579D01*
X139787200Y-38978456D01*
X139787200Y-39155744D01*
X139752614Y-39329621D01*
X139684771Y-39493409D01*
X139586274Y-39640820D01*
X139460920Y-39766174D01*
X139313509Y-39864671D01*
X139149721Y-39932514D01*
X138975844Y-39967100D01*
X138798556Y-39967100D01*
X138624679Y-39932514D01*
X138460891Y-39864671D01*
X138313480Y-39766174D01*
X138188126Y-39640820D01*
X138089629Y-39493409D01*
X138021786Y-39329621D01*
X137987200Y-39155744D01*
X137987200Y-38978456D01*
X138021786Y-38804579D01*
X138089629Y-38640791D01*
X138188126Y-38493380D01*
X138313480Y-38368026D01*
X138460891Y-38269529D01*
X138624679Y-38201686D01*
X138798556Y-38167100D01*
X138975844Y-38167100D01*
X139149721Y-38201686D01*
X139149721Y-38201686D01*
G37*
G36*
X159860759Y-31407577D02*
X160201270Y-31475309D01*
X160628943Y-31652457D01*
X161013838Y-31909636D01*
X161341164Y-32236962D01*
X161598343Y-32621857D01*
X161775491Y-33049530D01*
X161865800Y-33503545D01*
X161865800Y-33966455D01*
X161775491Y-34420470D01*
X161598343Y-34848143D01*
X161341164Y-35233038D01*
X161013838Y-35560364D01*
X160628943Y-35817543D01*
X160201270Y-35994691D01*
X159860759Y-36062423D01*
X159747256Y-36085000D01*
X159284344Y-36085000D01*
X159170841Y-36062423D01*
X158830330Y-35994691D01*
X158402657Y-35817543D01*
X158017762Y-35560364D01*
X157690436Y-35233038D01*
X157433257Y-34848143D01*
X157256109Y-34420470D01*
X157165800Y-33966455D01*
X157165800Y-33503545D01*
X157256109Y-33049530D01*
X157433257Y-32621857D01*
X157690436Y-32236962D01*
X158017762Y-31909636D01*
X158402657Y-31652457D01*
X158830330Y-31475309D01*
X159170841Y-31407577D01*
X159284344Y-31385000D01*
X159747256Y-31385000D01*
X159860759Y-31407577D01*
X159860759Y-31407577D01*
G37*
G36*
X195260759Y-31407577D02*
X195601270Y-31475309D01*
X196028943Y-31652457D01*
X196413838Y-31909636D01*
X196741164Y-32236962D01*
X196998343Y-32621857D01*
X197175491Y-33049530D01*
X197265800Y-33503545D01*
X197265800Y-33966455D01*
X197175491Y-34420470D01*
X196998343Y-34848143D01*
X196741164Y-35233038D01*
X196413838Y-35560364D01*
X196028943Y-35817543D01*
X195601270Y-35994691D01*
X195260759Y-36062423D01*
X195147256Y-36085000D01*
X194684344Y-36085000D01*
X194570841Y-36062423D01*
X194230330Y-35994691D01*
X193802657Y-35817543D01*
X193417762Y-35560364D01*
X193090436Y-35233038D01*
X192833257Y-34848143D01*
X192656109Y-34420470D01*
X192565800Y-33966455D01*
X192565800Y-33503545D01*
X192656109Y-33049530D01*
X192833257Y-32621857D01*
X193090436Y-32236962D01*
X193417762Y-31909636D01*
X193802657Y-31652457D01*
X194230330Y-31475309D01*
X194570841Y-31407577D01*
X194684344Y-31385000D01*
X195147256Y-31385000D01*
X195260759Y-31407577D01*
X195260759Y-31407577D01*
G37*
G36*
X168588321Y-31839586D02*
X168752109Y-31907429D01*
X168899520Y-32005926D01*
X169024874Y-32131280D01*
X169123371Y-32278691D01*
X169191214Y-32442479D01*
X169225800Y-32616356D01*
X169225800Y-32793644D01*
X169191214Y-32967521D01*
X169123371Y-33131309D01*
X169024874Y-33278720D01*
X168899520Y-33404074D01*
X168752109Y-33502571D01*
X168588321Y-33570414D01*
X168414444Y-33605000D01*
X168237156Y-33605000D01*
X168063279Y-33570414D01*
X167899491Y-33502571D01*
X167752080Y-33404074D01*
X167626726Y-33278720D01*
X167528229Y-33131309D01*
X167460386Y-32967521D01*
X167425800Y-32793644D01*
X167425800Y-32616356D01*
X167460386Y-32442479D01*
X167528229Y-32278691D01*
X167626726Y-32131280D01*
X167752080Y-32005926D01*
X167899491Y-31907429D01*
X168063279Y-31839586D01*
X168237156Y-31805000D01*
X168414444Y-31805000D01*
X168588321Y-31839586D01*
X168588321Y-31839586D01*
G37*
G36*
X166048321Y-31839586D02*
X166212109Y-31907429D01*
X166359520Y-32005926D01*
X166484874Y-32131280D01*
X166583371Y-32278691D01*
X166651214Y-32442479D01*
X166685800Y-32616356D01*
X166685800Y-32793644D01*
X166651214Y-32967521D01*
X166583371Y-33131309D01*
X166484874Y-33278720D01*
X166359520Y-33404074D01*
X166212109Y-33502571D01*
X166048321Y-33570414D01*
X165874444Y-33605000D01*
X165697156Y-33605000D01*
X165523279Y-33570414D01*
X165359491Y-33502571D01*
X165212080Y-33404074D01*
X165086726Y-33278720D01*
X164988229Y-33131309D01*
X164920386Y-32967521D01*
X164885800Y-32793644D01*
X164885800Y-32616356D01*
X164920386Y-32442479D01*
X164988229Y-32278691D01*
X165086726Y-32131280D01*
X165212080Y-32005926D01*
X165359491Y-31907429D01*
X165523279Y-31839586D01*
X165697156Y-31805000D01*
X165874444Y-31805000D01*
X166048321Y-31839586D01*
X166048321Y-31839586D01*
G37*
G36*
X164626800Y-29829000D02*
X162626800Y-29829000D01*
X162626800Y-27829000D01*
X164626800Y-27829000D01*
X164626800Y-29829000D01*
X164626800Y-29829000D01*
G37*
G36*
X208799593Y-27842029D02*
X208927289Y-27867429D01*
X209109278Y-27942811D01*
X209273063Y-28052249D01*
X209412351Y-28191537D01*
X209521789Y-28355322D01*
X209597171Y-28537311D01*
X209620228Y-28653230D01*
X209630548Y-28705107D01*
X209635600Y-28730509D01*
X209635600Y-28927491D01*
X209597171Y-29120689D01*
X209521789Y-29302678D01*
X209412351Y-29466463D01*
X209273063Y-29605751D01*
X209109278Y-29715189D01*
X208927289Y-29790571D01*
X208811370Y-29813628D01*
X208734093Y-29829000D01*
X208537107Y-29829000D01*
X208459830Y-29813628D01*
X208343911Y-29790571D01*
X208161922Y-29715189D01*
X207998137Y-29605751D01*
X207858849Y-29466463D01*
X207749411Y-29302678D01*
X207674029Y-29120689D01*
X207635600Y-28927491D01*
X207635600Y-28730509D01*
X207640653Y-28705107D01*
X207650972Y-28653230D01*
X207674029Y-28537311D01*
X207749411Y-28355322D01*
X207858849Y-28191537D01*
X207998137Y-28052249D01*
X208161922Y-27942811D01*
X208343911Y-27867429D01*
X208471607Y-27842029D01*
X208537107Y-27829000D01*
X208734093Y-27829000D01*
X208799593Y-27842029D01*
X208799593Y-27842029D01*
G37*
G36*
X207095600Y-29829000D02*
X205095600Y-29829000D01*
X205095600Y-27829000D01*
X207095600Y-27829000D01*
X207095600Y-29829000D01*
X207095600Y-29829000D01*
G37*
G36*
X179638200Y-29829000D02*
X177638200Y-29829000D01*
X177638200Y-27829000D01*
X179638200Y-27829000D01*
X179638200Y-29829000D01*
X179638200Y-29829000D01*
G37*
G36*
X161250793Y-27842029D02*
X161378489Y-27867429D01*
X161560478Y-27942811D01*
X161724263Y-28052249D01*
X161863551Y-28191537D01*
X161972989Y-28355322D01*
X162048371Y-28537311D01*
X162071428Y-28653230D01*
X162081748Y-28705107D01*
X162086800Y-28730509D01*
X162086800Y-28927491D01*
X162048371Y-29120689D01*
X161972989Y-29302678D01*
X161863551Y-29466463D01*
X161724263Y-29605751D01*
X161560478Y-29715189D01*
X161378489Y-29790571D01*
X161262570Y-29813628D01*
X161185293Y-29829000D01*
X160988307Y-29829000D01*
X160911030Y-29813628D01*
X160795111Y-29790571D01*
X160613122Y-29715189D01*
X160449337Y-29605751D01*
X160310049Y-29466463D01*
X160200611Y-29302678D01*
X160125229Y-29120689D01*
X160086800Y-28927491D01*
X160086800Y-28730509D01*
X160091853Y-28705107D01*
X160102172Y-28653230D01*
X160125229Y-28537311D01*
X160200611Y-28355322D01*
X160310049Y-28191537D01*
X160449337Y-28052249D01*
X160613122Y-27942811D01*
X160795111Y-27867429D01*
X160922807Y-27842029D01*
X160988307Y-27829000D01*
X161185293Y-27829000D01*
X161250793Y-27842029D01*
X161250793Y-27842029D01*
G37*
G36*
X176262193Y-27842029D02*
X176389889Y-27867429D01*
X176571878Y-27942811D01*
X176735663Y-28052249D01*
X176874951Y-28191537D01*
X176984389Y-28355322D01*
X177059771Y-28537311D01*
X177082828Y-28653230D01*
X177093148Y-28705107D01*
X177098200Y-28730509D01*
X177098200Y-28927491D01*
X177059771Y-29120689D01*
X176984389Y-29302678D01*
X176874951Y-29466463D01*
X176735663Y-29605751D01*
X176571878Y-29715189D01*
X176389889Y-29790571D01*
X176273970Y-29813628D01*
X176196693Y-29829000D01*
X175999707Y-29829000D01*
X175922430Y-29813628D01*
X175806511Y-29790571D01*
X175624522Y-29715189D01*
X175460737Y-29605751D01*
X175321449Y-29466463D01*
X175212011Y-29302678D01*
X175136629Y-29120689D01*
X175098200Y-28927491D01*
X175098200Y-28730509D01*
X175103253Y-28705107D01*
X175113572Y-28653230D01*
X175136629Y-28537311D01*
X175212011Y-28355322D01*
X175321449Y-28191537D01*
X175460737Y-28052249D01*
X175624522Y-27942811D01*
X175806511Y-27867429D01*
X175934207Y-27842029D01*
X175999707Y-27829000D01*
X176196693Y-27829000D01*
X176262193Y-27842029D01*
X176262193Y-27842029D01*
G37*
G36*
X194624200Y-29803600D02*
X192624200Y-29803600D01*
X192624200Y-27803600D01*
X194624200Y-27803600D01*
X194624200Y-29803600D01*
X194624200Y-29803600D01*
G37*
G36*
X191259970Y-27818972D02*
X191375889Y-27842029D01*
X191557878Y-27917411D01*
X191721663Y-28026849D01*
X191860951Y-28166137D01*
X191970389Y-28329922D01*
X192045771Y-28511911D01*
X192068828Y-28627830D01*
X192084200Y-28705107D01*
X192084200Y-28902093D01*
X192068828Y-28979370D01*
X192045771Y-29095289D01*
X191970389Y-29277278D01*
X191860951Y-29441063D01*
X191721663Y-29580351D01*
X191557878Y-29689789D01*
X191375889Y-29765171D01*
X191259970Y-29788228D01*
X191182693Y-29803600D01*
X190985707Y-29803600D01*
X190908430Y-29788228D01*
X190792511Y-29765171D01*
X190610522Y-29689789D01*
X190446737Y-29580351D01*
X190307449Y-29441063D01*
X190198011Y-29277278D01*
X190122629Y-29095289D01*
X190099572Y-28979370D01*
X190084200Y-28902093D01*
X190084200Y-28705107D01*
X190099572Y-28627830D01*
X190122629Y-28511911D01*
X190198011Y-28329922D01*
X190307449Y-28166137D01*
X190446737Y-28026849D01*
X190610522Y-27917411D01*
X190792511Y-27842029D01*
X190908430Y-27818972D01*
X190985707Y-27803600D01*
X191182693Y-27803600D01*
X191259970Y-27818972D01*
X191259970Y-27818972D01*
G37*
G36*
X143265800Y-29046400D02*
X141315800Y-29046400D01*
X141315800Y-27646400D01*
X143265800Y-27646400D01*
X143265800Y-29046400D01*
X143265800Y-29046400D01*
G37*
G36*
X158954700Y-28132000D02*
X157554700Y-28132000D01*
X157554700Y-26732000D01*
X158954700Y-26732000D01*
X158954700Y-28132000D01*
X158954700Y-28132000D01*
G37*
G36*
X142703024Y-25656528D02*
X142834975Y-25696555D01*
X142956581Y-25761555D01*
X143063170Y-25849030D01*
X143150645Y-25955619D01*
X143215645Y-26077225D01*
X143255672Y-26209176D01*
X143269187Y-26346400D01*
X143255672Y-26483624D01*
X143215645Y-26615575D01*
X143150645Y-26737181D01*
X143063170Y-26843770D01*
X142956581Y-26931245D01*
X142834975Y-26996245D01*
X142703024Y-27036272D01*
X142600190Y-27046400D01*
X141981410Y-27046400D01*
X141878576Y-27036272D01*
X141746625Y-26996245D01*
X141625019Y-26931245D01*
X141518430Y-26843770D01*
X141430955Y-26737181D01*
X141365955Y-26615575D01*
X141325928Y-26483624D01*
X141312413Y-26346400D01*
X141325928Y-26209176D01*
X141365955Y-26077225D01*
X141430955Y-25955619D01*
X141518430Y-25849030D01*
X141625019Y-25761555D01*
X141746625Y-25696555D01*
X141878576Y-25656528D01*
X141981410Y-25646400D01*
X142600190Y-25646400D01*
X142703024Y-25656528D01*
X142703024Y-25656528D01*
G37*
G36*
X158458883Y-24758900D02*
X158586274Y-24811668D01*
X158700925Y-24888275D01*
X158798425Y-24985775D01*
X158875032Y-25100426D01*
X158927800Y-25227817D01*
X158954700Y-25363055D01*
X158954700Y-25500945D01*
X158927800Y-25636183D01*
X158875868Y-25761555D01*
X158875032Y-25763574D01*
X158817933Y-25849030D01*
X158798425Y-25878225D01*
X158700925Y-25975725D01*
X158586274Y-26052332D01*
X158458883Y-26105100D01*
X158323645Y-26132000D01*
X158185755Y-26132000D01*
X158050517Y-26105100D01*
X157923126Y-26052332D01*
X157808475Y-25975725D01*
X157710975Y-25878225D01*
X157691468Y-25849030D01*
X157634368Y-25763574D01*
X157633532Y-25761555D01*
X157581600Y-25636183D01*
X157554700Y-25500945D01*
X157554700Y-25363055D01*
X157581600Y-25227817D01*
X157634368Y-25100426D01*
X157710975Y-24985775D01*
X157808475Y-24888275D01*
X157923126Y-24811668D01*
X158050517Y-24758900D01*
X158185755Y-24732000D01*
X158323645Y-24732000D01*
X158458883Y-24758900D01*
X158458883Y-24758900D01*
G37*
M02*
