<svg width="10" height="12" viewBox="0 0 10 12" fill="none" xmlns="http://www.w3.org/2000/svg">
<path fill-rule="evenodd" clip-rule="evenodd" d="M0.041687 5.01853C0.041687 2.33527 2.28395 0.166504 4.9962 0.166504C7.71609 0.166504 9.95835 2.33527 9.95835 5.01853C9.95835 6.37066 9.46661 7.62595 8.65723 8.68992C7.76432 9.86356 6.66378 10.8861 5.425 11.6888C5.14149 11.8742 4.88561 11.8882 4.57445 11.6888C3.32862 10.8861 2.22807 9.86356 1.34281 8.68992C0.532844 7.62595 0.041687 6.37066 0.041687 5.01853ZM3.36333 5.1696C3.36333 6.06849 4.09683 6.77547 4.9962 6.77547C5.89617 6.77547 6.63673 6.06849 6.63673 5.1696C6.63673 4.27771 5.89617 3.53631 4.9962 3.53631C4.09683 3.53631 3.36333 4.27771 3.36333 5.1696Z" fill="#105A89"/>
</svg>
