<svg width="12" height="12" viewBox="0 0 12 12" fill="none" xmlns="http://www.w3.org/2000/svg">
<path fill-rule="evenodd" clip-rule="evenodd" d="M8.88135 0.75C9.6636 0.75 10.4161 1.05917 10.9697 1.61392C11.5238 2.1675 11.8336 2.91417 11.8336 3.69583V8.30417C11.8336 9.93167 10.5094 11.25 8.88135 11.25H3.1186C1.49051 11.25 0.166931 9.93167 0.166931 8.30417V3.69583C0.166931 2.06833 1.48468 0.75 3.1186 0.75H8.88135ZM9.80941 4.56496L9.85608 4.5183C9.99549 4.34913 9.99549 4.10413 9.84966 3.93496C9.76857 3.84805 9.65716 3.79496 9.54108 3.7833C9.41858 3.77688 9.30191 3.8183 9.21383 3.89996L6.58358 5.99996C6.24524 6.28055 5.76049 6.28055 5.41691 5.99996L2.79191 3.89996C2.61049 3.7658 2.35966 3.7833 2.20858 3.9408C2.05108 4.0983 2.03358 4.34913 2.16716 4.52413L2.24358 4.59996L4.89774 6.6708C5.22441 6.92746 5.62049 7.06746 6.03524 7.06746C6.44883 7.06746 6.85191 6.92746 7.17799 6.6708L9.80941 4.56496Z" fill="#105A89"/>
</svg>
