<svg xmlns="http://www.w3.org/2000/svg" xmlns:xlink="http://www.w3.org/1999/xlink" width="700" height="1850" viewBox="0 0 700 1850">
    <defs>
        <style type="text/css">
            @import url('https://fonts.googleapis.com/css2?family=DM+Serif+Display&amp;display=swap');
        </style>
        <linearGradient id="theme_bookstore_linear-gradient_1" x1="0.499" y1="2.028" x2="0.499" y2="0.221" gradientUnits="objectBoundingBox">
            <stop offset="0" stop-color="#3AADAA"/>
            <stop offset="1" stop-color="#3AADAA"/>
        </linearGradient>
        <linearGradient id="theme_bookstore_linear-gradient_2" x1="0.5" y1="1" x2="0.5" gradientUnits="objectBoundingBox">
            <stop offset="0" stop-color="gray" stop-opacity="0.251"/>
            <stop offset="0.54" stop-color="gray" stop-opacity="0.122"/>
            <stop offset="1" stop-color="gray" stop-opacity="0.102"/>
        </linearGradient>
        <linearGradient id="theme_bookstore_linear-gradient_3" x1="0.799" y1="1" x2="0.799" y2="0" xlink:href="#linear-gradient-2"/>
        <clipPath id="theme_bookstore_clip-path">
            <rect width="175" height="98" fill="#F6F6F6"/>
        </clipPath>
        <pattern width="1" height="1" id="theme_bookstore_s_cover_default_image_id" patternunits="objectBoundingBox">
            <image width="700" height="310" preserveAspectRatio="xMidYMid slice" href="#s_cover_default_image_url"/>
        </pattern>
        <pattern width="1" height="1" id="theme_bookstore_s_masonry_block_default_image_1_id" patternunits="objectBoundingBox">
            <image width="350" height="196" preserveAspectRatio="xMidYMid slice" href="#s_masonry_block_default_image_1_url"/>
        </pattern>
        <pattern width="1" height="1" id="theme_bookstore_s_picture_default_image_id" patternunits="objectBoundingBox">
            <image width="280" height="280" preserveAspectRatio="xMidYMid slice" href="#s_picture_default_image_url"/>
        </pattern>
        <pattern width="1" height="1" id="theme_bookstore_s_product_list_default_image_1_id" patternunits="objectBoundingBox">
            <image width="158" height="158" preserveAspectRatio="xMidYMid slice" href="#s_product_list_default_image_1_url"/>
        </pattern>
        <pattern width="1" height="1" id="theme_bookstore_s_product_list_default_image_2_id" patternunits="objectBoundingBox">
            <image width="158" height="158" preserveAspectRatio="xMidYMid slice" href="#s_product_list_default_image_2_url"/>
        </pattern>
        <pattern width="1" height="1" id="theme_bookstore_s_product_list_default_image_3_id" patternunits="objectBoundingBox">
            <image width="158" height="158" preserveAspectRatio="xMidYMid slice" href="#s_product_list_default_image_3_url"/>
        </pattern>
        <pattern width="1" height="1" id="theme_bookstore_s_product_list_default_image_4_id" patternunits="objectBoundingBox">
            <image width="158" height="158" preserveAspectRatio="xMidYMid slice" href="#s_product_list_default_image_4_url"/>
        </pattern>
        <pattern width="1" height="1" id="theme_bookstore_s_product_list_default_image_5_id" patternunits="objectBoundingBox">
            <image width="158" height="158" preserveAspectRatio="xMidYMid slice" href="#s_product_list_default_image_5_url"/>
        </pattern>
        <pattern width="1" height="1" id="theme_bookstore_s_product_list_default_image_6_id" patternunits="objectBoundingBox">
            <image width="158" height="158" preserveAspectRatio="xMidYMid slice" href="#s_product_list_default_image_6_url"/>
        </pattern>
        <filter id="filter_readability_bookstore">
            <feColorMatrix in="SourceGraphic" type="saturate" values="0"/>
            <feComponentTransfer>
                <feFuncR type="table" tableValues="1 0"/>
                <feFuncG type="table" tableValues="1 0"/>
                <feFuncB type="table" tableValues="1 0"/>
            </feComponentTransfer>
            <feComponentTransfer>
                <feFuncR type="linear" slope="10000" intercept="-4999.5"/>
                <feFuncG type="linear" slope="10000" intercept="-4999.5"/>
                <feFuncB type="linear" slope="10000" intercept="-4999.5"/>
            </feComponentTransfer>
        </filter>
    </defs>
    <g fill="none" fill-rule="evenodd" class="theme_bookstore">
        <rect width="700" height="1850" fill="#FFFFFF"/>
        <g class="svgc_menu" transform="translate(-1428 -220)">
            <rect width="700" height="37" transform="translate(1428 247)" class="svgc_menu_bg" fill="#MENU_COLOR"/>
            <path d="M76.345,23V21.479H72.6V14.273H70.759V23Zm4.68.12a4.131,4.131,0,0,0,2.08-.527,3.749,3.749,0,0,0,1.467-1.528,5.054,5.054,0,0,0,.539-2.429,5.059,5.059,0,0,0-.54-2.429,3.755,3.755,0,0,0-1.465-1.527,4.388,4.388,0,0,0-4.17,0,3.739,3.739,0,0,0-1.461,1.527,5.084,5.084,0,0,0-.537,2.43,5.07,5.07,0,0,0,.537,2.424,3.753,3.753,0,0,0,1.461,1.53,4.138,4.138,0,0,0,2.088.528Zm0-1.633a2.08,2.08,0,0,1-1.168-.328,2.128,2.128,0,0,1-.774-.963,3.929,3.929,0,0,1-.275-1.56,3.935,3.935,0,0,1,.275-1.56,2.114,2.114,0,0,1,.774-.962,2.242,2.242,0,0,1,2.335,0,2.121,2.121,0,0,1,.773.963,3.911,3.911,0,0,1,.275,1.56,3.909,3.909,0,0,1-.275,1.559,2.12,2.12,0,0,1-.773.963,2.075,2.075,0,0,1-1.168.328ZM90.3,23.119a4.152,4.152,0,0,0,1.952-.445,3.292,3.292,0,0,0,1.338-1.27,3.823,3.823,0,0,0,.486-1.975v-1.1H90.426v1.39H92.3l0,.126a1.886,1.886,0,0,1-.157.645l-.073.14a1.591,1.591,0,0,1-.682.633,2.35,2.35,0,0,1-1.071.224,2.127,2.127,0,0,1-1.2-.334,2.151,2.151,0,0,1-.784-.974,3.9,3.9,0,0,1-.277-1.551,3.805,3.805,0,0,1,.281-1.545,2.174,2.174,0,0,1,.787-.965,2.086,2.086,0,0,1,1.174-.332,2.283,2.283,0,0,1,.654.089,1.778,1.778,0,0,1,.528.258,1.6,1.6,0,0,1,.394.409,1.94,1.94,0,0,1,.252.552H94a3.19,3.19,0,0,0-.4-1.187,3.27,3.27,0,0,0-.812-.931,3.741,3.741,0,0,0-1.135-.607,4.3,4.3,0,0,0-1.381-.216,4.21,4.21,0,0,0-1.607.3,3.756,3.756,0,0,0-1.3.882,4.021,4.021,0,0,0-.867,1.413,5.417,5.417,0,0,0-.309,1.894,5.141,5.141,0,0,0,.518,2.384,3.725,3.725,0,0,0,1.447,1.547,4.2,4.2,0,0,0,2.156.543Zm8.958,0a4.137,4.137,0,0,0,2.081-.526,3.747,3.747,0,0,0,1.466-1.528,5.054,5.054,0,0,0,.54-2.429,5.059,5.059,0,0,0-.54-2.429,3.763,3.763,0,0,0-1.466-1.527,4.386,4.386,0,0,0-4.169,0,3.742,3.742,0,0,0-1.462,1.527,5.084,5.084,0,0,0-.537,2.43,5.07,5.07,0,0,0,.537,2.424,3.756,3.756,0,0,0,1.462,1.53A4.133,4.133,0,0,0,99.26,23.119Zm0-1.632a2.081,2.081,0,0,1-1.168-.328,2.127,2.127,0,0,1-.773-.963,3.911,3.911,0,0,1-.275-1.56,3.918,3.918,0,0,1,.275-1.56,2.112,2.112,0,0,1,.773-.962,2.242,2.242,0,0,1,2.335,0,2.123,2.123,0,0,1,.774.963,3.929,3.929,0,0,1,.275,1.56A3.927,3.927,0,0,1,101.2,20.2a2.128,2.128,0,0,1-.774.963A2.075,2.075,0,0,1,99.26,21.487Z" transform="translate(1428 247)" class="svgc_text" opacity="1" fill="#MENU_COLOR" filter="url(#filter_readability_bookstore)"/>
            <g transform="translate(1587 262)" opacity="0.4">
                <rect width="37" height="7" fill="#MENU_COLOR" class="svgc_text" filter="url(#filter_readability_bookstore)"/>
                <rect width="37" height="7" transform="translate(58)" fill="#MENU_COLOR" class="svgc_text" filter="url(#filter_readability_bookstore)"/>
                <rect width="37" height="7" transform="translate(116)" fill="#MENU_COLOR" class="svgc_text" filter="url(#filter_readability_bookstore)"/>
                <rect width="37" height="7" transform="translate(174)" fill="#MENU_COLOR" class="svgc_text" filter="url(#filter_readability_bookstore)"/>
            </g>
            <rect width="37" height="7" transform="translate(2021 262)" fill="#MENU_COLOR" opacity="1" class="svgc_text" filter="url(#filter_readability_bookstore)"/>
            <rect width="700" height="28" transform="translate(1428 220)" fill="#F6F6F6"/>
            <circle cx="5" cy="5" r="5" transform="translate(2048 229.908)" fill="#3AADAA"/>
            <circle cx="5" cy="5" r="5" transform="translate(2036 229.908)" fill="#3AADAA"/>
            <circle cx="5" cy="5" r="5" transform="translate(2024 229.908)" fill="#3AADAA"/>
            <circle cx="5" cy="5" r="5" transform="translate(2012 229.908)" fill="#3AADAA"/>
            <rect width="53" height="2" transform="translate(1496 230.5)" fill="#3AADAA"/>
            <rect width="108" height="2" transform="translate(1554 230.5)" fill="#3AADAA"/>
        </g>
        <g class="s_cover">
            <rect class="img_reference_s_cover_default_image" fill="url(#theme_bookstore_s_cover_default_image_id)" width="700" height="310" transform="translate(0 64)"/>
            <rect width="700" height="310" transform="translate(0 64)" fill="#FFFFFD" opacity="0.75"/>
            <g transform="translate(4.544 106.181)">
                <path d="M1173.293,184.931c25.388,23.247,61.552,18.146,87.4-9.059s20.658-69.774-9.309-87.365-63.013-16.967-87.4,9.059S1147.905,161.665,1173.293,184.931Z" transform="translate(-606.868 -33.144)" fill="#F6F6F6"/>
                <path d="M1217.121,317.47a9.448,9.448,0,0,0,13.5-1.42c3.339-4.12,2.8-10.932-1.415-13.5s-10.428-3.547-13.5,1.424S1212.811,313.983,1217.121,317.47Z" transform="translate(-641.386 -153.53)" fill="#3AADAA"/>
                <path d="M1260.727,309.239c-1.637.61-2.238,2.363-1.6,4.162a2.849,2.849,0,0,0,4.162,1.591,3.39,3.39,0,0,0,1.6-4.162A3.086,3.086,0,0,0,1260.727,309.239Z" transform="translate(-665.718 -158.132)" fill="#3AADAA"/>
                <path d="M1177.159,205.389c10.354,9.485,25.106,7.4,35.641-3.7s8.426-28.454-3.792-35.608-25.7-6.937-35.641,3.7S1166.809,195.908,1177.159,205.389Z" transform="translate(-616.555 -78.676)" fill="#383E45"/>
                <path d="M1257.779,264.936c1.286,1.179,3.117.925,4.43-.462a2.849,2.849,0,0,0-.463-4.43,3.386,3.386,0,0,0-4.43.462A3.091,3.091,0,0,0,1257.779,264.936Z" transform="translate(-664.48 -131.494)" fill="#383E45"/>
                <path d="M1269.024,251.18a1.535,1.535,0,0,0,2.215-.227,1.424,1.424,0,0,0-.236-2.215,1.692,1.692,0,0,0-2.215.227,1.545,1.545,0,0,0,.236,2.215Z" transform="translate(-670.852 -125.577)" fill="#383E45"/>
                <path d="M1044.3,339.66c15.335,12.417,39.812,9.545,55.457-5.776s13.476-42.638-5.878-55.443-41.764-11.131-55.457,5.776S1028.973,327.243,1044.3,339.66Z" transform="translate(-542.768 -137.18)" fill="#28AFEA"/>
                <path d="M995.85,244.095c14.507,13.286,35.174,10.368,49.944-5.179s11.806-39.867-5.318-49.944-36.006-9.711-49.944,5.175S981.348,230.809,995.85,244.095Z" transform="translate(-516.988 -89.913)" fill="#3AADAA"/>
                <path d="M299.748,201.77c-17.06,15.621-41.366,12.195-58.731-6.09s-13.873-46.887,6.257-58.707,42.346-11.4,58.731,6.086S316.8,186.144,299.748,201.77Z" transform="translate(-112.56 -61.318)" fill="#F6F6F6"/>
                <path d="M93.382,69.349c-9.207,5.045-20.6,5.494-27.349-2.839a19.423,19.423,0,0,1,2.909-27.34C77.3,32.4,88.915,35.609,96.291,42.009S102.585,64.3,93.382,69.349Z" transform="translate(-22.175 -11.064)" fill="#F6F6F6"/>
                <path d="M46.005,224.746c-11.455,9.277-11.464,24.51-3.949,37.527S62.32,287.3,71.218,298.284a26.469,26.469,0,0,0,37.527,3.949c12.176-9.859,14.086-27.506,3.945-37.523S94.377,239.576,83.528,228.7,57.455,215.474,46.005,224.746Z" transform="translate(-8.806 -109.751)" fill="#F6F6F6"/>
                <path d="M355.207,290.86a6.345,6.345,0,0,1-9.073-.953c-2.243-2.775-1.882-7.348.953-9.073s7.006-2.386,9.073.953S358.1,288.516,355.207,290.86Z" transform="translate(-174.284 -142.232)" fill="#3AADAA"/>
                <path d="M336.045,285.328a2.052,2.052,0,0,1,1.077,2.775,1.905,1.905,0,0,1-2.775,1.068,2.26,2.26,0,0,1-1.078-2.775A2.069,2.069,0,0,1,336.045,285.328Z" transform="translate(-168.076 -145.324)" fill="#3AADAA"/>
                <path d="M141.431,98.354A10.516,10.516,0,0,1,126.4,96.782c-3.7-4.587-3.117-12.172,1.577-15.034s11.612-3.949,15.034,1.586S146.232,94.47,141.431,98.354Z" transform="translate(-55.653 -34.71)" fill="#3AADAA"/>
                <path d="M211.662,319.187c-3.14,2.548-8.874-.638-12.4-4.088a8.127,8.127,0,0,1,1.336-12.486c4.365-2.872,9.429-2.52,12.514,1.29S214.807,316.644,211.662,319.187Z" transform="translate(-94.863 -153.684)" fill="#3AADAA"/>
                <path d="M112.934,227.935c-2.636,2.414-6.386,1.882-9.069-.925a5.822,5.822,0,0,1,.966-9.064c3.108-1.827,6.534-1.762,9.064.925S115.565,225.54,112.934,227.935Z" transform="translate(-43.91 -108.52)" fill="#383E45"/>
                <path d="M337.807,255.558a2.065,2.065,0,0,1-2.978-.305,1.914,1.914,0,0,1,.319-2.978,2.278,2.278,0,0,1,2.978.31A2.074,2.074,0,0,1,337.807,255.558Z" transform="translate(-168.686 -127.426)" fill="#383E45"/>
                <path d="M106.877,249.086a2.06,2.06,0,0,1-2.974-.31,1.905,1.905,0,0,1,.314-2.973,2.277,2.277,0,0,1,2.978.305A2.079,2.079,0,0,1,106.877,249.086Z" transform="translate(-44.549 -123.945)" fill="#383E45"/>
                <path d="M332.787,246.311a1.031,1.031,0,0,1-1.489-.153.957.957,0,0,1,.157-1.489,1.138,1.138,0,0,1,1.489.157,1.036,1.036,0,0,1-.157,1.484Z" transform="translate(-166.941 -123.445)" fill="#383E45"/>
                <path d="M226.994,181.393c-2.636,2.409-6.386,1.882-9.069-.925a5.817,5.817,0,0,1,.966-9.059c3.108-1.822,6.534-1.762,9.064.925S229.625,178.979,226.994,181.393Z" transform="translate(-105.223 -83.504)" fill="#3AADAA"/>
                <path d="M129.235,281.883a2.07,2.07,0,0,1-2.978-.31,1.914,1.914,0,0,1,.314-2.978,2.277,2.277,0,0,1,2.978.31A2.083,2.083,0,0,1,129.235,281.883Z" transform="translate(-56.566 -141.574)" fill="#383E45"/>
                <path d="M238.189,199.768a2.057,2.057,0,0,1-.925,2.844,1.91,1.91,0,0,1-2.844-.925,2.265,2.265,0,0,1,.925-2.844A2.09,2.09,0,0,1,238.189,199.768Z" transform="translate(-114.929 -98.781)" fill="#3AADAA"/>
                <path d="M87.654,144.405c-2.636,2.414-6.386,1.882-9.069-.925a5.822,5.822,0,0,1,.967-9.064c3.108-1.827,6.539-1.762,9.069.925S90.285,142,87.654,144.405Z" transform="translate(-30.32 -63.618)" fill="#28AFEA"/>
                <path d="M184.628,132.653c-3.556,3.26-8.625,2.543-12.246-1.267s-2.895-9.781,1.3-12.246,8.828-2.354,12.246,1.272S188.184,129.4,184.628,132.653Z" transform="translate(-80.416 -55.176)" fill="#F6F6F6"/>
                <path d="M60.4,322c-9.748,8.925-23.636,6.969-33.56-3.482s-7.931-26.771,3.579-33.546,24.2-6.516,33.56,3.478S70.148,313.069,60.4,322Z" transform="translate(0 -142.733)" fill="#28AFEA"/>
                <path d="M115.993,123.361c-1.5.819-3.357.893-4.458-.462a3.172,3.172,0,0,1,.462-4.463c1.387-1.105,3.237-.578,4.463.462A2.969,2.969,0,0,1,115.993,123.361Z" transform="translate(-48.578 -55.369)" fill="#F6F6F6"/>
                <path d="M175.356,89.474a2.087,2.087,0,0,1-2.705-.282,1.919,1.919,0,0,1,.287-2.705,2.125,2.125,0,0,1,2.7.282A1.8,1.8,0,0,1,175.356,89.474Z" transform="translate(-81.582 -38.324)" fill="#F6F6F6"/>
                <path d="M356.3,215.526c-6.96,6.368-16.87,4.971-23.95-2.483s-5.665-19.122,2.548-23.945,17.268-4.648,23.973,2.483S363.258,209.154,356.3,215.526Z" transform="translate(-165.212 -91.912)" fill="#383E45"/>
                <path d="M370.732,157.389A1.927,1.927,0,1,1,368.3,154.4c.846-.513,2.095-.712,2.71.287A1.921,1.921,0,0,1,370.732,157.389Z" transform="translate(-186.6 -74.802)" fill="#3AADAA"/>
                <path d="M384.738,151.723a4.162,4.162,0,0,1-5.961-.629c-1.471-1.817-1.235-4.823.624-5.961s4.6-1.563,5.961.629S386.639,150.183,384.738,151.723Z" transform="translate(-192.102 -69.548)" fill="#3AADAA"/>
                <path d="M265.341,19.416c-12.514,11.21-8.814,19.534-2.876,27.4,6.766,8.352,15.723,17.388,21.272,26.276s19.848,10.636,27.381,2.876,10.419-18.063,2.876-27.377L292.722,22.3C285.3,13.141,273.7,12.651,265.341,19.416Z" transform="translate(-127.144 0)" fill="#3AADAA"/>
                <path d="M103.073,149.976c-8.352,6.766-8.356,17.869-2.876,27.377s14.8,18.262,21.272,26.276A19.3,19.3,0,0,0,148.85,206.5c8.884-7.2,10.271-20.065,2.876-27.377s-13.365-18.331-21.272-26.276S111.429,143.21,103.073,149.976Z" transform="translate(-40.819 -70.39)" fill="#28AFEA"/>
            </g>
            <text transform="translate(350 190)" fill="#000000" font-size="40" font-family="DMSerifDisplay-Regular, DM Serif Display"><tspan x="-80.26" y="0">Welcome</tspan><tspan x="-73.42" y="39">Message</tspan></text>
            <rect width="94" height="29" transform="translate(303 261)" fill="#3AADAA"/>
            <text transform="translate(350 279)" fill="#FFFFFF" font-size="11" font-family="Arial-BoldMT, Arial" font-weight="700"><tspan x="-23.235" y="0">Discover</tspan></text>
        </g>
        <g class="s_masonry">
            <rect class="img_reference_s_masonry_block_default_image_1" fill="url(#theme_bookstore_s_masonry_block_default_image_1_id)" width="350" height="196" transform="translate(0 374)"/>
            <g transform="translate(350 374)">
                <rect width="175" height="98" transform="translate(0.031)" fill="#F6F6F6"/>
                <g transform="translate(37.5 4)">
                    <line x2="6" y2="6" transform="translate(0 49.5)" fill="none" stroke="#FFFFFF" stroke-linecap="round" stroke-width="2"/>
                    <line x2="9" y2="9" transform="translate(28 11.5)" fill="none" stroke="#FFFFFF" stroke-linecap="round" stroke-width="2"/>
                    <line x2="9" y2="9" transform="translate(111 51.5)" fill="none" stroke="#FFFFFF" stroke-linecap="round" stroke-width="2"/>
                    <line x2="5" y2="5" transform="translate(34 65.5)" fill="none" stroke="#FFFFFF" stroke-linecap="round" stroke-width="2"/>
                    <line x2="9" y2="9" transform="translate(76 2.5)" fill="none" stroke="#FFFFFF" stroke-linecap="round" stroke-width="2"/>
                    <line x2="7" y2="7" transform="translate(7 80.5)" fill="none" stroke="#FFFFFF" stroke-linecap="round" stroke-width="2"/>
                    <line x2="5" y2="5" transform="translate(0 79)" fill="none" stroke="#FFFFFF" stroke-linecap="round" stroke-width="1"/>
                    <line x2="4" y2="4" transform="translate(33 13)" fill="none" stroke="#FFFFFF" stroke-linecap="round" stroke-width="1"/>
                    <line x2="4" y2="4" transform="translate(30 3)" fill="none" stroke="#FFFFFF" stroke-linecap="round" stroke-width="1"/>
                    <line x2="6" y2="6" transform="translate(91 36)" fill="none" stroke="#FFFFFF" stroke-linecap="round" stroke-width="1"/>
                    <line x2="6" y2="6" transform="translate(51 75.5)" fill="none" stroke="#FFFFFF" stroke-linecap="round" stroke-width="1"/>
                    <line x2="6" y2="6" transform="translate(23)" fill="none" stroke="#FFFFFF" stroke-linecap="round" stroke-width="1"/>
                </g>
                <g transform="translate(41 33)">
                    <text transform="translate(49.031 14)" fill="#3AADAA" font-size="20" font-family="DMSerifDisplay-Regular, DM Serif Display"><tspan x="-49.59" y="0">Entry Title</tspan></text>
                    <g transform="translate(3 26.877)" opacity="0.4">
                        <rect width="86.811" height="2" fill="#212529"/>
                        <rect width="71.811" height="2" transform="translate(8 5)" fill="#212529"/>
                    </g>
                </g>
            </g>
            <g>
                <rect width="175" height="98" transform="translate(525 374)" fill="#28AFEA"/>
                <path d="M175,37.613,87.186,1.893,0,37.393V36.171L87.186.672,175,36.391v1.221Zm0-3.238L90.744,0h1L175,33.967v.407ZM0,34.119H0v-.407L82.778,0h1Zm175-2.611L97.784,0h1L175,31.1v.407ZM0,31.252H0v-.407L75.676,0h1Zm175-2.61L104.887,0h1L175,28.234v.407ZM0,28.385H0v-.407L68.6,0h1L0,28.385Zm175-2.61L111.865,0h1L175,25.368v.407ZM0,25.519H0v-.407L61.546,0h1ZM175,22.9,118.88,0h1L175,22.489V22.9ZM0,22.652H0v-.407L54.506,0h1Zm175-2.623L125.983,0h1L175,19.622v.407ZM0,19.785H0v-.407L47.466,0h1Zm175-2.622L132.8,0h1L175,16.756v.407ZM0,16.919H0v-.407L40.426,0h1ZM175,14.3,140.1,0h.995L175,13.888V14.3ZM0,14.052H0v-.407L33.387,0h1Zm175-2.623L147.166,0h.993L175,11.021v.408ZM0,11.185H0v-.407L26.347,0h1ZM175,8.563,153.968,0h1L175,8.156v.407ZM0,8.319H0V7.911L19.345,0h1L0,8.319ZM175,5.7,161.209,0h.988L175,5.288V5.7ZM0,5.451H0V5.043L12.283,0h.993ZM175,2.83,168.036,0h1L175,2.423V2.83ZM0,2.582H0V2.174L5.261,0h.988Z" transform="translate(525 374)" fill="#3AADAA"/>
                <g transform="translate(565.953 406)">
                    <text transform="translate(49.047 14)" fill="#28AFEA" class="svgc_text" filter="url(#filter_readability_bookstore)" font-size="20" font-family="DMSerifDisplay-Regular, DM Serif Display"><tspan x="-49.59" y="0">Entry Title</tspan></text>
                    <g transform="translate(3 26.877)" opacity="0.4">
                        <rect width="86.811" height="2" fill="#28AFEA" class="svgc_text" filter="url(#filter_readability_bookstore)"/>
                        <rect width="71.811" height="2" transform="translate(8 5)" fill="#28AFEA" class="svgc_text" filter="url(#filter_readability_bookstore)"/>
                    </g>
                </g>
            </g>
            <g>
                <path d="M0,0H175V98H0Z" transform="translate(350 472)" fill="#383E45"/>
                <path d="M174.763,0H0V7.586A2.351,2.351,0,0,0,2.346,9.932H2.4A2.351,2.351,0,0,0,4.741,7.586V6.65A2.351,2.351,0,0,1,7.087,4.3h.05A2.351,2.351,0,0,1,9.482,6.65v4.991a2.351,2.351,0,0,0,2.346,2.346h.025A2.351,2.351,0,0,0,14.2,11.641v-.349a2.343,2.343,0,0,1,2.346-2.346h.05a2.339,2.339,0,0,1,2.3,1.859v6.987a2.351,2.351,0,0,0,2.346,2.346h.05a2.351,2.351,0,0,0,2.346-2.346l.05-8.547a2.335,2.335,0,0,1,2.283-1.859h.05A2.351,2.351,0,0,1,28.36,9.732v5.5a2.343,2.343,0,0,0,2.346,2.346h.05a2.332,2.332,0,0,0,2.333-2.346V13.288a2.351,2.351,0,0,1,2.346-2.346h.05a2.351,2.351,0,0,1,2.346,2.346h0v6.089a2.343,2.343,0,0,0,2.346,2.346h.05a2.351,2.351,0,0,0,2.346-2.346v-.936A2.356,2.356,0,0,1,44.9,16.1h.05A2.351,2.351,0,0,1,47.3,18.441v4.991a2.351,2.351,0,0,0,2.346,2.346h.05a2.351,2.351,0,0,0,2.346-2.346v-.349a2.351,2.351,0,0,1,2.346-2.346h.05a2.362,2.362,0,0,1,2.3,1.859v6.987a2.343,2.343,0,0,0,2.346,2.346h.05a2.351,2.351,0,0,0,2.346-2.346l.05-8.547a2.346,2.346,0,0,1,2.283-1.859h.05A2.351,2.351,0,0,1,66.2,21.523v5.5a2.343,2.343,0,0,0,2.346,2.346h.05a2.351,2.351,0,0,0,2.346-2.346V25.078a2.343,2.343,0,0,1,2.346-2.346h.05a2.344,2.344,0,0,1,2.308,1.959l.037,7.237a2.351,2.351,0,0,0,2.346,2.346h.05a2.351,2.351,0,0,0,2.346-2.346V24.941a2.335,2.335,0,0,1,2.283-1.859h.05A2.351,2.351,0,0,1,85.1,25.428v.349a2.343,2.343,0,0,0,2.346,2.346h.05a2.351,2.351,0,0,0,2.346-2.346V20.786a2.343,2.343,0,0,1,2.346-2.346h.05a2.351,2.351,0,0,1,2.346,2.346v.936a2.343,2.343,0,0,0,2.346,2.346h.05a2.341,2.341,0,0,0,2.333-2.308V21.4a2.343,2.343,0,0,1,2.346-2.346h.05a2.345,2.345,0,0,1,2.333,2.134c.012.075.012,2.183.012,2.183a2.351,2.351,0,0,0,2.346,2.346h.05a2.351,2.351,0,0,0,2.346-2.346v-5.5a2.343,2.343,0,0,1,2.346-2.346h.05a2.325,2.325,0,0,1,2.283,1.859l.05,8.547a2.343,2.343,0,0,0,2.346,2.346h.05a2.351,2.351,0,0,0,2.346-2.346V18.94a2.339,2.339,0,0,1,2.3-1.859h.05a2.351,2.351,0,0,1,2.346,2.346v.349a2.351,2.351,0,0,0,2.346,2.346h.05a2.351,2.351,0,0,0,2.346-2.346V14.785a2.351,2.351,0,0,1,2.346-2.346h.05a2.351,2.351,0,0,1,2.346,2.346v.936a2.343,2.343,0,0,0,2.346,2.346h.05a2.332,2.332,0,0,0,2.333-2.346V9.62h0a2.351,2.351,0,0,1,2.346-2.346h.05a2.351,2.351,0,0,1,2.346,2.346v1.946a2.343,2.343,0,0,0,2.346,2.346h.05a2.351,2.351,0,0,0,2.346-2.346v-5.5a2.338,2.338,0,0,1,2.333-2.333h.05a2.325,2.325,0,0,1,2.283,1.859l.05,8.547a2.338,2.338,0,0,0,2.333,2.333h.05a2.351,2.351,0,0,0,2.346-2.346V7.137a2.335,2.335,0,0,1,2.283-1.859h.05a2.351,2.351,0,0,1,2.346,2.346v.349a2.351,2.351,0,0,0,2.346,2.346h.05a2.351,2.351,0,0,0,2.346-2.346V2.982A2.351,2.351,0,0,1,167.863.636h.05a2.351,2.351,0,0,1,2.346,2.346v.936A2.351,2.351,0,0,0,172.6,6.263h.05A2.351,2.351,0,0,0,175,3.918Z" transform="translate(350 472)" fill="url(#theme_bookstore_linear-gradient_1)"/>
                <g transform="translate(390.97 504)">
                    <text transform="translate(49.03 14)" fill="#FFFFFF" font-size="20" font-family="DMSerifDisplay-Regular, DM Serif Display"><tspan x="-49.59" y="0">Entry Title</tspan></text>
                    <g transform="translate(3 26.877)" opacity="0.4">
                        <rect width="86.811" height="2" fill="#FFFFFF"/>
                        <rect width="71.811" height="2" transform="translate(8 5)" fill="#FFFFFF"/>
                    </g>
                </g>
            </g>
            <g>
                <rect width="175" height="98" transform="translate(525 472)" fill="#F6F6F6"/>
                <g transform="translate(525 472)" clip-path="url(#theme_bookstore_clip-path)">
                    <g transform="translate(48.271 -124.156)">
                        <g transform="translate(15.898 54.653)" opacity="0.4">
                            <path d="M118.566,62.767c0,14.016,2.255,19.245-4.753,31.383s-12.664,12.8-24.8,19.808-15.539,11.576-29.555,11.576S42.039,120.966,29.9,113.958,12.107,106.288,5.1,94.15.346,76.782.346,62.767-1.909,43.521,5.1,31.383s12.664-12.8,24.8-19.808S45.44,0,59.456,0,76.873,4.568,89.011,11.576s17.794,7.67,24.8,19.808,4.753,17.367,4.753,31.383" transform="translate(44.348 0) rotate(20.688)" fill="#3AADAA"/>
                        </g>
                        <g transform="translate(0 23.227)" opacity="0.4">
                            <path d="M142.28,75.32c0,16.819,2.706,23.094-5.7,37.66s-15.2,15.36-29.763,23.769S88.166,150.64,71.347,150.64s-20.9-5.481-35.466-13.891-21.353-9.2-29.763-23.769S.415,92.139.415,75.32s-2.706-23.094,5.7-37.66,15.2-15.36,29.763-23.769S54.528,0,71.347,0s20.9,5.481,35.466,13.891,21.353,9.2,29.763,23.769,5.7,20.841,5.7,37.66" transform="translate(99.574 0) rotate(41.377)" fill="#eaeaea"/>
                        </g>
                        <g transform="translate(22.816 0)" opacity="0.4">
                            <path d="M199.191,105.448c0,23.547,3.789,32.332-7.985,52.724s-21.276,21.5-41.668,33.277S123.433,210.9,99.886,210.9s-29.261-7.674-49.653-19.447S20.339,178.563,8.566,158.171.581,128.994.581,105.448-3.208,73.116,8.566,52.724s21.276-21.5,41.668-33.277S76.339,0,99.886,0s29.261,7.674,49.653,19.447,29.895,12.885,41.668,33.277,7.985,29.177,7.985,52.724" transform="translate(7.601 0) rotate(2.065)" fill="#3AADAA"/>
                        </g>
                    </g>
                </g>
                <g transform="translate(565.953 504)">
                    <text transform="translate(49.047 14)" fill="#3AADAA" font-size="20" font-family="DMSerifDisplay-Regular, DM Serif Display"><tspan x="-49.59" y="0">Entry Title</tspan></text>
                    <g transform="translate(3 26.877)" opacity="0.4">
                        <rect width="86.811" height="2" fill="#212529"/>
                        <rect width="71.811" height="2" transform="translate(8 5)" fill="#212529"/>
                    </g>
                </g>
            </g>
        </g>
        <g class="s_image_text">
            <rect width="700" height="221" fill="#F6F6F6" transform="translate(0 569)"/>
            <g transform="translate(350 629.832)">
                <g transform="translate(0 34.15)" opacity="0.4">
                    <rect width="233" height="2" fill="#212529"/>
                    <rect width="218" height="2" transform="translate(0 5)" fill="#212529"/>
                    <rect width="123" height="2" transform="translate(0 10)" fill="#212529"/>
                    <rect width="157" height="2" transform="translate(0 15)" fill="#212529"/>
                </g>
                <rect width="94" height="29" transform="translate(0 72.796)" fill="#3AADAA"/>
                <text transform="translate(78 19.168)" fill="#3AADAA" font-size="28" font-family="DMSerifDisplay-Regular, DM Serif Display"><tspan x="-77.546" y="0">Section Title</tspan></text>
                <text transform="translate(47 91.168)" fill="#FFFFFF" font-size="11" font-family="Arial-BoldMT, Arial" font-weight="700"><tspan x="-23.235" y="0">Discover</tspan></text>
            </g>
            <g transform="translate(70 596.004)">
                <path d="M346.57,188.121c-7.367,12.049-6.064,28.414-2.908,41.318,1.056,4.321,2.277,8.877,1.337,13.719-1.149,5.92-5.267,10.586-9.426,13.256-7.583,4.872-16.216,4.772-22.468-.257-5.412-4.347-8.955-11.951-14.475-16.063-9.249-6.881-21.986-2.631-33.067,3.889-7.84,4.61-16.469,10.446-23.678,7.194-5.073-2.288-8.21-8.791-9.664-15.877-.7-3.42-1.115-7.157-2.742-9.761a10.718,10.718,0,0,0-3.688-3.424c-12.641-7.706-29.814-1.145-42-9.88-8.229-5.9-12.872-18.134-14.356-31.233s-.171-27.13,1.467-40.946c1.171-9.817,2.744-20.329,7.851-28.334,5.4-8.467,13.878-12.273,21.228-11.515s13.714,5.474,19.193,11.234c6.848,7.2,13.01,16.4,21.9,18.7,6.049,1.562,12.686-.3,19.13-1.372,10.774-1.785,21.388-1.331,31.922-.724,10.087.581,20.237,1.32,29.624,4.889,6.643,2.525,11.727,7.821,17.921,11.251,4.038,2.236,8.6,2.5,12.362,5.492a18.915,18.915,0,0,1,6.723,19.143C356.96,177.038,350.478,181.728,346.57,188.121Z" transform="translate(-145.451 -91.408)" fill="#3AADAA" opacity="0.1"/>
                <path d="M311.962,160.423s-31.788-7.108,8.659-48.693c0,0,17.434,16.525,11.04,37.066a16.887,16.887,0,0,1-19.228,11.725Z" transform="translate(-248.382 -100.516)" fill="#3AADAA"/>
                <path d="M312.325,160.423c-.7-.156-31.11-7.81,8.659-48.693,0,0,17.434,16.525,11.04,37.066A16.887,16.887,0,0,1,312.8,160.521Z" transform="translate(-248.745 -100.516)" fill="#FFFFFF" opacity="0.4"/>
                <path d="M357,160.669s16.791-25.294,8.242-48.929" transform="translate(-292.998 -100.523)" fill="none" stroke="#535461" stroke-miterlimit="10" stroke-width="1"/>
                <path d="M953.925,198.634s-5.479-22.06,2.824-37.766a34.431,34.431,0,0,0,3.707-21.466,57.921,57.921,0,0,0-2.623-10.262" transform="translate(-759.572 -114.164)" fill="none" stroke="#535461" stroke-miterlimit="10" stroke-width="2"/>
                <path d="M967.31,64.866c-.115,2.67-5.28,10.2-5.28,10.2s-4.5-7.948-4.388-10.618a4.839,4.839,0,1,1,9.669.415Z" transform="translate(-763.875 -59.82)" fill="#3AADAA"/>
                <path d="M1000.249,125.484c-1.547,2.18-9.979,5.7-9.979,5.7s.54-9.119,2.087-11.3a4.839,4.839,0,1,1,7.891,5.6Z" transform="translate(-789.456 -105.308)" fill="#3AADAA"/>
                <path d="M988.139,236.546c-2.435,1.1-11.489-.119-11.489-.119s5.07-7.6,7.505-8.7a4.839,4.839,0,1,1,3.984,8.82Z" transform="translate(-778.778 -191.115)" fill="#3AADAA"/>
                <path d="M963.734,325.318c-2.214,1.495-11.344,1.823-11.344,1.823s3.714-8.346,5.928-9.843a4.839,4.839,0,1,1,5.417,8.02Z" transform="translate(-759.759 -261.022)" fill="#3AADAA"/>
                <path d="M938.392,150.382c1.834,1.944,10.674,4.252,10.674,4.252s-1.806-8.955-3.64-10.9a4.839,4.839,0,1,0-7.035,6.646Z" transform="translate(-747.749 -124.419)" fill="#3AADAA"/>
                <path d="M906.7,249.769c2.333,1.3,11.45.864,11.45.864s-4.392-8.006-6.728-9.309a4.839,4.839,0,0,0-4.723,8.445Z" transform="translate(-722.079 -201.672)" fill="#3AADAA"/>
                <path d="M895.393,354.563c2.078,1.679,11.146,2.787,11.146,2.787s-2.986-8.642-5.064-10.314a4.839,4.839,0,1,0-6.082,7.528Z" transform="translate(-713.666 -284.142)" fill="#3AADAA"/>
                <path d="M967.31,64.866c-.115,2.67-5.28,10.2-5.28,10.2s-4.5-7.948-4.388-10.618a4.839,4.839,0,1,1,9.669.415Z" transform="translate(-763.875 -59.82)" fill="#fc6681"/>
                <path d="M1000.249,125.484c-1.547,2.18-9.979,5.7-9.979,5.7s.54-9.119,2.087-11.3a4.839,4.839,0,1,1,7.891,5.6Z" transform="translate(-789.456 -105.308)" fill="#fc6681"/>
                <path d="M988.139,236.546c-2.435,1.1-11.489-.119-11.489-.119s5.07-7.6,7.505-8.7a4.839,4.839,0,1,1,3.984,8.82Z" transform="translate(-778.778 -191.115)" fill="#fc6681"/>
                <path d="M963.734,325.318c-2.214,1.495-11.344,1.823-11.344,1.823s3.714-8.346,5.928-9.843a4.839,4.839,0,1,1,5.417,8.02Z" transform="translate(-759.759 -261.022)" fill="#fc6681"/>
                <path d="M938.392,150.382c1.834,1.944,10.674,4.252,10.674,4.252s-1.806-8.955-3.64-10.9a4.839,4.839,0,1,0-7.035,6.646Z" transform="translate(-747.749 -124.419)" fill="#fc6681"/>
                <path d="M906.7,249.769c2.333,1.3,11.45.864,11.45.864s-4.392-8.006-6.728-9.309a4.839,4.839,0,0,0-4.723,8.445Z" transform="translate(-722.079 -201.672)" fill="#fc6681"/>
                <path d="M895.393,354.563c2.078,1.679,11.146,2.787,11.146,2.787s-2.986-8.642-5.064-10.314a4.839,4.839,0,1,0-6.082,7.528Z" transform="translate(-713.666 -284.142)" fill="#fc6681"/>
                <path d="M867.52,214.153S890.5,194.9,895.605,185.186a138.133,138.133,0,0,1,11.616-18.076" transform="translate(-693.225 -143.931)" fill="none" stroke="#535461" stroke-miterlimit="10" stroke-width="2"/>
                <path d="M1001.278,259.433l-9.938-2.243S993.682,267.677,1001.278,259.433Z" transform="translate(-790.295 -214.55)" fill="#3AADAA"/>
                <path d="M961.553,218l5.721,8.568S956.1,227.38,961.553,218Z" transform="translate(-765.766 -183.827)" fill="#3AADAA"/>
                <path d="M1022.467,224.5l-9.087-1.594S1019.09,231.593,1022.467,224.5Z" transform="translate(-807.573 -187.676)" fill="#3AADAA"/>
                <path d="M990.08,194.86l4.485,5.863S986.626,201.471,990.08,194.86Z" transform="translate(-788.624 -165.686)" fill="#3AADAA"/>
                <path d="M1035.14,189.45s7.745.369,8.642,1.108-1.154,5.073-4.1,4.366S1035.14,189.45,1035.14,189.45Z" transform="translate(-824.632 -161.445)" fill="#3AADAA"/>
                <path d="M1010.364,157.44s3.161,5.76,3.042,6.855-4.816,2.327-5.766-1.826A3.91,3.91,0,0,1,1010.364,157.44Z" transform="translate(-802.95 -136.35)" fill="#3AADAA"/>
                <circle cx="2.16" cy="2.16" r="2.16" transform="translate(213.007 25.579) rotate(-72.43)" fill="#ffd037"/>
                <circle cx="2.16" cy="2.16" r="2.16" transform="translate(209.626 23.376) rotate(-72.43)" fill="#ffd037"/>
                <path d="M260.223,159.225s9.29-6.913-2.376-31.11c0,0-15.555-19.228,0-37.375,0,0-33.918.864-33.27,32.406s16.959,36.079,16.959,36.079Z" transform="translate(-189.176 -84.06)" fill="#3AADAA"/>
                <path d="M306.277,159.2s-2.34-16.635-8.6-26.789a21.778,21.778,0,0,1-2.634-6.641,27.19,27.19,0,0,1,7.656-25.432l9.884-9.629" transform="translate(-243.906 -84.037)" fill="none" stroke="#535461" stroke-miterlimit="10" stroke-width="2"/>
                <path d="M457.856,150.69s2.134,2.791-.985,7-5.691,7.777-4.651,10.4c0,0,4.705-7.825,8.536-7.935S462.069,155.4,457.856,150.69Z" transform="translate(-367.462 -131.059)" fill="#3AADAA"/>
                <path d="M458.283,150.69a3.458,3.458,0,0,1,.432.875c3.737,4.39,5.727,8.488,2.137,8.592-3.346.1-7.36,6.079-8.322,7.59a3.249,3.249,0,0,0,.115.344s4.705-7.825,8.536-7.935S462.5,155.4,458.283,150.69Z" transform="translate(-367.89 -131.059)" opacity="0.1"/>
                <path d="M495.733,164.869c0,.983-.11,1.778-.246,1.778s-.246-.8-.246-1.778.138-.521.274-.521S495.733,163.889,495.733,164.869Z" transform="translate(-401.372 -141.682)" fill="#ffd037"/>
                <path d="M497.712,170.139c-.864.471-1.614.754-1.679.635s.581-.6,1.443-1.067.523-.127.588,0S498.574,169.668,497.712,170.139Z" transform="translate(-401.991 -145.778)" fill="#ffd037"/>
                <path d="M409.621,150.69s-2.134,2.791.985,7,5.691,7.777,4.651,10.4c0,0-4.705-7.825-8.536-7.935S405.4,155.4,409.621,150.69Z" transform="translate(-330.496 -131.059)" fill="#3AADAA"/>
                <path d="M409.609,150.69a3.456,3.456,0,0,0-.432.875c-3.738,4.39-5.727,8.488-2.137,8.592,3.346.1,7.361,6.079,8.322,7.59a3.235,3.235,0,0,1-.115.344s-4.712-7.827-8.542-7.933S405.392,155.4,409.609,150.69Z" transform="translate(-330.484 -131.059)" opacity="0.1"/>
                <path d="M408.62,164.869c0,.983.11,1.778.246,1.778s.246-.8.246-1.778-.138-.521-.274-.521S408.62,163.889,408.62,164.869Z" transform="translate(-333.466 -141.682)" fill="#ffd037"/>
                <path d="M400.417,170.139c.864.471,1.614.754,1.679.635s-.581-.6-1.443-1.067-.523-.127-.588,0S399.555,169.668,400.417,170.139Z" transform="translate(-326.624 -145.778)" fill="#ffd037"/>
                <path d="M293.75,307.042l-18.927-83.279h-7.032c-.281-3.182-.469-6.265-.54-9.169,0,0-25.493,5.578-45.822-10.56s-44.23,1.4-44.23,1.4l-.093-.067v.009c-1.659-1.175-24.555-16.866-44.131-1.324-20.321,16.138-45.822,10.56-45.822,10.56-.071,2.94-.261,6.049-.549,9.262H80.079L60.75,307.342s78.574,2.942,106.108.229c.987,2.087,5.243,3.655,10.342,3.655,5.729,0,10.389-1.981,10.551-4.45C209.185,308.407,255.306,311.015,293.75,307.042Z" transform="translate(-60.75 -167.525)" fill="url(#theme_bookstore_linear-gradient_2)"/>
                <path d="M90.923,323.175,72,404.912s104.168,3.9,112.557-1.56c0,0,64.667,6.535,115.582,1.268l-18.532-81.54Z" transform="translate(-69.57 -266.205)" fill="#e2e2ec"/>
                <path d="M125.372,336.261l-17.642,76.2s97.119,3.638,104.94-1.454c0,0,60.29,6.092,107.759,1.182L303.145,336.17Z" transform="translate(-97.58 -276.467)" opacity="0.1"/>
                <path d="M311.362,219.76s-24.97,5.462-44.867-10.34-43.308,1.365-43.308,1.365-23.408-17.167-43.305-1.365-44.867,10.34-44.867,10.34c-.786,31.8-15.6,83.3-15.6,83.3s27.31,7.412,63.4-7.607,40.38,5.267,40.38,5.267,4.291-20.288,40.38-5.267,63.4,7.607,63.4,7.607S312.142,251.557,311.362,219.76Z" transform="translate(-106.737 -171.86)" fill="#f1f2fb"/>
                <path d="M376.75,646.817s32.968-7.412,48.177,3.511c0,0,14.63-13.265,48.572-2.925" transform="translate(-308.481 -517.37)" opacity="0.1"/>
                <ellipse cx="10.34" cy="4.487" rx="10.34" ry="4.487" transform="translate(106.111 133.537)" fill="#e8eaf8"/>
                <path d="M599.32,239.55s7.412,37.649.194,90.709" transform="translate(-482.967 -200.721)" opacity="0.1"/>
                <path d="M224.7,308.144s15.527,3.608,28.967,0,38.116-15.41,46.233,0" transform="translate(-189.28 -248.441)" fill="none" stroke="#000" stroke-miterlimit="10" stroke-width="1" opacity="0.1"/>
                <path d="M224.7,357.314s15.527,3.608,28.967,0,42.541-3.413,46.233,0" transform="translate(-189.28 -290.979)" fill="none" stroke="#000" stroke-miterlimit="10" stroke-width="1" opacity="0.1"/>
                <path d="M224.7,392.974s15.527,3.608,28.967,0,38.116-15.41,46.233,0" transform="translate(-189.28 -314.944)" fill="none" stroke="#000" stroke-miterlimit="10" stroke-width="1" opacity="0.1"/>
                <path d="M224.7,442.184s15.527,3.608,28.967,0,42.541-3.413,46.233,0" transform="translate(-189.28 -357.513)" fill="none" stroke="#000" stroke-miterlimit="10" stroke-width="1" opacity="0.1"/>
                <path d="M701.969,308.144s-15.527,3.608-28.967,0-38.116-15.41-46.233,0" transform="translate(-504.487 -248.441)" fill="none" stroke="#000" stroke-miterlimit="10" stroke-width="1" opacity="0.1"/>
                <path d="M701.969,357.314s-15.527,3.608-28.967,0-42.541-3.413-46.233,0" transform="translate(-504.487 -290.979)" fill="none" stroke="#000" stroke-miterlimit="10" stroke-width="1" opacity="0.1"/>
                <path d="M701.969,392.974s-15.527,3.608-28.967,0-38.116-15.41-46.233,0" transform="translate(-504.487 -314.944)" fill="none" stroke="#000" stroke-miterlimit="10" stroke-width="1" opacity="0.1"/>
                <path d="M701.969,442.184s-15.527,3.608-28.967,0-42.541-3.413-46.233,0" transform="translate(-504.487 -357.513)" fill="none" stroke="#000" stroke-miterlimit="10" stroke-width="1" opacity="0.1"/>
                <path d="M925.216,756.048a3.687,3.687,0,0,0,1.452-1.787,1.512,1.512,0,0,0-1.013-1.819,3.252,3.252,0,0,0-2.681.767,3.95,3.95,0,0,1-2.605,1.026,2.9,2.9,0,0,0,1.227-3.025,1.173,1.173,0,0,0-.341-.616,1.938,1.938,0,0,0-2.072.1c-1.968,1.13-2.517,3.31-2.528,5.274a8.215,8.215,0,0,1-.037-2.173,2.07,2.07,0,0,0-1-1.923,3.575,3.575,0,0,0-1.525-.292,3.664,3.664,0,0,0-2.474.575,1.727,1.727,0,0,0,.1,2.478,9.528,9.528,0,0,0,2.56,1.674,5.332,5.332,0,0,1,1.83,1.424,1.3,1.3,0,0,1,.136.255h5.546a15.943,15.943,0,0,0,3.429-1.936Z" transform="translate(-727.417 -601.154)" fill="#3AADAA"/>
                <path d="M786.6,218.9s.054.311.145.864c-.047.086-.095.173-.145.257-1.772,2.981-2.044,7.276-1.877,10.8A35.345,35.345,0,0,0,786.2,239.2a39.179,39.179,0,0,1,1.512,10.888,7.918,7.918,0,0,0,2.48,1.806c.047.145.1.292.14.432a44.159,44.159,0,0,1,1.648,8.341l.557,7.056s4.271,15.97,5.569,18.94c.925,2.113.722,6.481.527,8.823-.555,1.575-1.231,3.076-1.828,3.241-1.08.307-2.16,2.908-.588,4.215h0a2.509,2.509,0,0,0,.378.259l.063.035.115.058.169.076.086.032.179.061.078.024c.084.024.171.048.264.069a4.716,4.716,0,0,0,3.206-.508,6.468,6.468,0,0,0,3.025-1.454l-.022,1.126h1.3l-.06-2.249c.233-.261.363-.432.363-.432s.039-1.359.188-2.94l-.1,5.075h1.3l-.35-9.365a1.5,1.5,0,0,1,.257-.382c1.08-1.08-.786-4.565-1.752-5.146.432-2.29,2.08-5.6,3.982-11.938,2.785-9.29-.743-18.383-.743-18.383v-7.129c.936-.4,1.486-.676,1.486-.676s-1.3-7.613,0-13a20.162,20.162,0,0,0,.357-9.53c.933-3.215,1.687-5.7,1.687-5.7l1.3-13.369c.331-2.007.553-3.725.7-5.185.024-.181.041-.365.05-.547a27.288,27.288,0,0,0,.03-5.725,9.074,9.074,0,0,0,.078-1.644,6.488,6.488,0,0,0,.035-.849c.186-.216.367-.432.54-.648a9.317,9.317,0,0,0,1.165-1.858,7.45,7.45,0,0,0-.525-8.359c-1.227-1.463-1.609-3.038-2.67-4.6a10.886,10.886,0,0,1-1.387-4.777,58.482,58.482,0,0,0-1.188-6.064c-.149-.588-.966-.948-1.372-1.437-.784-.944-3.074-.912-4.394-1.121-2.217-.352-4.617-.681-6.635.19a13.708,13.708,0,0,0-3.511,2.685c-1.182,1.048-3.6,1.553-3.977,2.809-.335.48-.352,1.08.216,1.884a9.11,9.11,0,0,0,2.219,1.905c.1.073.2.151.3.216a7.89,7.89,0,0,0,4.288,8.348q-.032.211-.071.415a25.013,25.013,0,0,1-.977,3.567c-.24.717-3.014,1.97-4.969,2.774a2.486,2.486,0,0,0-.793-.547c-1.486-.372-6.5,2.413-6.87,3.342a3.777,3.777,0,0,0,.611,1.88,6.706,6.706,0,0,0,.2,1.218,42.159,42.159,0,0,0,1.046,9.9Zm20.848,2.089c-.069-.132-.14-.266-.216-.4-2.063-4.172-3.288-10.917-.333-14.939.264.028.527.054.791.071.175,5.474.073,14.475.073,14.475S807.643,220.492,807.444,220.987Zm-7.365,31.8c.419,2.106.912,4.554,1.372,6.779a17.825,17.825,0,0,1-.108,7.847l-1.746-5.237-.406-9.214-.026-.378q.421-.071.836-.153Z" transform="translate(-627.143 -141.8)" fill="url(#theme_bookstore_linear-gradient_3)"/>
                <path d="M858.886,559.95a17.547,17.547,0,0,1-.106,7.724,9.992,9.992,0,0,1-.432,1.415l.493,20.027.056,2.271a11.432,11.432,0,0,0,1.383.2,6.276,6.276,0,0,0,1.3,0,1.549,1.549,0,0,0,1.015-.432c.2-.248.246-.648-.041-1.229a3.655,3.655,0,0,1-.352-2.063c.017-.2.05-.408.089-.624.432-2.253,2.046-5.511,3.919-11.75,2.742-9.138-.73-18.093-.73-18.093v-8.413l-8.955-.914s.432,2.264,1.026,5.206C857.948,555.351,858.432,557.759,858.886,559.95Z" transform="translate(-684.601 -442.588)" fill="#fdc2cc"/>
                <path d="M858.886,559.95a17.547,17.547,0,0,1-.106,7.724,9.992,9.992,0,0,1-.432,1.415l.493,20.027.056,2.271a11.432,11.432,0,0,0,1.383.2,6.276,6.276,0,0,0,1.3,0,1.549,1.549,0,0,0,1.015-.432c.2-.248.246-.648-.041-1.229a3.655,3.655,0,0,1-.352-2.063c.017-.2.05-.408.089-.624.432-2.253,2.046-5.511,3.919-11.75,2.742-9.138-.73-18.093-.73-18.093v-8.413l-8.955-.914s.432,2.264,1.026,5.206C857.948,555.351,858.432,557.759,858.886,559.95Z" transform="translate(-684.601 -442.588)" opacity="0.1"/>
                <path d="M809.94,552.3a27.445,27.445,0,0,1,1.484,3.852,43.472,43.472,0,0,1,1.622,8.21l.549,6.946s4.2,15.717,5.483,18.642c.91,2.08.711,6.38.518,8.689-.078.938-.153,1.547-.153,1.547l1.864-2.284,2.443-3,1.115-1.368.244-.3a11.225,11.225,0,0,1-.713-1.908h0a32.61,32.61,0,0,1-1.113-6.125c-.549-5.665-.73-13.343-.73-13.343l-.289-.864-1.728-5.166-.4-9.074-.149-3.359Z" transform="translate(-648.084 -445.905)" fill="#fdc2cc"/>
                <path d="M853.652,730.255a13,13,0,0,0-2.173,4.3c-.581,1.977-1.6,5.014-2.461,5.258-1.279.365-2.558,4.021.73,4.753s6.032-2.925,6.032-2.925.184-6.4,1.279-7.492-.914-4.753-1.828-5.118C854.866,728.879,854.248,729.484,853.652,730.255Z" transform="translate(-677.659 -584.434)" fill="#5f5d7e"/>
                <path d="M851.472,744.027a4.4,4.4,0,0,0,2.567-.233,5.736,5.736,0,0,0,3.591-4.928c.156-1.957.484-4.589,1.151-5.256.864-.864-.216-3.327-1.145-4.5a.5.5,0,0,1,.413-.065c.914.365,2.925,4.021,1.828,5.118s-1.279,7.492-1.279,7.492-2.737,3.655-6.028,2.921a3.024,3.024,0,0,1-1.309-.6C851.329,743.99,851.4,744.01,851.472,744.027Z" transform="translate(-680.478 -584.446)" opacity="0.1"/>
                <path d="M886.587,752.286l.352,9.441H885.66l.177-9.434a.363.363,0,0,1,.376-.344h0A.363.363,0,0,1,886.587,752.286Z" transform="translate(-707.446 -602.421)" fill="#5f5d7e"/>
                <path d="M886.587,752.286l.352,9.441H885.66l.177-9.434a.363.363,0,0,1,.376-.344h0A.363.363,0,0,1,886.587,752.286Z" transform="translate(-707.446 -602.421)" opacity="0.15"/>
                <path d="M846.042,732.791a13,13,0,0,0-2.173,4.3c-.581,1.977-1.6,5.014-2.461,5.258-1.279.365-2.558,4.021.73,4.753s6.032-2.93,6.032-2.93.184-6.4,1.279-7.492-.914-4.753-1.828-5.118C847.252,731.423,846.638,732.02,846.042,732.791Z" transform="translate(-671.693 -586.421)" fill="#5f5d7e"/>
                <path d="M843.854,746.547a4.4,4.4,0,0,0,2.567-.233,5.736,5.736,0,0,0,3.591-4.928c.156-1.957.484-4.589,1.152-5.256.864-.864-.216-3.327-1.145-4.5a.5.5,0,0,1,.413-.065c.914.365,2.925,4.02,1.828,5.118s-1.277,7.492-1.277,7.492-2.742,3.655-6.032,2.925a3.024,3.024,0,0,1-1.309-.6C843.718,746.514,843.78,746.534,843.854,746.547Z" transform="translate(-674.504 -586.422)" opacity="0.1"/>
                <path d="M878.935,754.775l.352,9.441H878l.177-9.435a.363.363,0,0,1,.376-.344h0A.363.363,0,0,1,878.935,754.775Z" transform="translate(-701.441 -604.372)" fill="#5f5d7e"/>
                <path d="M878.935,754.775l.352,9.441H878l.177-9.435a.363.363,0,0,1,.376-.344h0A.363.363,0,0,1,878.935,754.775Z" transform="translate(-701.441 -604.372)" opacity="0.15"/>
                <path d="M810.79,242.427l7.311,11.515,8.59,1.1s5.3-10.417,5.118-10.966-2.925-1.644-5.483-3.655.549-10.417.549-10.417l-8.406.73c.032.112.065.216.089.341a10.906,10.906,0,0,1-.041,4.379,24.628,24.628,0,0,1-.964,3.5C817.187,240.05,810.79,242.427,810.79,242.427Z" transform="translate(-648.751 -193.234)" fill="#fdc2cc"/>
                <path d="M856.47,548.07s.432,2.264,1.026,5.206a41.926,41.926,0,0,0,7.931-2.532v-1.761Z" transform="translate(-684.562 -442.588)" opacity="0.1"/>
                <path d="M809.94,552.3a27.445,27.445,0,0,1,1.484,3.852c2.543,1.147,5.706,1.115,8.715.6l-.149-3.359Z" transform="translate(-648.084 -445.905)" opacity="0.1"/>
                <path d="M787.772,312c-1.743,2.936-2.011,7.16-1.847,10.642a34.781,34.781,0,0,0,1.46,8.248,38.564,38.564,0,0,1,1.491,10.718c6.213,6.762,21.565-.914,21.565-.914s-1.279-7.492,0-12.794a19.164,19.164,0,0,0,.177-10.044,15.828,15.828,0,0,0-1.821-4.029c-.242-.385-.477-.81-.7-1.266-2.117-4.282-3.34-11.316.065-15.2a7.1,7.1,0,0,1,1.188-1.08,12.211,12.211,0,0,0,4.891-6.557,8.816,8.816,0,0,0,.216-3.861c-.365-2.011-5.483-3.839-5.483-3.839.184,6.032-7.492,11.148-7.492,11.148s-8.773-11.331-10.234-11.7-6.4,2.376-6.762,3.29,4.02,7.676,4.02,7.676S791.246,306.151,787.772,312Z" transform="translate(-628.109 -233.566)" fill="#d39999"/>
                <path d="M894.185,313.65a12.211,12.211,0,0,0,4.891-6.557c-.143-3.025-.864-3.493-.864-3.493s-6.038,5.846-5.49,7.864a20.892,20.892,0,0,1,.274,3.275A7.1,7.1,0,0,1,894.185,313.65Z" transform="translate(-712.954 -250.934)" opacity="0.1"/>
                <path d="M851.576,450.869c1.279,3.839,7.676-2.925,7.86-5.848.117-1.871,2.18-9.205,3.649-14.246a15.832,15.832,0,0,0-1.821-4.029c-.242-.385-.477-.81-.7-1.266-.693,1.7-3.478,8.691-3.316,10.77a17.6,17.6,0,0,1-1.1,5.848S850.3,447.03,851.576,450.869Z" transform="translate(-680.582 -346.483)" opacity="0.1"/>
                <path d="M867.521,303.59s2.011,1.279,0,13.524l-1.279,13.159s-4.934,16.266-5.118,19.191-6.578,9.685-7.86,5.848,4.569-8.773,4.569-8.773a17.664,17.664,0,0,0,1.1-5.848c-.181-2.376,3.472-11.148,3.472-11.148s.184-16.082-.365-18.093S867.521,303.59,867.521,303.59Z" transform="translate(-681.905 -250.926)" fill="#fdc2cc"/>
                <path d="M790.887,296.82s-2.376.549,0,12.794l1.463,13.343s3.29,19.191,3.107,21.388,7.129,7.86,7.676,4.753-3.655-8.225-3.655-8.225-1.832-4.027-1.832-11.521l-.365-6.032-2.556-21.747Z" transform="translate(-632.32 -245.619)" opacity="0.1"/>
                <path d="M789.167,296.82s-2.376.549,0,12.794l1.463,13.343s3.29,19.191,3.107,21.388,7.129,7.86,7.676,4.753-3.655-8.225-3.655-8.225-1.828-4.021-1.828-11.515l-.365-6.032-2.554-21.753Z" transform="translate(-630.971 -245.619)" fill="#fdc2cc"/>
                <path d="M787.333,294.926s-1.1,5.848,6.578,7.86-.914-6.948-.914-6.948S790.075,291.454,787.333,294.926Z" transform="translate(-630.319 -243.085)" opacity="0.1"/>
                <path d="M788.174,294.083s-1.1,5.846,6.581,7.857-.914-6.946-.914-6.946S790.916,290.609,788.174,294.083Z" transform="translate(-630.978 -242.423)" fill="#d39999"/>
                <path d="M888.282,294.926s1.1,5.848-6.578,7.86.912-6.948.912-6.948S885.532,291.454,888.282,294.926Z" transform="translate(-701.843 -243.085)" opacity="0.1"/>
                <path d="M887.42,294.083s1.106,5.846-6.578,7.857.914-6.946.914-6.946S884.678,290.609,887.42,294.083Z" transform="translate(-701.165 -242.423)" fill="#d39999"/>
                <path d="M846.55,236.766c1.009.294,2.139-2.07,3.331-2.07,1.264,0,2.454,2.53,3.508,1.994a31.676,31.676,0,0,1,1.335-5.01l-8.134.717A10.891,10.891,0,0,1,846.55,236.766Z" transform="translate(-676.785 -194.552)" opacity="0.1"/>
                <circle cx="7.767" cy="7.767" r="7.767" transform="translate(165.513 27.078)" fill="#fdc2cc"/>
                <path d="M814.2,178.645a9.189,9.189,0,0,0,2.184,1.875,23.992,23.992,0,0,1,2.77,2.318,8.188,8.188,0,0,1,1.549,1.918,8.76,8.76,0,0,1,.771,3.716l.754,13.077a8.347,8.347,0,0,1-.121,2.592,8.859,8.859,0,0,1-.935,2.048,17.964,17.964,0,0,1-3.623,4.969c-.536.464-1.188,1.065-.905,1.674.229.49.933.648,1.538.719,2.539.341,5.351.633,7.488-.6a12.715,12.715,0,0,1,2.376-1.426c1.257-.4,2.644.017,3.984.015a12.5,12.5,0,0,0,4.1-.94,1.471,1.471,0,0,0,.674-.38A1.126,1.126,0,0,0,837,209.7a6.554,6.554,0,0,0,.063-3.2c-.357-1.126-1.3-2.1-1.4-3.262-.138-1.616,1.352-2.932,2.424-4.26,2.281-2.828,2.789-6.9.447-9.689-1.208-1.439-1.586-2.99-2.629-4.522a10.7,10.7,0,0,1-1.365-4.7,57.573,57.573,0,0,0-1.171-5.969c-.145-.579-.951-.933-1.35-1.415-.773-.929-3.025-.9-4.321-1.1-2.182-.346-4.537-.67-6.531.188a13.5,13.5,0,0,0-3.457,2.642C816.182,175.774,812.471,176.2,814.2,178.645Z" transform="translate(-651.073 -147.153)" opacity="0.1"/>
                <path d="M815.05,176.955a9.191,9.191,0,0,0,2.184,1.875,24,24,0,0,1,2.77,2.322,8.186,8.186,0,0,1,1.549,1.918,8.76,8.76,0,0,1,.771,3.716l.76,13.073a8.34,8.34,0,0,1-.121,2.592,8.854,8.854,0,0,1-.935,2.048,17.964,17.964,0,0,1-3.623,4.969c-.536.464-1.188,1.065-.905,1.674.229.49.933.648,1.538.719,2.538.341,5.351.633,7.488-.6a12.722,12.722,0,0,1,2.376-1.426c1.257-.4,2.644.017,3.984.015a12.5,12.5,0,0,0,4.1-.94,1.47,1.47,0,0,0,.674-.38,1.125,1.125,0,0,0,.192-.516,6.555,6.555,0,0,0,.063-3.2c-.356-1.126-1.3-2.1-1.4-3.262-.138-1.616,1.352-2.932,2.424-4.26,2.281-2.828,2.789-6.9.447-9.689-1.208-1.439-1.586-2.99-2.629-4.522a10.7,10.7,0,0,1-1.365-4.7,57.585,57.585,0,0,0-1.171-5.969c-.145-.579-.951-.933-1.35-1.415-.773-.929-3.025-.9-4.321-1.1-2.182-.346-4.537-.67-6.531.188a13.5,13.5,0,0,0-3.457,2.642C817.018,174.084,813.318,174.512,815.05,176.955Z" transform="translate(-651.736 -145.828)" fill="#865a61"/>
            </g>
            <path d="M699.95,541.99H0V529.985c134.39,8.851,268.481,17.55,340.776,1.323,6.1-1.373,12.3-2.543,18.549-3.662,170.038-29.911,211.385-6.155,340.676,2.34V541.99Z" transform="translate(0 248.01)" fill="#383E45"/>
        </g>
        <rect width="700" height="807" transform="translate(0 788)" fill="#383E45"/>
        <g class="s_picture">
            <text transform="translate(350 852)" fill="#FFFFFF" font-size="28" font-family="DMSerifDisplay-Regular, DM Serif Display"><tspan x="-77.546" y="0">Section Title</tspan></text>
            <g transform="translate(307.294 867.505)" opacity="0.4">
                <rect width="86.811" height="2" fill="#FFFFFF"/>
                <rect width="71.811" height="2" transform="translate(8 5)" fill="#FFFFFF"/>
            </g>
            <g transform="translate(210 897.628)">
                <rect class="img_reference_s_picture_default_image" fill="url(#theme_bookstore_s_picture_default_image_id)" width="280" height="280" stroke="none"/>
                <rect x="4" y="4" width="272" height="272" fill="none" stroke="#FFFFFF" stroke-linejoin="round" stroke-width="8"/>
            </g>
            <rect width="71.811" height="2" transform="translate(315.294 1186.751)" fill="#FFFFFF" opacity="0.4"/>
        </g>
        <g class="s_product_list">
            <rect class="img_reference_s_product_list_default_image_1" fill="url(#theme_bookstore_s_product_list_default_image_1_id)" width="158" height="158" transform="translate(70 1220)"/>
            <rect class="img_reference_s_product_list_default_image_2" fill="url(#theme_bookstore_s_product_list_default_image_2_id)" width="158" height="158" transform="translate(271 1220)"/>
            <rect class="img_reference_s_product_list_default_image_5" fill="url(#theme_bookstore_s_product_list_default_image_5_id)" width="158" height="158" transform="translate(472 1220)"/>
            <rect class="img_reference_s_product_list_default_image_3" fill="url(#theme_bookstore_s_product_list_default_image_3_id)" width="158" height="158" transform="translate(70 1398)"/>
            <rect class="img_reference_s_product_list_default_image_4" fill="url(#theme_bookstore_s_product_list_default_image_4_id)" width="158" height="158" transform="translate(271 1398)"/>
            <rect class="img_reference_s_product_list_default_image_6" fill="url(#theme_bookstore_s_product_list_default_image_6_id)" width="158" height="158" transform="translate(472 1398)"/>
            <rect width="122" height="19.745" transform="translate(88 1368.128)" fill="#3AADAA"/>
            <path d="M34.127,83.141c.774,0,.774,0,1.219.327s.445.327.52.891l-1.038.064-.017-.065a.364.364,0,0,0-.1-.176.423.423,0,0,0-.229-.173.551.551,0,0,0-.34-.065.57.57,0,0,0-.444.11c-.18.11-.18.11-.18.293,0,.146,0,.146.116.248s.117.1.4.162l.739.149.144.033c.488.123.488.123.744.361.293.271.293.271.293.713a.77.77,0,0,1-.236.7,1.047,1.047,0,0,1-.643.472,1.646,1.646,0,0,1-.94.169c-.812,0-.812,0-1.292-.339s-.48-.339-.562-.924l1.115-.059.02.079c.062.19.062.19.225.3.193.129.193.129.5.129s.3,0,.48-.116.182-.116.185-.3c0-.154,0-.154-.13-.253s-.128-.1-.394-.153l-.708-.141-.144-.033c-.49-.124-.49-.124-.745-.382-.291-.3-.291-.3-.291-.753a.754.754,0,0,1,.214-.678c.214-.285.214-.285.6-.439a1.667,1.667,0,0,1,.914-.154Zm4.422,0a1.434,1.434,0,0,1,.936.195,1.064,1.064,0,0,1,.635.545,1.1,1.1,0,0,1,.259.825H39.31l-.019-.1a.551.551,0,0,0-.219-.395c-.193-.187-.193-.187-.5-.187a.522.522,0,0,0-.459.142c-.2.142-.2.142-.3.413a1.184,1.184,0,0,0-.109.657,1.222,1.222,0,0,0,.108.665c.108.274.108.274.3.417a.525.525,0,0,0,.46.143.517.517,0,0,0,.35-.079.47.47,0,0,0,.258-.233.6.6,0,0,0,.134-.368h1.069l-.014.153a1.1,1.1,0,0,1-.24.671,1.057,1.057,0,0,1-.626.554,1.411,1.411,0,0,1-.944.2,1.414,1.414,0,0,1-1.078-.267,1.215,1.215,0,0,1-.692-.743,2.614,2.614,0,0,1,0-2.2,1.231,1.231,0,0,1,.692-.742,1.4,1.4,0,0,1,1.069-.267Zm4.436,0a1.409,1.409,0,0,1,1.07.266,1.219,1.219,0,0,1,.7.739,2.613,2.613,0,0,1,0,2.21,1.223,1.223,0,0,1-.7.739,1.414,1.414,0,0,1-1.07.264,1.417,1.417,0,0,1-1.071-.264,1.227,1.227,0,0,1-.7-.739,2.613,2.613,0,0,1,0-2.21,1.223,1.223,0,0,1,.7-.739,1.41,1.41,0,0,1,1.071-.266Zm8.747,0a1.453,1.453,0,0,1,.754.129,1.153,1.153,0,0,1,.611.387,1.192,1.192,0,0,1,.409.647,1.737,1.737,0,0,1,.146.912v.311H50.87v0l0,.118a.718.718,0,0,0,.109.406.555.555,0,0,0,.32.34.658.658,0,0,0,.492.12.722.722,0,0,0,.346-.053.485.485,0,0,0,.268-.159.474.474,0,0,0,.17-.261l1.049.069-.031.123a.956.956,0,0,1-.295.535,1.106,1.106,0,0,1-.633.436,1.589,1.589,0,0,1-.892.157,1.467,1.467,0,0,1-1.084-.257,1.188,1.188,0,0,1-.7-.729,2.647,2.647,0,0,1,0-2.225,1.234,1.234,0,0,1,.69-.742,1.367,1.367,0,0,1,1.046-.266ZM26.886,81.834l.2.005a1.88,1.88,0,0,1,1.213.32,1.528,1.528,0,0,1,.914.935,3.491,3.491,0,0,1,0,2.92,1.521,1.521,0,0,1-.918.939,1.985,1.985,0,0,1-1.426.327H24.939V81.834h1.947ZM31.53,83.2v4.085H30.4V83.2Zm14.974,0,.848,2.923h.043L48.24,83.2h1.2l-1.428,4.085H46.735L45.307,83.2Zm10.043-.059a1.121,1.121,0,0,1,.184.011.81.81,0,0,1,.173.029v1l-.06-.015a1.242,1.242,0,0,0-.161-.027,1.287,1.287,0,0,0-.257-.019.615.615,0,0,0-.446.108.544.544,0,0,0-.308.3.578.578,0,0,0-.113.441v2.311H54.425V83.2h1.1v.713h.043l.035-.1c.114-.3.114-.3.34-.471a.681.681,0,0,1,.606-.2Zm-13.557.869c-.285,0-.285,0-.477.163a.668.668,0,0,0-.291.441,2.137,2.137,0,0,0,0,1.271.667.667,0,0,0,.29.441c.193.161.193.161.477.161s.282,0,.471-.161a.674.674,0,0,0,.286-.441,2.137,2.137,0,0,0,0-1.271.68.68,0,0,0-.286-.441C43.272,84.006,43.272,84.006,42.99,84.006ZM26.824,82.82H26.09v3.474h.731a1.246,1.246,0,0,0,.861-.182c.35-.182.35-.182.527-.566a2.857,2.857,0,0,0,0-1.98c-.177-.383-.177-.383-.526-.564A1.248,1.248,0,0,0,26.824,82.82ZM51.75,83.987a.6.6,0,0,0-.456.118.58.58,0,0,0-.309.317.589.589,0,0,0-.109.345l0,.058h1.714l0-.1a.564.564,0,0,0-.1-.338.529.529,0,0,0-.294-.3.583.583,0,0,0-.434-.108ZM30.966,81.522c.255,0,.255,0,.435.169s.179.169.179.4,0,.237-.179.406-.18.169-.432.169a.428.428,0,0,1-.434-.169c-.18-.169-.18-.169-.18-.406s0-.234.18-.4A.426.426,0,0,1,30.966,81.522Z" transform="translate(108.401 1293.55)" fill="#FFFFFF" fill-rule="evenodd"/>
            <rect width="122" height="19.745" transform="translate(88 1546.128)" fill="#3AADAA"/>
            <path d="M34.127,83.141c.774,0,.774,0,1.219.327s.445.327.52.891l-1.038.064-.017-.065a.364.364,0,0,0-.1-.176.423.423,0,0,0-.229-.173.551.551,0,0,0-.34-.065.57.57,0,0,0-.444.11c-.18.11-.18.11-.18.293,0,.146,0,.146.116.248s.117.1.4.162l.739.149.144.033c.488.123.488.123.744.361.293.271.293.271.293.713a.77.77,0,0,1-.236.7,1.047,1.047,0,0,1-.643.472,1.646,1.646,0,0,1-.94.169c-.812,0-.812,0-1.292-.339s-.48-.339-.562-.924l1.115-.059.02.079c.062.19.062.19.225.3.193.129.193.129.5.129s.3,0,.48-.116.182-.116.185-.3c0-.154,0-.154-.13-.253s-.128-.1-.394-.153l-.708-.141-.144-.033c-.49-.124-.49-.124-.745-.382-.291-.3-.291-.3-.291-.753a.754.754,0,0,1,.214-.678c.214-.285.214-.285.6-.439a1.667,1.667,0,0,1,.914-.154Zm4.422,0a1.434,1.434,0,0,1,.936.195,1.064,1.064,0,0,1,.635.545,1.1,1.1,0,0,1,.259.825H39.31l-.019-.1a.551.551,0,0,0-.219-.395c-.193-.187-.193-.187-.5-.187a.522.522,0,0,0-.459.142c-.2.142-.2.142-.3.413a1.184,1.184,0,0,0-.109.657,1.222,1.222,0,0,0,.108.665c.108.274.108.274.3.417a.525.525,0,0,0,.46.143.517.517,0,0,0,.35-.079.47.47,0,0,0,.258-.233.6.6,0,0,0,.134-.368h1.069l-.014.153a1.1,1.1,0,0,1-.24.671,1.057,1.057,0,0,1-.626.554,1.411,1.411,0,0,1-.944.2,1.414,1.414,0,0,1-1.078-.267,1.215,1.215,0,0,1-.692-.743,2.614,2.614,0,0,1,0-2.2,1.231,1.231,0,0,1,.692-.742,1.4,1.4,0,0,1,1.069-.267Zm4.436,0a1.409,1.409,0,0,1,1.07.266,1.219,1.219,0,0,1,.7.739,2.613,2.613,0,0,1,0,2.21,1.223,1.223,0,0,1-.7.739,1.414,1.414,0,0,1-1.07.264,1.417,1.417,0,0,1-1.071-.264,1.227,1.227,0,0,1-.7-.739,2.613,2.613,0,0,1,0-2.21,1.223,1.223,0,0,1,.7-.739,1.41,1.41,0,0,1,1.071-.266Zm8.747,0a1.453,1.453,0,0,1,.754.129,1.153,1.153,0,0,1,.611.387,1.192,1.192,0,0,1,.409.647,1.737,1.737,0,0,1,.146.912v.311H50.87v0l0,.118a.718.718,0,0,0,.109.406.555.555,0,0,0,.32.34.658.658,0,0,0,.492.12.722.722,0,0,0,.346-.053.485.485,0,0,0,.268-.159.474.474,0,0,0,.17-.261l1.049.069-.031.123a.956.956,0,0,1-.295.535,1.106,1.106,0,0,1-.633.436,1.589,1.589,0,0,1-.892.157,1.467,1.467,0,0,1-1.084-.257,1.188,1.188,0,0,1-.7-.729,2.647,2.647,0,0,1,0-2.225,1.234,1.234,0,0,1,.69-.742,1.367,1.367,0,0,1,1.046-.266ZM26.886,81.834l.2.005a1.88,1.88,0,0,1,1.213.32,1.528,1.528,0,0,1,.914.935,3.491,3.491,0,0,1,0,2.92,1.521,1.521,0,0,1-.918.939,1.985,1.985,0,0,1-1.426.327H24.939V81.834h1.947ZM31.53,83.2v4.085H30.4V83.2Zm14.974,0,.848,2.923h.043L48.24,83.2h1.2l-1.428,4.085H46.735L45.307,83.2Zm10.043-.059a1.121,1.121,0,0,1,.184.011.81.81,0,0,1,.173.029v1l-.06-.015a1.242,1.242,0,0,0-.161-.027,1.287,1.287,0,0,0-.257-.019.615.615,0,0,0-.446.108.544.544,0,0,0-.308.3.578.578,0,0,0-.113.441v2.311H54.425V83.2h1.1v.713h.043l.035-.1c.114-.3.114-.3.34-.471a.681.681,0,0,1,.606-.2Zm-13.557.869c-.285,0-.285,0-.477.163a.668.668,0,0,0-.291.441,2.137,2.137,0,0,0,0,1.271.667.667,0,0,0,.29.441c.193.161.193.161.477.161s.282,0,.471-.161a.674.674,0,0,0,.286-.441,2.137,2.137,0,0,0,0-1.271.68.68,0,0,0-.286-.441C43.272,84.006,43.272,84.006,42.99,84.006ZM26.824,82.82H26.09v3.474h.731a1.246,1.246,0,0,0,.861-.182c.35-.182.35-.182.527-.566a2.857,2.857,0,0,0,0-1.98c-.177-.383-.177-.383-.526-.564A1.248,1.248,0,0,0,26.824,82.82ZM51.75,83.987a.6.6,0,0,0-.456.118.58.58,0,0,0-.309.317.589.589,0,0,0-.109.345l0,.058h1.714l0-.1a.564.564,0,0,0-.1-.338.529.529,0,0,0-.294-.3.583.583,0,0,0-.434-.108ZM30.966,81.522c.255,0,.255,0,.435.169s.179.169.179.4,0,.237-.179.406-.18.169-.432.169a.428.428,0,0,1-.434-.169c-.18-.169-.18-.169-.18-.406s0-.234.18-.4A.426.426,0,0,1,30.966,81.522Z" transform="translate(108.401 1471.55)" fill="#FFFFFF" fill-rule="evenodd"/>
            <rect width="122" height="19.745" transform="translate(490 1368.128)" fill="#3AADAA"/>
            <path d="M34.127,83.141c.774,0,.774,0,1.219.327s.445.327.52.891l-1.038.064-.017-.065a.364.364,0,0,0-.1-.176.423.423,0,0,0-.229-.173.551.551,0,0,0-.34-.065.57.57,0,0,0-.444.11c-.18.11-.18.11-.18.293,0,.146,0,.146.116.248s.117.1.4.162l.739.149.144.033c.488.123.488.123.744.361.293.271.293.271.293.713a.77.77,0,0,1-.236.7,1.047,1.047,0,0,1-.643.472,1.646,1.646,0,0,1-.94.169c-.812,0-.812,0-1.292-.339s-.48-.339-.562-.924l1.115-.059.02.079c.062.19.062.19.225.3.193.129.193.129.5.129s.3,0,.48-.116.182-.116.185-.3c0-.154,0-.154-.13-.253s-.128-.1-.394-.153l-.708-.141-.144-.033c-.49-.124-.49-.124-.745-.382-.291-.3-.291-.3-.291-.753a.754.754,0,0,1,.214-.678c.214-.285.214-.285.6-.439a1.667,1.667,0,0,1,.914-.154Zm4.422,0a1.434,1.434,0,0,1,.936.195,1.064,1.064,0,0,1,.635.545,1.1,1.1,0,0,1,.259.825H39.31l-.019-.1a.551.551,0,0,0-.219-.395c-.193-.187-.193-.187-.5-.187a.522.522,0,0,0-.459.142c-.2.142-.2.142-.3.413a1.184,1.184,0,0,0-.109.657,1.222,1.222,0,0,0,.108.665c.108.274.108.274.3.417a.525.525,0,0,0,.46.143.517.517,0,0,0,.35-.079.47.47,0,0,0,.258-.233.6.6,0,0,0,.134-.368h1.069l-.014.153a1.1,1.1,0,0,1-.24.671,1.057,1.057,0,0,1-.626.554,1.411,1.411,0,0,1-.944.2,1.414,1.414,0,0,1-1.078-.267,1.215,1.215,0,0,1-.692-.743,2.614,2.614,0,0,1,0-2.2,1.231,1.231,0,0,1,.692-.742,1.4,1.4,0,0,1,1.069-.267Zm4.436,0a1.409,1.409,0,0,1,1.07.266,1.219,1.219,0,0,1,.7.739,2.613,2.613,0,0,1,0,2.21,1.223,1.223,0,0,1-.7.739,1.414,1.414,0,0,1-1.07.264,1.417,1.417,0,0,1-1.071-.264,1.227,1.227,0,0,1-.7-.739,2.613,2.613,0,0,1,0-2.21,1.223,1.223,0,0,1,.7-.739,1.41,1.41,0,0,1,1.071-.266Zm8.747,0a1.453,1.453,0,0,1,.754.129,1.153,1.153,0,0,1,.611.387,1.192,1.192,0,0,1,.409.647,1.737,1.737,0,0,1,.146.912v.311H50.87v0l0,.118a.718.718,0,0,0,.109.406.555.555,0,0,0,.32.34.658.658,0,0,0,.492.12.722.722,0,0,0,.346-.053.485.485,0,0,0,.268-.159.474.474,0,0,0,.17-.261l1.049.069-.031.123a.956.956,0,0,1-.295.535,1.106,1.106,0,0,1-.633.436,1.589,1.589,0,0,1-.892.157,1.467,1.467,0,0,1-1.084-.257,1.188,1.188,0,0,1-.7-.729,2.647,2.647,0,0,1,0-2.225,1.234,1.234,0,0,1,.69-.742,1.367,1.367,0,0,1,1.046-.266ZM26.886,81.834l.2.005a1.88,1.88,0,0,1,1.213.32,1.528,1.528,0,0,1,.914.935,3.491,3.491,0,0,1,0,2.92,1.521,1.521,0,0,1-.918.939,1.985,1.985,0,0,1-1.426.327H24.939V81.834h1.947ZM31.53,83.2v4.085H30.4V83.2Zm14.974,0,.848,2.923h.043L48.24,83.2h1.2l-1.428,4.085H46.735L45.307,83.2Zm10.043-.059a1.121,1.121,0,0,1,.184.011.81.81,0,0,1,.173.029v1l-.06-.015a1.242,1.242,0,0,0-.161-.027,1.287,1.287,0,0,0-.257-.019.615.615,0,0,0-.446.108.544.544,0,0,0-.308.3.578.578,0,0,0-.113.441v2.311H54.425V83.2h1.1v.713h.043l.035-.1c.114-.3.114-.3.34-.471a.681.681,0,0,1,.606-.2Zm-13.557.869c-.285,0-.285,0-.477.163a.668.668,0,0,0-.291.441,2.137,2.137,0,0,0,0,1.271.667.667,0,0,0,.29.441c.193.161.193.161.477.161s.282,0,.471-.161a.674.674,0,0,0,.286-.441,2.137,2.137,0,0,0,0-1.271.68.68,0,0,0-.286-.441C43.272,84.006,43.272,84.006,42.99,84.006ZM26.824,82.82H26.09v3.474h.731a1.246,1.246,0,0,0,.861-.182c.35-.182.35-.182.527-.566a2.857,2.857,0,0,0,0-1.98c-.177-.383-.177-.383-.526-.564A1.248,1.248,0,0,0,26.824,82.82ZM51.75,83.987a.6.6,0,0,0-.456.118.58.58,0,0,0-.309.317.589.589,0,0,0-.109.345l0,.058h1.714l0-.1a.564.564,0,0,0-.1-.338.529.529,0,0,0-.294-.3.583.583,0,0,0-.434-.108ZM30.966,81.522c.255,0,.255,0,.435.169s.179.169.179.4,0,.237-.179.406-.18.169-.432.169a.428.428,0,0,1-.434-.169c-.18-.169-.18-.169-.18-.406s0-.234.18-.4A.426.426,0,0,1,30.966,81.522Z" transform="translate(510.401 1293.55)" fill="#FFFFFF" fill-rule="evenodd"/>
            <rect width="122" height="19.745" transform="translate(490 1546.128)" fill="#3AADAA"/>
            <path d="M34.127,83.141c.774,0,.774,0,1.219.327s.445.327.52.891l-1.038.064-.017-.065a.364.364,0,0,0-.1-.176.423.423,0,0,0-.229-.173.551.551,0,0,0-.34-.065.57.57,0,0,0-.444.11c-.18.11-.18.11-.18.293,0,.146,0,.146.116.248s.117.1.4.162l.739.149.144.033c.488.123.488.123.744.361.293.271.293.271.293.713a.77.77,0,0,1-.236.7,1.047,1.047,0,0,1-.643.472,1.646,1.646,0,0,1-.94.169c-.812,0-.812,0-1.292-.339s-.48-.339-.562-.924l1.115-.059.02.079c.062.19.062.19.225.3.193.129.193.129.5.129s.3,0,.48-.116.182-.116.185-.3c0-.154,0-.154-.13-.253s-.128-.1-.394-.153l-.708-.141-.144-.033c-.49-.124-.49-.124-.745-.382-.291-.3-.291-.3-.291-.753a.754.754,0,0,1,.214-.678c.214-.285.214-.285.6-.439a1.667,1.667,0,0,1,.914-.154Zm4.422,0a1.434,1.434,0,0,1,.936.195,1.064,1.064,0,0,1,.635.545,1.1,1.1,0,0,1,.259.825H39.31l-.019-.1a.551.551,0,0,0-.219-.395c-.193-.187-.193-.187-.5-.187a.522.522,0,0,0-.459.142c-.2.142-.2.142-.3.413a1.184,1.184,0,0,0-.109.657,1.222,1.222,0,0,0,.108.665c.108.274.108.274.3.417a.525.525,0,0,0,.46.143.517.517,0,0,0,.35-.079.47.47,0,0,0,.258-.233.6.6,0,0,0,.134-.368h1.069l-.014.153a1.1,1.1,0,0,1-.24.671,1.057,1.057,0,0,1-.626.554,1.411,1.411,0,0,1-.944.2,1.414,1.414,0,0,1-1.078-.267,1.215,1.215,0,0,1-.692-.743,2.614,2.614,0,0,1,0-2.2,1.231,1.231,0,0,1,.692-.742,1.4,1.4,0,0,1,1.069-.267Zm4.436,0a1.409,1.409,0,0,1,1.07.266,1.219,1.219,0,0,1,.7.739,2.613,2.613,0,0,1,0,2.21,1.223,1.223,0,0,1-.7.739,1.414,1.414,0,0,1-1.07.264,1.417,1.417,0,0,1-1.071-.264,1.227,1.227,0,0,1-.7-.739,2.613,2.613,0,0,1,0-2.21,1.223,1.223,0,0,1,.7-.739,1.41,1.41,0,0,1,1.071-.266Zm8.747,0a1.453,1.453,0,0,1,.754.129,1.153,1.153,0,0,1,.611.387,1.192,1.192,0,0,1,.409.647,1.737,1.737,0,0,1,.146.912v.311H50.87v0l0,.118a.718.718,0,0,0,.109.406.555.555,0,0,0,.32.34.658.658,0,0,0,.492.12.722.722,0,0,0,.346-.053.485.485,0,0,0,.268-.159.474.474,0,0,0,.17-.261l1.049.069-.031.123a.956.956,0,0,1-.295.535,1.106,1.106,0,0,1-.633.436,1.589,1.589,0,0,1-.892.157,1.467,1.467,0,0,1-1.084-.257,1.188,1.188,0,0,1-.7-.729,2.647,2.647,0,0,1,0-2.225,1.234,1.234,0,0,1,.69-.742,1.367,1.367,0,0,1,1.046-.266ZM26.886,81.834l.2.005a1.88,1.88,0,0,1,1.213.32,1.528,1.528,0,0,1,.914.935,3.491,3.491,0,0,1,0,2.92,1.521,1.521,0,0,1-.918.939,1.985,1.985,0,0,1-1.426.327H24.939V81.834h1.947ZM31.53,83.2v4.085H30.4V83.2Zm14.974,0,.848,2.923h.043L48.24,83.2h1.2l-1.428,4.085H46.735L45.307,83.2Zm10.043-.059a1.121,1.121,0,0,1,.184.011.81.81,0,0,1,.173.029v1l-.06-.015a1.242,1.242,0,0,0-.161-.027,1.287,1.287,0,0,0-.257-.019.615.615,0,0,0-.446.108.544.544,0,0,0-.308.3.578.578,0,0,0-.113.441v2.311H54.425V83.2h1.1v.713h.043l.035-.1c.114-.3.114-.3.34-.471a.681.681,0,0,1,.606-.2Zm-13.557.869c-.285,0-.285,0-.477.163a.668.668,0,0,0-.291.441,2.137,2.137,0,0,0,0,1.271.667.667,0,0,0,.29.441c.193.161.193.161.477.161s.282,0,.471-.161a.674.674,0,0,0,.286-.441,2.137,2.137,0,0,0,0-1.271.68.68,0,0,0-.286-.441C43.272,84.006,43.272,84.006,42.99,84.006ZM26.824,82.82H26.09v3.474h.731a1.246,1.246,0,0,0,.861-.182c.35-.182.35-.182.527-.566a2.857,2.857,0,0,0,0-1.98c-.177-.383-.177-.383-.526-.564A1.248,1.248,0,0,0,26.824,82.82ZM51.75,83.987a.6.6,0,0,0-.456.118.58.58,0,0,0-.309.317.589.589,0,0,0-.109.345l0,.058h1.714l0-.1a.564.564,0,0,0-.1-.338.529.529,0,0,0-.294-.3.583.583,0,0,0-.434-.108ZM30.966,81.522c.255,0,.255,0,.435.169s.179.169.179.4,0,.237-.179.406-.18.169-.432.169a.428.428,0,0,1-.434-.169c-.18-.169-.18-.169-.18-.406s0-.234.18-.4A.426.426,0,0,1,30.966,81.522Z" transform="translate(510.401 1471.55)" fill="#FFFFFF" fill-rule="evenodd"/>
            <rect width="122" height="19.745" transform="translate(289 1368.128)" fill="#3AADAA"/>
            <path d="M34.127,83.141c.774,0,.774,0,1.219.327s.445.327.52.891l-1.038.064-.017-.065a.364.364,0,0,0-.1-.176.423.423,0,0,0-.229-.173.551.551,0,0,0-.34-.065.57.57,0,0,0-.444.11c-.18.11-.18.11-.18.293,0,.146,0,.146.116.248s.117.1.4.162l.739.149.144.033c.488.123.488.123.744.361.293.271.293.271.293.713a.77.77,0,0,1-.236.7,1.047,1.047,0,0,1-.643.472,1.646,1.646,0,0,1-.94.169c-.812,0-.812,0-1.292-.339s-.48-.339-.562-.924l1.115-.059.02.079c.062.19.062.19.225.3.193.129.193.129.5.129s.3,0,.48-.116.182-.116.185-.3c0-.154,0-.154-.13-.253s-.128-.1-.394-.153l-.708-.141-.144-.033c-.49-.124-.49-.124-.745-.382-.291-.3-.291-.3-.291-.753a.754.754,0,0,1,.214-.678c.214-.285.214-.285.6-.439a1.667,1.667,0,0,1,.914-.154Zm4.422,0a1.434,1.434,0,0,1,.936.195,1.064,1.064,0,0,1,.635.545,1.1,1.1,0,0,1,.259.825H39.31l-.019-.1a.551.551,0,0,0-.219-.395c-.193-.187-.193-.187-.5-.187a.522.522,0,0,0-.459.142c-.2.142-.2.142-.3.413a1.184,1.184,0,0,0-.109.657,1.222,1.222,0,0,0,.108.665c.108.274.108.274.3.417a.525.525,0,0,0,.46.143.517.517,0,0,0,.35-.079.47.47,0,0,0,.258-.233.6.6,0,0,0,.134-.368h1.069l-.014.153a1.1,1.1,0,0,1-.24.671,1.057,1.057,0,0,1-.626.554,1.411,1.411,0,0,1-.944.2,1.414,1.414,0,0,1-1.078-.267,1.215,1.215,0,0,1-.692-.743,2.614,2.614,0,0,1,0-2.2,1.231,1.231,0,0,1,.692-.742,1.4,1.4,0,0,1,1.069-.267Zm4.436,0a1.409,1.409,0,0,1,1.07.266,1.219,1.219,0,0,1,.7.739,2.613,2.613,0,0,1,0,2.21,1.223,1.223,0,0,1-.7.739,1.414,1.414,0,0,1-1.07.264,1.417,1.417,0,0,1-1.071-.264,1.227,1.227,0,0,1-.7-.739,2.613,2.613,0,0,1,0-2.21,1.223,1.223,0,0,1,.7-.739,1.41,1.41,0,0,1,1.071-.266Zm8.747,0a1.453,1.453,0,0,1,.754.129,1.153,1.153,0,0,1,.611.387,1.192,1.192,0,0,1,.409.647,1.737,1.737,0,0,1,.146.912v.311H50.87v0l0,.118a.718.718,0,0,0,.109.406.555.555,0,0,0,.32.34.658.658,0,0,0,.492.12.722.722,0,0,0,.346-.053.485.485,0,0,0,.268-.159.474.474,0,0,0,.17-.261l1.049.069-.031.123a.956.956,0,0,1-.295.535,1.106,1.106,0,0,1-.633.436,1.589,1.589,0,0,1-.892.157,1.467,1.467,0,0,1-1.084-.257,1.188,1.188,0,0,1-.7-.729,2.647,2.647,0,0,1,0-2.225,1.234,1.234,0,0,1,.69-.742,1.367,1.367,0,0,1,1.046-.266ZM26.886,81.834l.2.005a1.88,1.88,0,0,1,1.213.32,1.528,1.528,0,0,1,.914.935,3.491,3.491,0,0,1,0,2.92,1.521,1.521,0,0,1-.918.939,1.985,1.985,0,0,1-1.426.327H24.939V81.834h1.947ZM31.53,83.2v4.085H30.4V83.2Zm14.974,0,.848,2.923h.043L48.24,83.2h1.2l-1.428,4.085H46.735L45.307,83.2Zm10.043-.059a1.121,1.121,0,0,1,.184.011.81.81,0,0,1,.173.029v1l-.06-.015a1.242,1.242,0,0,0-.161-.027,1.287,1.287,0,0,0-.257-.019.615.615,0,0,0-.446.108.544.544,0,0,0-.308.3.578.578,0,0,0-.113.441v2.311H54.425V83.2h1.1v.713h.043l.035-.1c.114-.3.114-.3.34-.471a.681.681,0,0,1,.606-.2Zm-13.557.869c-.285,0-.285,0-.477.163a.668.668,0,0,0-.291.441,2.137,2.137,0,0,0,0,1.271.667.667,0,0,0,.29.441c.193.161.193.161.477.161s.282,0,.471-.161a.674.674,0,0,0,.286-.441,2.137,2.137,0,0,0,0-1.271.68.68,0,0,0-.286-.441C43.272,84.006,43.272,84.006,42.99,84.006ZM26.824,82.82H26.09v3.474h.731a1.246,1.246,0,0,0,.861-.182c.35-.182.35-.182.527-.566a2.857,2.857,0,0,0,0-1.98c-.177-.383-.177-.383-.526-.564A1.248,1.248,0,0,0,26.824,82.82ZM51.75,83.987a.6.6,0,0,0-.456.118.58.58,0,0,0-.309.317.589.589,0,0,0-.109.345l0,.058h1.714l0-.1a.564.564,0,0,0-.1-.338.529.529,0,0,0-.294-.3.583.583,0,0,0-.434-.108ZM30.966,81.522c.255,0,.255,0,.435.169s.179.169.179.4,0,.237-.179.406-.18.169-.432.169a.428.428,0,0,1-.434-.169c-.18-.169-.18-.169-.18-.406s0-.234.18-.4A.426.426,0,0,1,30.966,81.522Z" transform="translate(309.401 1293.55)" fill="#FFFFFF" fill-rule="evenodd"/>
            <rect width="122" height="19.745" transform="translate(289 1546.128)" fill="#3AADAA"/>
            <path d="M34.127,83.141c.774,0,.774,0,1.219.327s.445.327.52.891l-1.038.064-.017-.065a.364.364,0,0,0-.1-.176.423.423,0,0,0-.229-.173.551.551,0,0,0-.34-.065.57.57,0,0,0-.444.11c-.18.11-.18.11-.18.293,0,.146,0,.146.116.248s.117.1.4.162l.739.149.144.033c.488.123.488.123.744.361.293.271.293.271.293.713a.77.77,0,0,1-.236.7,1.047,1.047,0,0,1-.643.472,1.646,1.646,0,0,1-.94.169c-.812,0-.812,0-1.292-.339s-.48-.339-.562-.924l1.115-.059.02.079c.062.19.062.19.225.3.193.129.193.129.5.129s.3,0,.48-.116.182-.116.185-.3c0-.154,0-.154-.13-.253s-.128-.1-.394-.153l-.708-.141-.144-.033c-.49-.124-.49-.124-.745-.382-.291-.3-.291-.3-.291-.753a.754.754,0,0,1,.214-.678c.214-.285.214-.285.6-.439a1.667,1.667,0,0,1,.914-.154Zm4.422,0a1.434,1.434,0,0,1,.936.195,1.064,1.064,0,0,1,.635.545,1.1,1.1,0,0,1,.259.825H39.31l-.019-.1a.551.551,0,0,0-.219-.395c-.193-.187-.193-.187-.5-.187a.522.522,0,0,0-.459.142c-.2.142-.2.142-.3.413a1.184,1.184,0,0,0-.109.657,1.222,1.222,0,0,0,.108.665c.108.274.108.274.3.417a.525.525,0,0,0,.46.143.517.517,0,0,0,.35-.079.47.47,0,0,0,.258-.233.6.6,0,0,0,.134-.368h1.069l-.014.153a1.1,1.1,0,0,1-.24.671,1.057,1.057,0,0,1-.626.554,1.411,1.411,0,0,1-.944.2,1.414,1.414,0,0,1-1.078-.267,1.215,1.215,0,0,1-.692-.743,2.614,2.614,0,0,1,0-2.2,1.231,1.231,0,0,1,.692-.742,1.4,1.4,0,0,1,1.069-.267Zm4.436,0a1.409,1.409,0,0,1,1.07.266,1.219,1.219,0,0,1,.7.739,2.613,2.613,0,0,1,0,2.21,1.223,1.223,0,0,1-.7.739,1.414,1.414,0,0,1-1.07.264,1.417,1.417,0,0,1-1.071-.264,1.227,1.227,0,0,1-.7-.739,2.613,2.613,0,0,1,0-2.21,1.223,1.223,0,0,1,.7-.739,1.41,1.41,0,0,1,1.071-.266Zm8.747,0a1.453,1.453,0,0,1,.754.129,1.153,1.153,0,0,1,.611.387,1.192,1.192,0,0,1,.409.647,1.737,1.737,0,0,1,.146.912v.311H50.87v0l0,.118a.718.718,0,0,0,.109.406.555.555,0,0,0,.32.34.658.658,0,0,0,.492.12.722.722,0,0,0,.346-.053.485.485,0,0,0,.268-.159.474.474,0,0,0,.17-.261l1.049.069-.031.123a.956.956,0,0,1-.295.535,1.106,1.106,0,0,1-.633.436,1.589,1.589,0,0,1-.892.157,1.467,1.467,0,0,1-1.084-.257,1.188,1.188,0,0,1-.7-.729,2.647,2.647,0,0,1,0-2.225,1.234,1.234,0,0,1,.69-.742,1.367,1.367,0,0,1,1.046-.266ZM26.886,81.834l.2.005a1.88,1.88,0,0,1,1.213.32,1.528,1.528,0,0,1,.914.935,3.491,3.491,0,0,1,0,2.92,1.521,1.521,0,0,1-.918.939,1.985,1.985,0,0,1-1.426.327H24.939V81.834h1.947ZM31.53,83.2v4.085H30.4V83.2Zm14.974,0,.848,2.923h.043L48.24,83.2h1.2l-1.428,4.085H46.735L45.307,83.2Zm10.043-.059a1.121,1.121,0,0,1,.184.011.81.81,0,0,1,.173.029v1l-.06-.015a1.242,1.242,0,0,0-.161-.027,1.287,1.287,0,0,0-.257-.019.615.615,0,0,0-.446.108.544.544,0,0,0-.308.3.578.578,0,0,0-.113.441v2.311H54.425V83.2h1.1v.713h.043l.035-.1c.114-.3.114-.3.34-.471a.681.681,0,0,1,.606-.2Zm-13.557.869c-.285,0-.285,0-.477.163a.668.668,0,0,0-.291.441,2.137,2.137,0,0,0,0,1.271.667.667,0,0,0,.29.441c.193.161.193.161.477.161s.282,0,.471-.161a.674.674,0,0,0,.286-.441,2.137,2.137,0,0,0,0-1.271.68.68,0,0,0-.286-.441C43.272,84.006,43.272,84.006,42.99,84.006ZM26.824,82.82H26.09v3.474h.731a1.246,1.246,0,0,0,.861-.182c.35-.182.35-.182.527-.566a2.857,2.857,0,0,0,0-1.98c-.177-.383-.177-.383-.526-.564A1.248,1.248,0,0,0,26.824,82.82ZM51.75,83.987a.6.6,0,0,0-.456.118.58.58,0,0,0-.309.317.589.589,0,0,0-.109.345l0,.058h1.714l0-.1a.564.564,0,0,0-.1-.338.529.529,0,0,0-.294-.3.583.583,0,0,0-.434-.108ZM30.966,81.522c.255,0,.255,0,.435.169s.179.169.179.4,0,.237-.179.406-.18.169-.432.169a.428.428,0,0,1-.434-.169c-.18-.169-.18-.169-.18-.406s0-.234.18-.4A.426.426,0,0,1,30.966,81.522Z" transform="translate(309.401 1471.55)" fill="#FFFFFF" fill-rule="evenodd"/>
            <path d="M699.95,541.99H0V529.985c134.39,8.851,268.481,17.55,340.776,1.323,6.1-1.373,12.3-2.543,18.549-3.662,170.038-29.911,211.385-6.155,340.676,2.34V541.99Z" transform="translate(700 2135.493) rotate(180)" fill="#383E45"/>
        </g>
        <g class="s_call_to_action" transform="translate(16 -50.497)">
            <rect width="94" height="29" transform="translate(287 1731.628)" fill="#3AADAA"/>
            <text transform="translate(334 1712.497)" fill="#212529" font-size="28" font-family="DMSerifDisplay-Regular, DM Serif Display"><tspan x="-77.546" y="0">Section Title</tspan></text>
            <text transform="translate(334 1750.497)" fill="#FFFFFF" font-size="11" font-family="Arial-BoldMT, Arial" font-weight="700"><tspan x="-23.235" y="0">Discover</tspan></text>
        </g>
        <g class="svgc_footer">
            <rect width="700" height="112" transform="translate(0 1738)" class="svgc_footer_bg" fill="#FOOTER_COLOR"/>
            <rect width="47" height="2" transform="translate(70 1808)" fill="#FOOTER_COLOR" class="svgc_text" filter="url(#filter_readability_bookstore)"/>
            <rect width="39" height="2" transform="translate(70 1813)" fill="#FOOTER_COLOR" class="svgc_text" filter="url(#filter_readability_bookstore)"/>
            <rect width="47" height="2" transform="translate(163 1808)" fill="#FOOTER_COLOR" class="svgc_text" filter="url(#filter_readability_bookstore)"/>
            <rect width="39" height="2" transform="translate(163 1813)" fill="#FOOTER_COLOR" class="svgc_text" filter="url(#filter_readability_bookstore)"/>
            <rect width="47" height="2" transform="translate(256 1808)" fill="#FOOTER_COLOR" class="svgc_text" filter="url(#filter_readability_bookstore)"/>
            <rect width="39" height="2" transform="translate(256 1813)" fill="#FOOTER_COLOR" class="svgc_text" filter="url(#filter_readability_bookstore)"/>
            <rect width="47" height="2" transform="translate(70 1797)" fill="#FOOTER_COLOR" class="svgc_text" filter="url(#filter_readability_bookstore)"/>
            <rect width="39" height="2" transform="translate(70 1802)" fill="#FOOTER_COLOR" class="svgc_text" filter="url(#filter_readability_bookstore)"/>
            <rect width="47" height="2" transform="translate(163 1797)" fill="#FOOTER_COLOR" class="svgc_text" filter="url(#filter_readability_bookstore)"/>
            <rect width="39" height="2" transform="translate(163 1802)" fill="#FOOTER_COLOR" class="svgc_text" filter="url(#filter_readability_bookstore)"/>
            <rect width="47" height="2" transform="translate(256 1797)" fill="#FOOTER_COLOR" class="svgc_text" filter="url(#filter_readability_bookstore)"/>
            <rect width="39" height="2" transform="translate(256 1802)" fill="#FOOTER_COLOR" class="svgc_text" filter="url(#filter_readability_bookstore)"/>
            <rect width="47" height="2" transform="translate(70 1786)" fill="#FOOTER_COLOR" class="svgc_text" filter="url(#filter_readability_bookstore)"/>
            <rect width="39" height="2" transform="translate(70 1791)" fill="#FOOTER_COLOR" class="svgc_text" filter="url(#filter_readability_bookstore)"/>
            <rect width="47" height="2" transform="translate(163 1786)" fill="#FOOTER_COLOR" class="svgc_text" filter="url(#filter_readability_bookstore)"/>
            <rect width="39" height="2" transform="translate(163 1791)" fill="#FOOTER_COLOR" class="svgc_text" filter="url(#filter_readability_bookstore)"/>
            <rect width="47" height="2" transform="translate(256 1786)" fill="#FOOTER_COLOR" class="svgc_text" filter="url(#filter_readability_bookstore)"/>
            <rect width="39" height="2" transform="translate(256 1791)" fill="#FOOTER_COLOR" class="svgc_text" filter="url(#filter_readability_bookstore)"/>
            <rect width="72" height="2" transform="translate(350 1786)" fill="#FOOTER_COLOR" class="svgc_text" filter="url(#filter_readability_bookstore)"/>
            <rect width="60" height="2" transform="translate(350 1791)" fill="#FOOTER_COLOR" class="svgc_text" filter="url(#filter_readability_bookstore)"/>
            <g transform="translate(490 1786)" opacity="0.4">
                <rect width="140" height="2" fill="#FOOTER_COLOR" class="svgc_text" filter="url(#filter_readability_bookstore)"/>
                <rect width="125" height="2" transform="translate(0 5)" fill="#FOOTER_COLOR" class="svgc_text" filter="url(#filter_readability_bookstore)"/>
                <rect width="79" height="2" transform="translate(0 10)" fill="#FOOTER_COLOR" class="svgc_text" filter="url(#filter_readability_bookstore)"/>
                <rect width="91" height="2" transform="translate(0 15)" fill="#FOOTER_COLOR" class="svgc_text" filter="url(#filter_readability_bookstore)"/>
            </g>
            <rect width="47" height="4" transform="translate(70 1772)" fill="#FOOTER_COLOR" class="svgc_text" opacity="1" filter="url(#filter_readability_bookstore)"/>
            <rect width="47" height="4" transform="translate(163 1772)" fill="#FOOTER_COLOR" class="svgc_text" opacity="1" filter="url(#filter_readability_bookstore)"/>
            <rect width="47" height="4" transform="translate(256 1772)" fill="#FOOTER_COLOR" class="svgc_text" opacity="1" filter="url(#filter_readability_bookstore)"/>
            <rect width="47" height="4" transform="translate(350 1772)" fill="#FOOTER_COLOR" class="svgc_text" opacity="1" filter="url(#filter_readability_bookstore)"/>
            <rect width="47" height="4" transform="translate(490 1772)" fill="#FOOTER_COLOR" class="svgc_text" opacity="1" filter="url(#filter_readability_bookstore)"/>
        </g>
    </g>
</svg>
