<svg xmlns="http://www.w3.org/2000/svg" xmlns:xlink="http://www.w3.org/1999/xlink" width="700" height="1850" viewBox="0 0 700 1850">
    <defs>
        <linearGradient id="theme_kiddo_linear-gradient" x1="0.167" x2="0.573" y2="1" gradientUnits="objectBoundingBox">
            <stop offset="0" stop-opacity="0.5"/>
            <stop offset="1" stop-opacity="0.15"/>
        </linearGradient>
        <style type="text/css">
            @import url('https://fonts.googleapis.com/css2?family=Varela+Round&amp;display=swap');
        </style>
        <pattern width="1" height="1" patternunits="objectBoundingBox" id="theme_kiddo_s_banner_default_image_id">
            <image preserveAspectRatio="xMidYMid slice" width="700" height="348" href="#s_banner_default_image_url"/>
        </pattern>
        <pattern width="1" height="1" patternunits="objectBoundingBox" id="theme_kiddo_s_image_text_default_image_id">
            <image preserveAspectRatio="xMidYMid slice" width="280" height="156" href="#s_image_text_default_image_url"/>
        </pattern>
        <pattern width="1" height="1" patternunits="objectBoundingBox" id="theme_kiddo_s_three_columns_default_image_1_id">
            <image preserveAspectRatio="xMidYMid slice" width="164" height="210" href="#s_three_columns_default_image_1_url"/>
        </pattern>
        <pattern width="1" height="1" patternunits="objectBoundingBox" id="theme_kiddo_s_three_columns_default_image_2_id">
            <image preserveAspectRatio="xMidYMid slice" width="164" height="210" href="#s_three_columns_default_image_2_url"/>
        </pattern>
        <pattern width="1" height="1" patternunits="objectBoundingBox" id="theme_kiddo_s_three_columns_default_image_3_id">
            <image preserveAspectRatio="xMidYMid slice" width="164" height="210" href="#s_three_columns_default_image_3_url"/>
        </pattern>
        <filter id="filter_readability_kiddo">
            <feColorMatrix in="SourceGraphic" type="saturate" values="0"/>
            <feComponentTransfer>
            <feFuncR type="table" tableValues="1 0"/>
            <feFuncG type="table" tableValues="1 0"/>
            <feFuncB type="table" tableValues="1 0"/>
            </feComponentTransfer>
            <feComponentTransfer>
            <feFuncR type="linear" slope="10000" intercept="-4999.5"/>
            <feFuncG type="linear" slope="10000" intercept="-4999.5"/>
            <feFuncB type="linear" slope="10000" intercept="-4999.5"/>
            </feComponentTransfer>
        </filter>
    </defs>
    <g fill="none" fill-rule="evenodd" class="theme_kiddo">
        <rect width="700" height="1850" fill="#FFFFFF"/>
        <g class="svgc_menu">
            <rect class="svgc_menu_bg" fill="#MENU_COLOR" width="700" height="37"/>
            <path opacity="1" filter="url(#filter_readability_kiddo)" fill="#MENU_COLOR" fill-rule="nonzero" d="M76.345 23v-1.521h-3.741v-7.206h-1.845V23h5.586zm4.68.12c.77 0 1.463-.176 2.08-.527.619-.35 1.107-.86 1.467-1.528.36-.667.539-1.477.539-2.429 0-.951-.18-1.761-.54-2.429-.359-.667-.847-1.176-1.465-1.527-.618-.351-1.312-.527-2.082-.527-.775 0-1.471.176-2.088.527-.616.35-1.104.86-1.461 1.527-.358.668-.537 1.478-.537 2.43 0 .948.179 1.756.537 2.424a3.753 3.753 0 0 0 1.461 1.53c.617.352 1.313.528 2.088.528zm0-1.633a2.08 2.08 0 0 1-1.168-.328c-.333-.219-.59-.54-.774-.963-.183-.423-.275-.943-.275-1.56 0-.616.092-1.136.275-1.56.183-.423.441-.744.774-.962a2.075 2.075 0 0 1 1.167-.328c.446 0 .835.109 1.168.328.332.218.59.54.773.963.184.423.275.943.275 1.56 0 .616-.091 1.136-.275 1.559-.183.423-.44.744-.773.963a2.075 2.075 0 0 1-1.168.328zm9.277 1.632c.733 0 1.384-.148 1.952-.445a3.292 3.292 0 0 0 1.338-1.27c.324-.55.486-1.208.486-1.975v-1.1h-3.652v1.39h1.872l-.004.126c-.017.237-.07.452-.157.645l-.073.14a1.591 1.591 0 0 1-.682.633c-.296.15-.654.224-1.071.224-.46 0-.86-.111-1.198-.334-.338-.223-.6-.548-.784-.974-.184-.426-.277-.943-.277-1.551s.094-1.123.281-1.545c.188-.422.45-.744.787-.965a2.086 2.086 0 0 1 1.174-.332c.238 0 .456.03.654.089.197.06.373.146.528.258.155.112.286.248.394.409.108.16.192.344.252.552h1.875a3.19 3.19 0 0 0-.405-1.187 3.27 3.27 0 0 0-.812-.931 3.741 3.741 0 0 0-1.135-.607 4.3 4.3 0 0 0-1.381-.216 4.21 4.21 0 0 0-1.607.303 3.756 3.756 0 0 0-1.3.882 4.021 4.021 0 0 0-.867 1.413c-.206.555-.309 1.186-.309 1.894 0 .92.173 1.715.518 2.384a3.725 3.725 0 0 0 1.447 1.547c.62.362 1.338.543 2.156.543zm8.958 0c.77 0 1.463-.175 2.081-.526.618-.35 1.107-.86 1.466-1.528.36-.667.54-1.477.54-2.429 0-.951-.18-1.761-.54-2.429-.36-.667-.848-1.176-1.466-1.527s-1.311-.527-2.081-.527c-.776 0-1.472.176-2.088.527-.617.35-1.104.86-1.462 1.527-.358.668-.537 1.478-.537 2.43 0 .948.179 1.756.537 2.424.358.668.845 1.178 1.462 1.53.616.352 1.312.528 2.088.528zm0-1.632c-.446 0-.836-.11-1.168-.328-.332-.219-.59-.54-.773-.963-.184-.423-.275-.943-.275-1.56 0-.616.091-1.136.275-1.56.183-.423.44-.744.773-.962a2.075 2.075 0 0 1 1.168-.328c.446 0 .835.109 1.167.328.333.218.59.54.774.963.183.423.275.943.275 1.56 0 .616-.092 1.136-.275 1.559-.184.423-.441.744-.774.963a2.075 2.075 0 0 1-1.167.328z"/>
            <g opacity=".6" transform="translate(345 15)">
                <rect filter="url(#filter_readability_kiddo)" fill="#MENU_COLOR" width="37" height="7"/>
                <rect filter="url(#filter_readability_kiddo)" fill="#MENU_COLOR" width="37" height="7" x="58"/>
                <rect filter="url(#filter_readability_kiddo)" fill="#MENU_COLOR" width="37" height="7" x="116"/>
                <rect filter="url(#filter_readability_kiddo)" fill="#MENU_COLOR" width="37" height="7" x="174"/>
            </g>
            <rect width="37" height="7" x="593" y="15" fill="#MENU_COLOR" opacity="1" class="svgc_text" filter="url(#filter_readability_kiddo)"/>
        </g>
        <g class="s_banner" transform="translate(0 37.5)">
            <rect width="700" height="348" transform="translate(0 0.5)" class="img_reference_s_banner_default_image" fill="url(#theme_kiddo_s_banner_default_image_id)"/>
            <rect width="700" height="348" transform="translate(0 0.5)" fill="url(#theme_kiddo_linear-gradient)"/>
            <text transform="translate(70 78.977)" fill="#FFFFFF" font-size="33.884" font-family="VarelaRound-Regular, Varela Round">
                <tspan x="0" y="0">A Welcome</tspan>
                <tspan x="0" y="40">Message</tspan>
            </text>
            <rect width="132.49" height="2" transform="translate(70 147.927)" fill="#FFFFFF"/>
            <rect width="187.1" height="2" transform="translate(70 152.927)" fill="#FFFFFF"/>
            <rect width="206" height="2" transform="translate(70 157.927)" fill="#FFFFFF"/>
            <rect width="104" height="28" rx="14" transform="translate(70.222 182.407)" fill="#3AADAA"/>
            <text transform="translate(122.222 200.407)" fill="#FFFFFF" font-size="11" font-family="Arial-BoldMT, Arial, sans-serif" font-weight="400">
                <tspan x="-29.031" y="0">Contact Us</tspan>
            </text>
            <path d="M0,431.907l87.9-59.25a206.549,206.549,0,0,1,214.9-9.85c85.4,47,161.75,67.7,212.8,15.2a38.861,38.861,0,0,1,24.2-11.5l18.65-1.75a49.69,49.69,0,0,0,36.6-21.7c20.5-30.4,47.55-60.45,104.95-45.1v133.95Z" transform="translate(0.234 -83.407)" fill="#F6F6F6"/>
        </g>
        <g class="s_image_text" transform="translate(70 407)">
            <rect width="700" height="280" transform="translate(-70 -21)" fill="#F6F6F6"/>
            <g transform="translate(-70 -346.774)">
                <g transform="translate(230)">
                    <path d="M145.135,9.73a4.865,4.865,0,1,0-4.865-4.865,4.87,4.87,0,0,0,4.865,4.865m0-7.853a2.988,2.988,0,1,1-2.988,2.988,2.992,2.992,0,0,1,2.988-2.988" transform="translate(204.177 362.774)" fill="#383E45"/>
                    <path d="M39.442,121.327a3.927,3.927,0,1,0,3.927-3.927A3.927,3.927,0,0,0,39.442,121.327Z" transform="translate(364.23 312.148)" fill="#3AADAA"/>
                    <path d="M194.7,340.807a.936.936,0,0,0,.683-.3l.06-.064a.6.6,0,0,0,.043-.049,6.912,6.912,0,1,0-10.7-8.756l-.081.107a.939.939,0,1,0,1.51,1.115l.052-.071a5.036,5.036,0,0,1,7.785,6.39l-.037.04a.938.938,0,0,0,.683,1.582" transform="translate(131.949 220.851)" fill="#28AFEA"/>
                    <path d="M6.239,350.084H1.1a1.1,1.1,0,0,0-1.1,1.1v5.143a1.1,1.1,0,0,0,1.1,1.1H6.239a1.1,1.1,0,0,0,1.1-1.1V351.18a1.1,1.1,0,0,0-1.1-1.1" transform="translate(426.624 211.807)" fill="#3AADAA"/>
                    <path d="M28.168,223.906c.029,0,.058,0,.086,0l6.806-.631a.938.938,0,1,0-.173-1.868l-5.853.543-.437-6a.938.938,0,0,0-1.023-.866l-5.853.543-.437-6a.938.938,0,0,0-1.023-.866l-5.853.543-.437-6a.939.939,0,0,0-1.023-.866L7.1,202.98l-.437-6a.938.938,0,0,0-1.872.137l.507,6.952a.937.937,0,0,0,1.023.866l5.853-.542.437,6a.938.938,0,0,0,1.023.866l5.853-.543.437,6a.938.938,0,0,0,1.023.866l5.853-.543.437,6a.941.941,0,0,0,.936.87" transform="translate(395.325 278.204)" fill="#28AFEA"/>
                </g>
                <g transform="translate(-4.166)">
                    <path d="M699.773,222.695a.938.938,0,0,0,.937-.9l.574-15.736a.938.938,0,0,0-1.5-.782l-9.88,7.488a.938.938,0,0,0-.055,1.45l9.305,8.247a.936.936,0,0,0,.623.237m-.436-14.731-.43,11.77-3.162-2.805h0l-3.8-3.362Z" transform="translate(-659.51 274.337)" fill="#28AFEA"/>
                    <path d="M614.982,320.126a3.927,3.927,0,1,0,3.927-3.927,3.927,3.927,0,0,0-3.927,3.927" transform="translate(-538.66 226.419)" fill="#3AADAA"/>
                    <path d="M624.2,108.417h7.335a.939.939,0,0,0,.938-.938v-7.335a.939.939,0,0,0-.938-.938H624.2a.939.939,0,0,0-.939.938v7.335a.939.939,0,0,0,.939.938m6.4-1.877h-5.458v-5.458h5.458Z" transform="translate(-553.002 319.994)" fill="#3AADAA"/>
                    <path d="M556.909,42.821a2.844,2.844,0,0,0,.886-.147c1.69-.553,1.979-2.155,2.211-3.442.252-1.4.462-2.273,1.543-2.628s1.737.2,2.8,1.206c.949.9,2.126,2.022,3.819,1.47s1.979-2.156,2.211-3.443c.259-1.441.459-2.272,1.543-2.627s1.768.228,2.8,1.205c.949.9,2.133,2.019,3.819,1.467s1.98-2.155,2.212-3.442c.252-1.4.462-2.273,1.543-2.628s1.737.2,2.8,1.207c.949.9,2.129,2.023,3.819,1.47s1.979-2.156,2.211-3.443c.259-1.44.46-2.273,1.542-2.627s1.769.228,2.8,1.205c.949.9,2.134,2.017,3.819,1.467s1.979-2.155,2.212-3.442c.252-1.4.461-2.273,1.544-2.628a.939.939,0,0,0-.586-1.784c-2.2.722-2.55,2.662-2.8,4.079-.229,1.269-.379,1.8-.948,1.991s-1.009-.157-1.945-1.045c-1.044-.99-2.472-2.346-4.673-1.628s-2.551,2.661-2.807,4.078c-.229,1.27-.379,1.806-.948,1.992s-1.007-.158-1.942-1.047c-1.045-.993-2.474-2.351-4.676-1.63s-2.55,2.662-2.805,4.079c-.229,1.269-.379,1.8-.948,1.991s-1.008-.158-1.944-1.045c-1.044-.991-2.472-2.347-4.674-1.628s-2.551,2.661-2.806,4.078c-.23,1.27-.379,1.806-.948,1.992s-1.007-.158-1.942-1.047c-1.045-.992-2.475-2.35-4.677-1.63s-2.55,2.662-2.805,4.079c-.228,1.269-.379,1.8-.948,1.991s-1.008-.156-1.943-1.044c-1.044-.991-2.475-2.347-4.674-1.628A.939.939,0,0,0,551.176,40c1.082-.355,1.768.228,2.8,1.206a4.487,4.487,0,0,0,2.934,1.614" transform="translate(-482.517 353.636)" fill="#28AFEA"/>
                </g>
            </g>
            <g transform="translate(325.424 81.125)" opacity="0.4">
                <rect width="186" height="2" transform="translate(1.575 32.025)" fill="#22263c"/>
                <rect width="171" height="2" transform="translate(1.575 37.025)" fill="#22263c"/>
                <rect width="79" height="2" transform="translate(1.575 42.025)" fill="#22263c"/>
                <rect width="91" height="2" transform="translate(1.575 47.025)" fill="#22263c"/>
            </g>
            <text transform="translate(327 84)" fill="#3AADAA" font-size="25.346" font-family="VarelaRound-Regular, Varela Round" letter-spacing="-0.01em">
                <tspan x="0" y="0">Section Title</tspan>
            </text>
            <g transform="translate(328.63 81.125)">
                <circle cx="2" cy="2" r="2" transform="translate(-1.63 16.875)" fill="#28AFEA"/>
                <circle cx="2" cy="2" r="2" transform="translate(6.37 16.875)" fill="#28AFEA"/>
                <circle cx="2" cy="2" r="2" transform="translate(14.37 16.875)" fill="#28AFEA"/>
                <circle cx="2" cy="2" r="2" transform="translate(22.37 16.875)" fill="#28AFEA"/>
                <circle cx="2" cy="2" r="2" transform="translate(30.37 16.875)" fill="#28AFEA"/>
                <circle cx="2" cy="2" r="2" transform="translate(38.37 16.875)" fill="#28AFEA"/>
                <circle cx="2" cy="2" r="2" transform="translate(46.37 16.875)" fill="#28AFEA"/>
                <circle cx="2" cy="2" r="2" transform="translate(54.37 16.875)" fill="#28AFEA"/>
                <circle cx="2" cy="2" r="2" transform="translate(62.37 16.875)" fill="#28AFEA"/>
                <circle cx="2" cy="2" r="2" transform="translate(70.37 16.875)" fill="#28AFEA"/>
                <circle cx="2" cy="2" r="2" transform="translate(78.37 16.875)" fill="#28AFEA"/>
                <circle cx="2" cy="2" r="2" transform="translate(86.37 16.875)" fill="#28AFEA"/>
                <circle cx="2" cy="2" r="2" transform="translate(94.37 16.875)" fill="#28AFEA"/>
                <circle cx="2" cy="2" r="2" transform="translate(102.37 16.875)" fill="#28AFEA"/>
                <circle cx="2" cy="2" r="2" transform="translate(110.37 16.875)" fill="#28AFEA"/>
                <circle cx="2" cy="2" r="2" transform="translate(118.37 16.875)" fill="#28AFEA"/>
                <circle cx="2" cy="2" r="2" transform="translate(126.37 16.875)" fill="#28AFEA"/>
                <circle cx="2" cy="2" r="2" transform="translate(134.37 16.875)" fill="#28AFEA"/>
                <circle cx="2" cy="2" r="2" transform="translate(142.37 16.875)" fill="#28AFEA"/>
            </g>
            <g transform="translate(-1643 -297.65)">
                <rect width="104" height="28" rx="14" transform="translate(1970 446.65)" fill="#3AADAA"/>
                <text transform="translate(2022 464.65)" fill="#FFFFFF" font-size="11" font-family="Arial-BoldMT, Arial, sans-serif" font-weight="700">
                    <tspan x="-23.235" y="0">Discover</tspan>
                </text>
            </g>
            <path d="M228.009,155.3c-59.3,2.088-118.607-2.088-177.91-10.456-13.076-2.088-28.14-11.859-33.18-20.912C2.835,93.953-2.177,63.971.847,34.691c1.008-9.069,16.072-18.824,32.172-20.912A1146.3,1146.3,0,0,1,246.1.518c16.1,0,31.164,10.456,32.172,21.613,5.012,37.648-1.008,74.6-16.072,110.857-5.04,11.859-21.112,21.613-34.188,22.315" transform="translate(0 41)" class="img_reference_s_image_text_default_image" fill="url(#theme_kiddo_s_image_text_default_image_id)"/>
        </g>
        <g class="s_three_columns" transform="translate(0 108)">
            <rect width="700" height="403" transform="translate(0 558)" fill="#FFFFFF"/>
            <path d="M0,1354.3V1400H700v-45.7C457.85,1395.1,224,1397.5,0,1354.3Z" transform="translate(700 1958) rotate(180)" fill="#F6F6F6"/>
            <g transform="translate(0 -292)">
                <g transform="translate(872.607 -355.025)">
                    <path d="M175.109,80.971c13.144,33.042,14.165,81.764,1.515,113.965-12.649,32.225-38.953,47.089-65.257,47.089-26.32,0-52.639-14.864-63.263-45.432-11.118-29.728-6.062-75.16,7.1-108.178,13.16-33.042,34.391-54.509,57.664-56.166,23.783-2.473,49.082,15.681,62.242,48.722" transform="translate(-441.351 1287)" class="img_reference_s_three_columns_default_image_3" fill="url(#theme_kiddo_s_three_columns_default_image_3_id)"/>
                    <path d="M531.389,422a19.389,19.389,0,1,0,19.389,19.389A19.434,19.434,0,0,0,531.389,422m0,35.743a16.354,16.354,0,1,1,16.354-16.353,16.383,16.383,0,0,1-16.354,16.353" transform="translate(-797.385 1039.188)" fill="#3AADAA" opacity="0.5"/>
                    <g transform="translate(-406.608 1436.543)" opacity="0.75">
                        <path d="M36.285,76.861l-.08,0A38.462,38.462,0,1,1,76.859,36.205a1.339,1.339,0,0,1-2.674.157A35.783,35.783,0,1,0,36.362,74.185a1.339,1.339,0,0,1-.077,2.676" transform="translate(0 0)" fill="#28AFEA"/>
                        <path d="M55.922,87.454a31.562,31.562,0,0,1-.112-63.124h.064a31.52,31.52,0,0,1,20.643,7.7,1.339,1.339,0,0,1-1.754,2.025,28.843,28.843,0,0,0-18.889-7.045h-.059A28.888,28.888,0,1,0,74.765,77.775a1.339,1.339,0,1,1,1.75,2.027,31.42,31.42,0,0,1-20.593,7.652" transform="translate(-17.421 -17.408)" fill="#28AFEA"/>
                        <path d="M73.058,98.25q-1.192,0-2.394-.115a24.668,24.668,0,0,1,0-49.112,1.339,1.339,0,1,1,.255,2.666A21.99,21.99,0,1,0,94.9,75.674a1.339,1.339,0,1,1,2.666.255A24.673,24.673,0,0,1,73.058,98.25" transform="translate(-34.589 -35.072)" fill="#28AFEA"/>
                    </g>
                    <path d="M24.414,61.105A.788.788,0,0,1,24,60.991a.8.8,0,0,1-.271-1.092L33,44.514a.8.8,0,0,1,1.364.821L25.1,60.72a.8.8,0,0,1-.683.385m16.871-1.677a.8.8,0,0,1-.8-.772l-.52-17.921a.8.8,0,0,1,.772-.819.784.784,0,0,1,.819.772l.52,17.921a.8.8,0,0,1-.772.818h-.023M9.327,53.381a.8.8,0,0,1-.351-1.511L25.062,44a.8.8,0,1,1,.7,1.43L9.676,53.3a.789.789,0,0,1-.349.081m45.264-4.5a.8.8,0,0,1-.657-.346L43.78,33.735a.8.8,0,0,1,1.312-.9l10.154,14.8a.8.8,0,0,1-.655,1.246m-35.98-8.064a.845.845,0,0,1-.094-.005L.7,38.723a.8.8,0,1,1,.185-1.581L18.7,39.232a.8.8,0,0,1-.091,1.587m-3.185-7.671a.794.794,0,0,1-.5-.18L1.035,21.614a.8.8,0,1,1,1.007-1.232L15.931,31.735a.8.8,0,0,1-.5,1.412m44.627-.3a.792.792,0,0,1-.309-.063L43.214,25.806a.8.8,0,0,1,.619-1.467l16.531,6.982a.8.8,0,0,1-.31,1.529M16.86,25.009a.8.8,0,0,1-.757-.55L10.564,7.4a.8.8,0,0,1,1.514-.491l5.538,17.061a.8.8,0,0,1-.757,1.042m21.517-5.56a.8.8,0,0,1-.135-1.58l17.666-3.056a.8.8,0,0,1,.271,1.568L38.513,19.437a.781.781,0,0,1-.137.012m-15.9-.467a.8.8,0,0,1-.77-1L26.233.6a.8.8,0,0,1,1.54.4L23.243,18.387a.8.8,0,0,1-.77.595m8-2.122a.8.8,0,0,1-.538-1.382L43.145,3.361a.8.8,0,0,1,1.075,1.173L31.011,16.65a.793.793,0,0,1-.538.209" transform="translate(-303.458 1350.901)" fill="#383E45"/>
                </g>
                <g transform="translate(506 1236)" opacity="0.4">
                    <rect width="84" height="2" transform="translate(0)" fill="#22263c"/>
                    <rect width="74.382" height="2" transform="translate(5 5)" fill="#22263c"/>
                    <rect width="50.656" height="2" transform="translate(17 10)" fill="#22263c"/>
                    <rect width="58.351" height="2" transform="translate(13 15)" fill="#22263c"/>
                </g>
                <g transform="translate(419.63 1203.125)">
                    <circle cx="2" cy="2" r="2" transform="translate(110.37 16.875)" fill="#28AFEA"/>
                    <circle cx="2" cy="2" r="2" transform="translate(118.37 16.875)" fill="#28AFEA"/>
                    <circle cx="2" cy="2" r="2" transform="translate(126.37 16.875)" fill="#28AFEA"/>
                    <circle cx="2" cy="2" r="2" transform="translate(134.37 16.875)" fill="#28AFEA"/>
                    <circle cx="2" cy="2" r="2" transform="translate(142.37 16.875)" fill="#28AFEA"/>
                </g>
                <text transform="translate(510 1209)" fill="#22263c" font-size="16" font-family="VarelaRound-Regular, Varela Round">
                    <tspan x="0" y="0">Entry Title</tspan>
                </text>
            </g>
            <g>
                <g transform="translate(308 944)" opacity="0.4">
                    <rect width="84" height="2" transform="translate(0)" fill="#22263c"/>
                    <rect width="74.382" height="2" transform="translate(5 5)" fill="#22263c"/>
                    <rect width="50.656" height="2" transform="translate(17 10)" fill="#22263c"/>
                    <rect width="58.351" height="2" transform="translate(13 15)" fill="#22263c"/>
                </g>
                <g transform="translate(221.63 911.125)">
                    <circle cx="2" cy="2" r="2" transform="translate(110.37 16.875)" fill="#3AADAA"/>
                    <circle cx="2" cy="2" r="2" transform="translate(118.37 16.875)" fill="#3AADAA"/>
                    <circle cx="2" cy="2" r="2" transform="translate(126.37 16.875)" fill="#3AADAA"/>
                    <circle cx="2" cy="2" r="2" transform="translate(134.37 16.875)" fill="#3AADAA"/>
                    <circle cx="2" cy="2" r="2" transform="translate(142.37 16.875)" fill="#3AADAA"/>
                </g>
                <text transform="translate(312 917)" fill="#22263c" font-size="16" font-family="VarelaRound-Regular, Varela Round">
                    <tspan x="0" y="0">Entry Title</tspan>
                </text>
                <path d="M159.446,34.875c9.807,24,2.312,58.867-8.659,79.784s-25.977,28.667-43.868,47.253-38.1,49.584-58.874,48.03S6.489,175.858,1.291,140.219,7.08,65.873,25.545,39.538,69.988.034,96.538.034C123.089-.743,149.639,11.648,159.446,34.875Z" transform="translate(268 672)" class="img_reference_s_three_columns_default_image_2" fill="url(#theme_kiddo_s_three_columns_default_image_2_id)"/>
            </g>
            <g transform="translate(0 -290.7)">
                <g transform="translate(110 1234.7)" opacity="0.4">
                    <rect width="84" height="2" transform="translate(0)" fill="#22263c"/>
                    <rect width="74.382" height="2" transform="translate(5 5)" fill="#22263c"/>
                    <rect width="50.656" height="2" transform="translate(17 10)" fill="#22263c"/>
                    <rect width="58.351" height="2" transform="translate(13 15)" fill="#22263c"/>
                </g>
                <g transform="translate(23.63 1201.825)">
                    <circle cx="2" cy="2" r="2" transform="translate(110.37 16.875)" fill="#28AFEA"/>
                    <circle cx="2" cy="2" r="2" transform="translate(118.37 16.875)" fill="#28AFEA"/>
                    <circle cx="2" cy="2" r="2" transform="translate(126.37 16.875)" fill="#28AFEA"/>
                    <circle cx="2" cy="2" r="2" transform="translate(134.37 16.875)" fill="#28AFEA"/>
                    <circle cx="2" cy="2" r="2" transform="translate(142.37 16.875)" fill="#28AFEA"/>
                </g>
                <text transform="translate(114 1207.7)" fill="#22263c" font-size="16" font-family="VarelaRound-Regular, Varela Round">
                    <tspan x="0" y="0">Entry Title</tspan>
                </text>
                <g transform="translate(67.886 962.7)">
                    <path d="M166.02,67.092c15.653,3.9,39.98,3.9,39.98,13.67,0,9.751-24.345,31.236-34.768,52.7-10.423,21.485-5.795,43.926-9.257,53.677-3.48,9.751-15.07,5.855-31.288,17.566s-37.665,38.071-55.632,37.091S42,211.537,42,181.258C42,151,57.07,118.809,67.493,92.425,78.5,65.085,84.877,42.644,95.3,34.829s25.493.956,36.5,10.731c11.589,7.838,18.55,17.589,34.185,21.508Z" transform="translate(-39.887 -31.82)" class="img_reference_s_three_columns_default_image_1" fill="url(#theme_kiddo_s_three_columns_default_image_1_id)"/>
                    <path d="M38.109,345.785c-1.078,1.031-.117,2.624,1.195,2.764.89.094,3-.937,3,.539a3.868,3.868,0,0,0,.211,2.132,1.677,1.677,0,0,0,1.546.773c.937-.023,1.8-.937,2.342.187.3.656.352,1.241,1.1,1.569a1.22,1.22,0,0,0,1.64-.468c.515-.75-.7-1.453-1.218-.7.164-.234-.4-1.523-.585-1.757a1.666,1.666,0,0,0-1.078-.679,2.809,2.809,0,0,0-1.382.187c-.7.211-1.265.375-1.242-.562s.141-2.015-.8-2.624a2.344,2.344,0,0,0-1.429-.3,5.163,5.163,0,0,0-.867.141c-.211.047-1.944.258-1.452-.211C39.748,346.16,38.764,345.176,38.109,345.785Z" transform="translate(-31.185 -234.751)" fill="#3AADAA"/>
                    <path d="M58.865,342.478c.14.8.3,1.616.445,2.413a.7.7,0,0,0,.679.515,4.7,4.7,0,0,0,2.132-.844c1.241-.632.867.516,1.054,1.336a1.64,1.64,0,0,0,1.054,1.241c1.1.375,2.038.351,3,1.148.7.562,1.687-.422.984-.984a5.834,5.834,0,0,0-2.6-1.311,2.6,2.6,0,0,1-.82-.187c-.375-.211-.281-.328-.281-.773a3.73,3.73,0,0,0-.164-1.124,1.6,1.6,0,0,0-1.64-.937c-1.031.07-1.71,1.077-2.717,1.077.234.164.445.352.679.516-.141-.8-.3-1.616-.445-2.413C60.06,341.213,58.7,341.588,58.865,342.478Z" transform="translate(-44.659 -232.217)" fill="#3AADAA"/>
                    <path d="M667.852,29.143A10.858,10.858,0,1,1,656.808,40a10.951,10.951,0,0,1,11.044-10.856" transform="translate(-512.782 9.727)" fill="#28AFEA"/>
                    <path d="M662.852,149.19a6.128,6.128,0,1,1-5.98,6.126,6.054,6.054,0,0,1,5.98-6.126" transform="translate(-512.825 -71.375)" fill="#3AADAA"/>
                    <path d="M222.353,416.189c-.708-.563-2.167-2.042-.25-2.48.375-.083.729.083,1.1-.063a1.8,1.8,0,0,0,.979-1.855,8.6,8.6,0,0,0-.292-1.459c-.125-.563-.375-1.208.417-1.229.146,0,.292.062.458.062a1.627,1.627,0,0,0,1.5-1.146c.146-.375-.458-.542-.6-.167-.5,1.375-2.146-.25-2.459,1.334-.229,1.229,1.376,3.771-.771,3.9-.855.042-1.6.021-1.834,1.042-.229,1.063.583,1.855,1.333,2.459C222.207,416.876,222.665,416.439,222.353,416.189Z" transform="translate(-114.415 -263.982)" fill="#28AFEA"/>
                    <path d="M237.678,412.8c-.312-.521-.833-1.438-.6-2.084.25-.688,1.417-.625,1.959-1.084a2.335,2.335,0,0,0,.75-2.459.313.313,0,1,0-.6.167,1.667,1.667,0,0,1-.333,1.6c-.4.438-.833.417-1.334.6a1.611,1.611,0,0,0-.938.708c-.458.917.083,2.063.563,2.855C237.344,413.444,237.886,413.132,237.678,412.8Z" transform="translate(-125.114 -263.509)" fill="#28AFEA"/>
                    <path d="M276.681,78.187c.375-.5.792-.583,1.25-.208a1.6,1.6,0,0,1,.375,1.042,10.138,10.138,0,0,1-.167,1.1.918.918,0,0,0,.292.855c.584.438,1.375-.1,1.729-.584.167-.229.313-.667.542-.813.917-.6.854.271,1.021.646a1.2,1.2,0,0,0,.583.687c1.021.5,1.855-.5,2.334-1.271.208-.333-.333-.646-.542-.312-.313.479-1.1,1.771-1.834.6-.125-.208-.1-.521-.229-.75a1.021,1.021,0,0,0-.75-.583,1.312,1.312,0,0,0-1.042.521c-.375.4-1.375,2.271-1.438.667-.021-.959.209-2.084-.9-2.563a1.365,1.365,0,0,0-1.821.64,1.4,1.4,0,0,0-.055.131.339.339,0,0,0,.646.188" transform="translate(-145.81 -22.667)" fill="#28AFEA"/>
                    <path d="M277.785,70.214a1.531,1.531,0,0,1,2.159.173q.049.057.091.118c.292.458.083,1.063.4,1.5a.663.663,0,0,0,.75.292,1.611,1.611,0,0,0,.5-.25c.667-.417,1.25-.583,1.875.083.271.292.709-.146.438-.438a1.9,1.9,0,0,0-1.938-.583c-.375.125-.938.688-1.146.271-.146-.271-.063-.688-.188-.979a2.154,2.154,0,0,0-3.334-.625c-.354.271.1.709.4.438" transform="translate(-146.644 -17.362)" fill="#28AFEA"/>
                    <path d="M93.668,64.406A14.268,14.268,0,1,1,79.121,78.671,14.408,14.408,0,0,1,93.668,64.406" transform="translate(-63.994 -56.112)" fill="#3AADAA"/>
                    <path d="M76.572,115.906c-.656.445-1.85,1.382-2.717.773-.96-.656.117-2.389.469-3.069a24.437,24.437,0,0,1,2.881-4.333,58.716,58.716,0,0,1,7.543-7.332c.679-.586-.3-1.57-.984-.984-3.678,3.139-7.356,6.442-9.909,10.635-.867,1.429-2.483,3.818-1.5,5.528,1.124,1.944,3.49.984,4.9.023.773-.539.07-1.757-.679-1.241" transform="translate(-59.501 -79.221)" fill="#383E45"/>
                    <path d="M119.04,80.616l6.325-5.13c.7-.562-.3-1.57-.984-.984l-6.325,5.13c-.726.562.281,1.546.984.984" transform="translate(-88.57 -62.413)" fill="#383E45"/>
                    <path d="M152.276,64.323c1.078-.562,4.989-2.858,5.692-1.007.609,1.593-.89,3.912-1.85,5.083-.562.7.422,1.687.984.984,1.406-1.71,3.28-4.872,1.921-7.121-1.546-2.53-5.645-.117-7.472.843-.8.422-.07,1.64.726,1.218" transform="translate(-109.789 -54.038)" fill="#383E45"/>
                    <path d="M98.076,104.429a68.121,68.121,0,0,1,10.635-9.815c.726-.539.023-1.757-.7-1.218a69.307,69.307,0,0,0-10.916,10.049c-.609.656.375,1.663.984.984" transform="translate(-75.29 -74.444)" fill="#383E45"/>
                    <path d="M563.681,450.558a12.025,12.025,0,1,1-12.211,12.023,12.118,12.118,0,0,1,12.211-12.023" transform="translate(-447.692 -292.975)" fill="#28AFEA"/>
                    <path d="M563.395,450.074c.312-2.334,3.48-1.334,4.772-.729a22.433,22.433,0,0,1,3.667,2.188,25.721,25.721,0,0,1,6.355,6.9,34.314,34.314,0,0,1,4.042,9.21c.417,1.479,3,10.356-.687,9.4a.627.627,0,0,0-.333,1.208,2.77,2.77,0,0,0,3.042-1.292c.792-1.25.584-2.834.354-4.209a42.19,42.19,0,0,0-2.771-9.939c-2.459-5.855-6.605-11.169-12.315-14.149-1.459-.75-3.167-1.583-4.855-1.229a3.071,3.071,0,0,0-2.542,2.667C562.04,450.887,563.291,450.866,563.395,450.074Z" transform="translate(-454.887 -290.804)" fill="#383E45"/>
                    <path d="M609.578,490.063a19,19,0,0,1,3.084,11.044.625.625,0,0,0,1.25,0,19.934,19.934,0,0,0-3.251-11.669c-.438-.687-1.521-.063-1.083.625" transform="translate(-486.88 -319.04)" fill="#383E45"/>
                    <path d="M572.72,439.788a9.5,9.5,0,0,1,5.626,2.75c.563.563,1.459-.312.875-.875a10.764,10.764,0,0,0-6.5-3.126c-.792-.083-.792,1.167,0,1.25" transform="translate(-461.647 -284.852)" fill="#383E45"/>
                </g>
            </g>
        </g>
        <g class="s_product_list" transform="translate(0 131)">
            <rect width="700" height="259" transform="translate(0 938)" fill="#FFFFFF"/>
            <g transform="translate(535 1017.91)">
                <rect width="94.866" height="112.625" rx="13.21" fill="none"/>
                <rect width="94.866" height="112.625" rx="13.21" transform="translate(0.123)" fill="none" stroke="#3AADAA" stroke-linecap="round" stroke-miterlimit="10" stroke-width="2" stroke-dasharray="1.003 4"/>
                <rect width="64.272" height="4" transform="translate(15.425 94.127)" fill="#3AADAA"/>
                <g> 
                    <path d="M530.2,1345.008c-7.019-1.015-8.754-5.784-10.592-10.856-.463-1.286-.893-2.455-1.42-3.593-4.313-9.416-7.957-11.852-15.76-12.777v-6h.366a1.371,1.371,0,1,0,.135-2.738h-2c-3.451-.039-8.24.058-10.194,4.5-1.581,3.593-17.546,35.71-17.707,36.037a1.388,1.388,0,1,0,2.5,1.208c.206-.411,1.864-3.741,4.088-8.233l4.615,5.579a1.375,1.375,0,0,0,2.115-1.755l-5.418-6.517,2.423-4.9,4.57,5.553a1.375,1.375,0,0,0,2.115-1.748l-5.36-6.479,2.147-4.358,4.538,5.476a1.343,1.343,0,0,0,1.054.495,1.362,1.362,0,0,0,1.375-1.363,1.42,1.42,0,0,0-.315-.88l-5.322-6.427,3.214-6.53,5.084,6.144a1.375,1.375,0,1,0,2.172-1.677l-.058-.071L492.694,1316h0c.276-.6.489-1.048.611-1.33,1.041-2.378,3.31-2.841,6.427-2.873v5.887a1.369,1.369,0,0,0,.354,2.655c7.867.643,11.248,1.774,15.676,11.382.476,1.035.893,2.179,1.33,3.387,1.845,5.078,4.139,11.389,12.784,12.636,7.269,1.054,12.552,6.331,12.552,12.559a1.375,1.375,0,0,0,2.744.135v-.135C545.115,1352.721,538.842,1346.293,530.2,1345.008Z" transform="translate(-461.483 -1292.793)" fill="#3AADAA"/>
                    <path d="M529.241,1356.43c-7.07-1.016-8.767-5.785-10.6-10.8-.443-1.2-.893-2.436-1.408-3.567-2.372-5.142-4.724-8.22-7.623-9.917-2.532-1.485-5.412-1.928-9.1-1.928h-1.318a1.376,1.376,0,0,0-1.234.771l-17.63,36.327a1.363,1.363,0,1,0,2.449,1.2h0l16.222-33.422v32.818a1.375,1.375,0,0,0,2.744,0V1333c5.977.283,9.2,1.986,12.989,10.284.476,1.035.887,2.166,1.324,3.361,1.838,5.045,4.133,11.325,12.79,12.572,7.006,1.009,11.19,4.268,11.19,8.722a1.375,1.375,0,1,0,2.744,0h0C542.783,1361.938,537.718,1357.651,529.241,1356.43Z" transform="translate(-464.087 -1300.359)" fill="#28AFEA"/>
                </g>
            </g>
            <g transform="translate(419 1017.91)">
                <rect width="94.866" height="112.625" rx="13.21" transform="translate(0.154)" fill="none"/>
                <rect width="94.866" height="112.625" rx="13.21" transform="translate(0)" fill="none" stroke="#3AADAA" stroke-linecap="round" stroke-miterlimit="10" stroke-width="2" stroke-dasharray="1.003 4"/>
                <rect width="64.272" height="4" transform="translate(15.579 94.127)" fill="#3AADAA"/>
                <g>
                    <path d="M178.158,1347.031a.971.971,0,0,0-1.928-.116v.116c0,3.008.347,3.966,2.185,6.016a4.2,4.2,0,0,1,.058,5.932c-3.445,3.265-3.214,7.456-3,10.515.032.643.071,1.228.071,1.755a.977.977,0,0,0,1.928,0h0c0-.585-.045-1.208-.084-1.877-.18-2.969-.386-6.337,2.4-9s2.057-6.389.058-8.638C178.4,1350.129,178.158,1349.673,178.158,1347.031Z" transform="translate(-131.361 -1306.032)" fill="#28AFEA"/>
                    <path d="M200.362,1375.023c.932-1.825.643-5.142.591-5.515a.977.977,0,0,0-1.928.18h0c.084.8.186,3.316-.386,4.428a8.137,8.137,0,0,0-.488,7.019,6.247,6.247,0,0,1,.379,1.78.977.977,0,0,0,1.928,0h0a7.931,7.931,0,0,0-.469-2.352,6.3,6.3,0,0,1,.373-5.54Z" transform="translate(-139.297 -1314.125)" fill="#28AFEA"/>
                    <path d="M159.725,1375.954a.971.971,0,0,0-1.928.2c.084.8.186,3.316-.386,4.448a8.163,8.163,0,0,0-.488,7.019,6.247,6.247,0,0,1,.379,1.781.977.977,0,1,0,1.928,0,7.969,7.969,0,0,0-.469-2.352,6.324,6.324,0,0,1,.36-5.56C160.072,1379.643,159.777,1376.333,159.725,1375.954Z" transform="translate(-124.568 -1316.405)" fill="#28AFEA"/>
                    <path d="M183.8,1316.57c0-8.478-5.656-15.38-12.6-15.38s-12.617,6.9-12.617,15.425,5.662,15.425,12.617,15.425S183.8,1325.061,183.8,1316.57Zm-12.617,13.42c-5.881,0-10.669-6.029-10.669-13.439s4.795-13.439,10.669-13.439,10.676,6.029,10.676,13.433S177.071,1329.99,171.184,1329.99Z" transform="translate(-125.364 -1289.987)" fill="#3AADAA"/>
                    <path d="M167.61,1320.546a9.641,9.641,0,0,1,2.4-6.626.977.977,0,0,0-1.427-1.331,11.672,11.672,0,0,0-2.912,7.957,12.741,12.741,0,0,0,.643,4.017.97.97,0,0,0,.919.688.983.983,0,0,0,.926-1.285h0A10.925,10.925,0,0,1,167.61,1320.546Z" transform="translate(-127.896 -1293.963)" fill="#3AADAA"/>
                    <path d="M173.044,1336.56a5.975,5.975,0,0,1-1.228-.925.977.977,0,1,0-1.369,1.395h0a7.8,7.8,0,0,0,1.633,1.221.973.973,0,1,0,.964-1.69Z" transform="translate(-129.499 -1302.194)" fill="#3AADAA"/>
                    <path d="M197.011,1342.45c-4.274,0-7.751,4.2-7.751,9.371s3.477,9.364,7.751,9.364,7.751-4.2,7.751-9.364S201.3,1342.45,197.011,1342.45Zm0,16.788c-3.214,0-5.785-3.329-5.785-7.417s2.571-7.424,5.785-7.424,5.823,3.329,5.823,7.424S200.212,1359.238,197.011,1359.238Z" transform="translate(-136.325 -1304.729)" fill="#3AADAA"/>
                    <path d="M155.781,1348.94c-4.274,0-7.751,4.2-7.751,9.365s3.484,9.365,7.751,9.365,7.713-4.2,7.713-9.365S160.055,1348.94,155.781,1348.94Zm0,16.782c-3.214,0-5.823-3.329-5.823-7.417s2.609-7.423,5.823-7.423,5.785,3.329,5.785,7.423S158.982,1365.722,155.781,1365.722Z" transform="translate(-121.595 -1307.047)" fill="#3AADAA"/>
                </g>
            </g>
            <g transform="translate(303 1018.585)">
                <rect width="94.866" height="112.625" rx="13.21" transform="translate(0.051 0)" fill="none"/>
                <rect width="94.866" height="112.625" rx="13.21" transform="translate(0 0)" fill="none" stroke="#3AADAA" stroke-linecap="round" stroke-miterlimit="10" stroke-width="2" stroke-dasharray="1 4"/>
                <rect width="64.272" height="4" transform="translate(15.477 93.452)" fill="#3AADAA"/>
                <g>
                    <path d="M553.232,1102.406a1.5,1.5,0,0,0-1.53.071c-3.3,2.192-6.607,1.093-10.431-.174-3.3-1.093-6.967-2.307-10.695-.99v-1.768a1.491,1.491,0,0,0-2.976,0v4.158h0v13.632h0V1133.2a1.491,1.491,0,0,0,2.976,0h0v-15.008c3.079-1.645,6.2-.643,9.763.566a23.421,23.421,0,0,0,7.25,1.568,10.115,10.115,0,0,0,5.785-1.754,1.446,1.446,0,0,0,.643-1.234V1103.7A1.479,1.479,0,0,0,553.232,1102.406Zm-2.192,14.1c-3.085,1.645-6.2.643-9.769-.572-3.3-1.1-6.967-2.307-10.695-.99v-10.386c3.079-1.645,6.2-.643,9.763.566,3.3,1.1,6.974,2.314,10.7.99Z" transform="translate(-481.639 -1086.871)" fill="#3AADAA"/>
                    <path d="M536.664,1179.5a1.485,1.485,0,0,1-1.485-1.491v-24.668h-3.316v2.68a1.478,1.478,0,0,1-1.485,1.478h-6.556a1.485,1.485,0,0,1-1.485-1.479v-2.68h-5.515v2.68a1.478,1.478,0,0,1-1.485,1.478h-6.556a1.491,1.491,0,0,1-1.485-1.478v-2.68h-3.284v24.674a1.491,1.491,0,1,1-2.976,0v-26.159a1.485,1.485,0,0,1,1.485-1.491h6.26a1.491,1.491,0,0,1,1.491,1.491v2.674h3.593v-2.674a1.485,1.485,0,0,1,1.485-1.491h8.5a1.485,1.485,0,0,1,1.485,1.491v2.674h3.58v-2.674a1.491,1.491,0,0,1,1.491-1.491h6.26a1.484,1.484,0,0,1,1.485,1.491v26.159a1.491,1.491,0,0,1-1.485,1.485Z" transform="translate(-472.148 -1105.527)" fill="#28AFEA"/>
                    <path d="M541.763,1194.042H484.606a1.491,1.491,0,0,1-.148-2.976H541.75a1.491,1.491,0,1,1,.148,2.976Z" transform="translate(-465.742 -1120.065)" fill="#3AADAA"/>
                </g>
            </g>
            <g transform="translate(186 1018.585)">
                <rect width="94.866" height="112.625" rx="13.21" transform="translate(0.257 0)" fill="none"/>
                <rect width="94.866" height="112.625" rx="13.21" transform="translate(0 0)" fill="none" stroke="#3AADAA" stroke-linecap="round" stroke-miterlimit="10" stroke-width="2" stroke-dasharray="1.003 4"/>
                <rect width="64.272" height="4" transform="translate(15.04 93.452)" fill="#3AADAA"/>
                <g transform="translate(0 4)">
                    <path d="M365.347,1119.769h-47.1a4.706,4.706,0,1,1-.238-9.409h47.337a4.706,4.706,0,0,1,.231,9.41Zm-47.1-6.916a2.211,2.211,0,1,0,0,4.422h47.1a2.211,2.211,0,1,0,0-4.422Z" transform="translate(-294.364 -1091.232)" fill="#28AFEA"/>
                    <path d="M398.752,1162.083a1.241,1.241,0,0,1-1.228-1.041l-6.234-38.351a1.247,1.247,0,0,1,2.442-.4l6.234,38.345a1.247,1.247,0,0,1-1.028,1.433A.917.917,0,0,1,398.752,1162.083Z" transform="translate(-322.184 -1095.176)" fill="#28AFEA"/>
                    <path d="M351.854,1170.258a10.283,10.283,0,0,1-10.284-10.283v-2.4a1.247,1.247,0,0,1,1.247-1.247h4.5a1.247,1.247,0,0,1,1.247,1.247v2.4a3.336,3.336,0,0,0,6.671,0v-2.4a1.247,1.247,0,0,1,1.247-1.247h4.5a1.24,1.24,0,0,1,1.24,1.247v2.4a10.283,10.283,0,0,1-10.367,10.283Zm-7.809-11.447v1.163a7.809,7.809,0,0,0,15.618,0v-1.151h-1.98v1.151a5.83,5.83,0,0,1-11.659,0v-1.151Z" transform="translate(-304.421 -1107.656)" fill="#3AADAA"/>
                    <path d="M346.087,1141.791a1.247,1.247,0,0,1-1.247-1.247v-30.587a1.247,1.247,0,0,1,2.494,0h0v30.587a1.247,1.247,0,0,1-1.247,1.247Z" transform="translate(-305.589 -1090.643)" fill="#3AADAA"/>
                    <path d="M367.666,1141.756a1.247,1.247,0,0,1-1.247-1.247v-30.587a1.248,1.248,0,0,1,2.494-.122v30.709A1.247,1.247,0,0,1,367.666,1141.756Z" transform="translate(-313.298 -1090.608)" fill="#3AADAA"/>
                    <path d="M314.065,1183.7H302.689a1.247,1.247,0,0,1-.122-2.488h11.5a1.247,1.247,0,1,1,.122,2.487Z" transform="translate(-290.085 -1116.545)" fill="#3AADAA"/>
                    <path d="M404.669,1183.707H393.287a1.247,1.247,0,1,1-.122-2.487h11.5a1.247,1.247,0,0,1,.122,2.487Z" transform="translate(-322.407 -1116.549)" fill="#3AADAA"/>
                    <path d="M311.538,1162.02h-.2a1.241,1.241,0,0,1-1.028-1.427l6.228-38.351a1.285,1.285,0,0,1,1.446-1.009A1.234,1.234,0,0,1,319,1122.64l-6.234,38.351a1.234,1.234,0,0,1-1.228,1.028Z" transform="translate(-293.246 -1095.112)" fill="#28AFEA"/>
                </g>
            </g>
            <g transform="translate(70 1018.585)">
                <rect width="94.866" height="112.625" rx="13.21" fill="none"/>
                <rect width="94.866" height="112.625" rx="13.21" transform="translate(0 -0.085)" fill="none" stroke="#3AADAA" stroke-linecap="round" stroke-miterlimit="10" stroke-width="2" stroke-dasharray="1 4"/>
                <rect width="64.272" height="4" transform="translate(15.582 93.415)" fill="#3AADAA"/>
                <g transform="translate(7.421 10.413)">
                    <path d="M127.292,1112.679a3.742,3.742,0,0,0,3.425,3.236c1.145.107,2.556.164,4.176.164.92,0,1.728,0,2.29-.036.69,2.137,2.76,8.1,5.347,11.456,2.929,3.783,7.131,5.93,12.519,6.39v12.391a1.044,1.044,0,1,0,2.086.1.344.344,0,0,0,0-.1v-12.3h.895v12.309a1.045,1.045,0,0,0,2.091,0h0v-12.509a14.241,14.241,0,0,0,8.148-4.089c3.021-3.067,4.56-7.591,4.447-13.035a1.022,1.022,0,0,0-1.022-1.022H149.968l-7.862-10.679a1.048,1.048,0,0,0-1.191-.363c-.409.143-10.024,3.547-11.834,4.3A3.426,3.426,0,0,0,127.292,1112.679Zm2.587-1.866c1.493-.624,8.69-3.175,11.006-4l7.719,10.489a1.022,1.022,0,0,0,.838.424h21.194c-.1,4.406-1.421,8.021-3.854,10.5a12.885,12.885,0,0,1-9.462,3.655c-5.807,0-10.224-1.912-13.142-5.674s-5.229-11.456-5.229-11.537a1.022,1.022,0,0,0-1.022-.746s-1.334.056-2.99.056c-1.564,0-2.9-.051-3.982-.148a1.626,1.626,0,0,1-1.534-1.477A1.388,1.388,0,0,1,129.878,1110.813Z" transform="translate(-114.662 -1090.047)" fill="#28AFEA"/>
                    <path d="M167.66,1188.945c0-2.74,4.161-4.795,9.682-4.795s9.682,2.045,9.682,4.795a1.048,1.048,0,0,1-1.022,1.022H168.7A1.053,1.053,0,0,1,167.66,1188.945Zm9.682-2.7c-3.272,0-5.71.8-6.86,1.651h13.71c-1.145-.859-3.578-1.656-6.855-1.656Z" transform="translate(-134.42 -1128.966)" fill="#3AADAA"/>
                    <path d="M136.874,1099.585c3.875-2.019,7.356-2.4,10.638-1.15,3.824,1.457,7.274,5.081,10.551,11.077a1.022,1.022,0,0,1-.174,1.242l-2.985,3.021c.276,3.737,4.268,6.584,7.719,6.584,4.57,0,8.01-3,8.01-6.983a7.489,7.489,0,0,1,7.468-7.831,7,7,0,0,1,5.112,2.1c1.81,1.825,2.74,4.7,2.7,8.3-.087,7.9.792,10.684,1.063,11.348a1.237,1.237,0,0,1-.25,1.391,1.452,1.452,0,0,1-1.084.4,4.782,4.782,0,0,1-1.743-.429c-3.3-1.38-8.859-6.134-8.864-15.3a1.048,1.048,0,0,1,1.022-1.022h0a1.022,1.022,0,0,1,1.022,1.022c0,5.792,2.4,9.3,4.417,11.205a10.735,10.735,0,0,0,3.067,2.106,49.222,49.222,0,0,1-.787-10.766c.031-3.036-.7-5.393-2.1-6.814a4.989,4.989,0,0,0-3.619-1.457,5.43,5.43,0,0,0-5.367,5.725c0,5.112-4.437,9.073-10.1,9.073-4.636,0-9.825-3.88-9.83-9.073h0v-.056a1.453,1.453,0,0,1,0-.148.134.134,0,0,1,.026-.092l.031-.1.051-.092.046-.087a.978.978,0,0,1,.087-.107l.041-.051,2.74-2.781c-6.5-11.456-12.514-10.99-17.181-8.808l1.217,3.261a1.044,1.044,0,1,1-1.922.818l-.031-.087-1.534-4.141A1.048,1.048,0,0,1,136.874,1099.585Z" transform="translate(-119.077 -1086.716)" fill="#3AADAA"/>
                </g>
            </g>
        </g>
        <g class="s_call_to_action" transform="translate(0 118)">
            <rect width="700" height="335" transform="translate(0 1210)" fill="#F6F6F6"/>
            <g transform="translate(24.498 1235)">
                <path d="M160.818,69.955l-38.81-9.743a2.512,2.512,0,0,1-1.191-4.187l27.835-28.736a2.514,2.514,0,0,1,4.223,1.061l10.959,38.478a2.513,2.513,0,0,1-3.016,3.127" fill="#3AADAA"/>
                <path d="M172.154,65.476l-38.805-9.738a2.512,2.512,0,0,1-1.191-4.187l27.835-28.736a2.513,2.513,0,0,1,4.223,1.061L175.18,62.349a2.513,2.513,0,0,1-3.026,3.127Z" fill="none" stroke="#383E45" stroke-miterlimit="10" stroke-width="2.011"/>
                <path d="M3.27,111.542,34.089,86.974a2.515,2.515,0,0,1,3.533.4l24.567,30.82a2.513,2.513,0,0,1-.4,3.532l-30.82,24.567a2.513,2.513,0,0,1-3.532-.4L2.871,115.074a2.513,2.513,0,0,1,.4-3.532" fill="#3AADAA"/>
                <path d="M15.6,115.807,46.414,91.24a2.513,2.513,0,0,1,3.533.4l24.567,30.819a2.514,2.514,0,0,1-.4,3.533L43.3,150.558a2.514,2.514,0,0,1-3.532-.4L15.2,119.34A2.514,2.514,0,0,1,15.6,115.807Z" fill="none" stroke="#383E45" stroke-miterlimit="10" stroke-width="2.011"/>
                <path d="M540.155,174.169l6.968-39.393a2.513,2.513,0,0,1,4.092-1.508L581.851,159a2.514,2.514,0,0,1-.759,4.288l-37.6,13.659a2.514,2.514,0,0,1-3.333-2.78Z" fill="#3AADAA"/>
                <path d="M549.234,175.592l6.968-39.4a2.513,2.513,0,0,1,4.092-1.483l30.631,25.734a2.513,2.513,0,0,1-.754,4.288l-37.6,13.664a2.513,2.513,0,0,1-3.333-2.805Z" fill="none" stroke="#383E45" stroke-miterlimit="10" stroke-width="2.011"/>
                <path d="M520.675,40.863a16.62,16.62,0,1,1-16.62,16.62,16.62,16.62,0,0,1,16.62-16.62" fill="#28AFEA"/>
                <circle cx="11.09" cy="11.09" r="11.09" transform="translate(516.88 53.936) rotate(-70.67)" fill="none" stroke="#383E45" stroke-linecap="round" stroke-linejoin="round" stroke-width="2.011"/>
                <path d="M492.518,257.686l-3.891-36.1a2.513,2.513,0,0,1,3.242-2.67l27.555,8.546a2.514,2.514,0,0,1,1.161,4.022l-23.658,27.539a2.513,2.513,0,0,1-4.409-1.342" fill="#F6F6F6"/>
                <path d="M502.5,255l-3.9-36.1a2.514,2.514,0,0,1,3.247-2.67l27.555,8.546a2.513,2.513,0,0,1,1.156,4.022l-23.658,27.539A2.513,2.513,0,0,1,502.5,255Z" fill="none" stroke="#383E45" stroke-miterlimit="10" stroke-width="2.011"/>
                <path d="M619.067,238.256A2.262,2.262,0,1,1,616.8,236h.005A2.263,2.263,0,0,1,619.067,238.256Z" fill="none" stroke="#28AFEA" stroke-miterlimit="10" stroke-width="1.005"/>
                <path d="M627.382,238.256a2.257,2.257,0,1,1-.663-1.6A2.258,2.258,0,0,1,627.382,238.256Z" fill="none" stroke="#28AFEA" stroke-miterlimit="10" stroke-width="1.005"/>
                <path d="M623.149,245.4a2.262,2.262,0,1,1-2.267-2.257h.01A2.263,2.263,0,0,1,623.149,245.4Z" fill="none" stroke="#28AFEA" stroke-miterlimit="10" stroke-width="1.005"/>
                <path d="M631.464,245.4a2.262,2.262,0,1,1-2.267-2.257h.01A2.263,2.263,0,0,1,631.464,245.4Z" fill="none" stroke="#28AFEA" stroke-miterlimit="10" stroke-width="1.005"/>
                <path d="M627.161,252.553a2.262,2.262,0,1,1-2.267-2.257h.01A2.263,2.263,0,0,1,627.161,252.553Z" fill="none" stroke="#28AFEA" stroke-miterlimit="10" stroke-width="1.005"/>
                <path d="M635.481,252.553a2.262,2.262,0,1,1-2.267-2.257h.005A2.263,2.263,0,0,1,635.481,252.553Z" fill="none" stroke="#28AFEA" stroke-miterlimit="10" stroke-width="1.005"/>
                <path d="M631.248,259.7a2.257,2.257,0,1,1-.663-1.6A2.258,2.258,0,0,1,631.248,259.7Z" fill="none" stroke="#28AFEA" stroke-miterlimit="10" stroke-width="1.005"/>
                <path d="M639.563,259.7a2.257,2.257,0,1,1-.663-1.6A2.257,2.257,0,0,1,639.563,259.7Z" fill="none" stroke="#28AFEA" stroke-miterlimit="10" stroke-width="1.005"/>
                <path d="M129.649,212.255l32.224,16.715a2.514,2.514,0,0,1,.433,4.183l-22.371,18.224a2.514,2.514,0,0,1-4.022-1.267l-9.858-34.944a2.514,2.514,0,0,1,3.594-2.911Z" fill="#28AFEA"/>
                <path d="M126.346,222.058l32.229,16.715a2.513,2.513,0,0,1,.428,4.183L136.637,261.18a2.514,2.514,0,0,1-4.022-1.267l-9.858-34.944a2.513,2.513,0,0,1,3.589-2.911Z" fill="none" stroke="#383E45" stroke-miterlimit="10" stroke-width="2.011"/>
                <path d="M44.294,174.338a9.527,9.527,0,1,1,0,13.473A9.528,9.528,0,0,1,44.294,174.338Z" fill="none" stroke="#383E45" stroke-linecap="round" stroke-linejoin="round" stroke-width="2.011"/>
                <path d="M366.752,48.338l8.622-16.348a2.512,2.512,0,0,1,3.4-1.043,2.4,2.4,0,0,1,.442.3l9.718,8.154a2.513,2.513,0,0,0,3.519-.312L405.773,23.2a2.513,2.513,0,0,1,3.519-.312l4.922,4.133a2.514,2.514,0,0,0,3.519-.307L429.657,12.5a2.513,2.513,0,0,1,3.519-.312l5.656,4.746" fill="none" stroke="#383E45" stroke-linecap="round" stroke-miterlimit="10" stroke-width="2.011"/>
                <path d="M432.629,17a9.557,9.557,0,1,1,8.764,10.289A9.555,9.555,0,0,1,432.629,17Z" fill="none" stroke="#3AADAA" stroke-linecap="round" stroke-linejoin="round" stroke-width="2.017"/>
                <path d="M404.679,14.24a3.388,3.388,0,1,1,3.13,3.628,3.388,3.388,0,0,1-3.13-3.628" fill="#28AFEA"/>
                <path d="M370.84,28.5a5.771,5.771,0,1,1,5.331,6.18A5.773,5.773,0,0,1,370.84,28.5Z" fill="none" stroke="#3AADAA" stroke-linecap="round" stroke-linejoin="round" stroke-width="2.011"/>
                <path d="M172.73,254.794a9.527,9.527,0,1,1-5.156,12.447,9.527,9.527,0,0,1,5.156-12.447" fill="#3AADAA"/>
                <path d="M623.9,93.688a9.527,9.527,0,1,1,7.357,11.286A9.526,9.526,0,0,1,623.9,93.688" fill="#F6F6F6"/>
                <path d="M4.974,231.132a2.262,2.262,0,1,1-2.7-1.719,2.262,2.262,0,0,1,2.7,1.719Z" fill="none" stroke="#3AADAA" stroke-miterlimit="10" stroke-width="1.005"/>
                <path d="M12.3,225.8a2.257,2.257,0,1,1-.992-1.421A2.257,2.257,0,0,1,12.3,225.8Z" fill="none" stroke="#3AADAA" stroke-miterlimit="10" stroke-width="1.005"/>
                <path d="M21.207,227.533a2.262,2.262,0,1,1-2.7-1.719,2.262,2.262,0,0,1,2.7,1.719Z" fill="none" stroke="#3AADAA" stroke-miterlimit="10" stroke-width="1.005"/>
                <path d="M30.11,229.182a2.262,2.262,0,1,1-2.7-1.719,2.262,2.262,0,0,1,2.7,1.719Z" fill="none" stroke="#3AADAA" stroke-miterlimit="10" stroke-width="1.005"/>
                <path d="M37.445,223.938a2.262,2.262,0,1,1-2.7-1.719,2.262,2.262,0,0,1,2.7,1.719Z" fill="none" stroke="#3AADAA" stroke-miterlimit="10" stroke-width="1.005"/>
                <path d="M43.648,217.554a2.262,2.262,0,1,1-2.7-1.718h0A2.262,2.262,0,0,1,43.648,217.554Z" fill="none" stroke="#3AADAA" stroke-miterlimit="10" stroke-width="1.005"/>
                <path d="M6.8,238.05a2.262,2.262,0,1,1-2.717-1.689l.022,0A2.262,2.262,0,0,1,6.8,238.05Z" fill="none" stroke="#3AADAA" stroke-miterlimit="10" stroke-width="1.005"/>
                <path d="M14.134,232.716a2.262,2.262,0,1,1-2.7-1.718h0A2.262,2.262,0,0,1,14.134,232.716Z" fill="none" stroke="#3AADAA" stroke-miterlimit="10" stroke-width="1.005"/>
                <path d="M23.037,234.45a2.251,2.251,0,1,1-.991-1.423A2.252,2.252,0,0,1,23.037,234.45Z" fill="none" stroke="#3AADAA" stroke-miterlimit="10" stroke-width="1.005"/>
                <path d="M31.92,236.1a2.257,2.257,0,1,1-.992-1.421A2.257,2.257,0,0,1,31.92,236.1Z" fill="none" stroke="#3AADAA" stroke-miterlimit="10" stroke-width="1.005"/>
                <path d="M39.275,230.851a2.262,2.262,0,1,1-2.7-1.719,2.262,2.262,0,0,1,2.7,1.719Z" fill="none" stroke="#3AADAA" stroke-miterlimit="10" stroke-width="1.005"/>
                <path d="M45.478,224.471a2.257,2.257,0,1,1-.99-1.419A2.258,2.258,0,0,1,45.478,224.471Z" fill="none" stroke="#3AADAA" stroke-miterlimit="10" stroke-width="1.005"/>
                <path d="M8.629,244.962a2.262,2.262,0,1,1-2.7-1.713h.007A2.262,2.262,0,0,1,8.629,244.962Z" fill="none" stroke="#3AADAA" stroke-miterlimit="10" stroke-width="1.005"/>
                <path d="M15.969,239.633a2.262,2.262,0,1,1-2.7-1.719,2.262,2.262,0,0,1,2.7,1.719Z" fill="none" stroke="#3AADAA" stroke-miterlimit="10" stroke-width="1.005"/>
                <path d="M24.867,241.383a2.257,2.257,0,1,1-.99-1.419A2.258,2.258,0,0,1,24.867,241.383Z" fill="none" stroke="#3AADAA" stroke-miterlimit="10" stroke-width="1.005"/>
                <path d="M33.75,243.017a2.257,2.257,0,1,1-.99-1.419A2.258,2.258,0,0,1,33.75,243.017Z" fill="none" stroke="#3AADAA" stroke-miterlimit="10" stroke-width="1.005"/>
                <path d="M41.1,237.768a2.251,2.251,0,1,1-.989-1.421A2.253,2.253,0,0,1,41.1,237.768Z" fill="none" stroke="#3AADAA" stroke-miterlimit="10" stroke-width="1.005"/>
                <path d="M47.313,231.389a2.262,2.262,0,1,1-2.7-1.719,2.262,2.262,0,0,1,2.7,1.719Z" fill="none" stroke="#3AADAA" stroke-miterlimit="10" stroke-width="1.005"/>
                <path d="M10.464,251.88a2.262,2.262,0,1,1-2.7-1.719,2.262,2.262,0,0,1,2.7,1.719Z" fill="none" stroke="#3AADAA" stroke-miterlimit="10" stroke-width="1.005"/>
                <path d="M17.8,246.551a2.257,2.257,0,1,1-.992-1.421A2.257,2.257,0,0,1,17.8,246.551Z" fill="none" stroke="#3AADAA" stroke-miterlimit="10" stroke-width="1.005"/>
                <path d="M26.7,248.28a2.262,2.262,0,1,1-2.7-1.714h0A2.262,2.262,0,0,1,26.7,248.28Z" fill="none" stroke="#3AADAA" stroke-miterlimit="10" stroke-width="1.005"/>
                <path d="M35.585,249.929a2.262,2.262,0,1,1-2.7-1.714h0A2.262,2.262,0,0,1,35.585,249.929Z" fill="none" stroke="#3AADAA" stroke-miterlimit="10" stroke-width="1.005"/>
                <path d="M42.94,244.686a2.262,2.262,0,1,1-2.7-1.719,2.262,2.262,0,0,1,2.7,1.719Z" fill="none" stroke="#3AADAA" stroke-miterlimit="10" stroke-width="1.005"/>
                <path d="M49.143,238.3a2.262,2.262,0,1,1-2.7-1.713h.007A2.262,2.262,0,0,1,49.143,238.3Z" fill="none" stroke="#3AADAA" stroke-miterlimit="10" stroke-width="1.005"/>
                <path d="M12.294,258.8a2.251,2.251,0,1,1-.989-1.421A2.253,2.253,0,0,1,12.294,258.8Z" fill="none" stroke="#3AADAA" stroke-miterlimit="10" stroke-width="1.005"/>
                <path d="M19.628,253.448a2.257,2.257,0,1,1-.99-1.419A2.258,2.258,0,0,1,19.628,253.448Z" fill="none" stroke="#3AADAA" stroke-miterlimit="10" stroke-width="1.005"/>
                <path d="M28.532,255.2a2.262,2.262,0,1,1-2.7-1.719,2.262,2.262,0,0,1,2.7,1.719Z" fill="none" stroke="#3AADAA" stroke-miterlimit="10" stroke-width="1.005"/>
                <path d="M37.415,256.847a2.262,2.262,0,1,1-2.7-1.719,2.263,2.263,0,0,1,2.7,1.719Z" fill="none" stroke="#3AADAA" stroke-miterlimit="10" stroke-width="1.005"/>
                <path d="M44.77,251.6a2.257,2.257,0,1,1-.992-1.421A2.257,2.257,0,0,1,44.77,251.6Z" fill="none" stroke="#3AADAA" stroke-miterlimit="10" stroke-width="1.005"/>
                <path d="M50.973,245.219a2.262,2.262,0,1,1-2.7-1.718h0A2.262,2.262,0,0,1,50.973,245.219Z" fill="none" stroke="#3AADAA" stroke-miterlimit="10" stroke-width="1.005"/>
                <path d="M30.036,26.842a9.527,9.527,0,1,1,7.1,11.447,9.527,9.527,0,0,1-7.1-11.447" fill="#F6F6F6"/>
                <path d="M48.362,41.876a5.4,5.4,0,1,1,4.027,6.488,5.4,5.4,0,0,1-4.027-6.488" fill="#3AADAA"/>
                <path d="M574.749,214.142l10.006-1.822a1.006,1.006,0,0,1,1.169.809l2.995,16.45a1,1,0,0,1-.809,1.169L578.1,232.57a1,1,0,0,1-1.17-.809l-2.995-16.45a1,1,0,0,1,.809-1.169" fill="#3AADAA"/>
                <path d="M625.24,39.736,613.893,25.452a1.5,1.5,0,0,1,.242-2.112l11.837-9.4a1.5,1.5,0,0,1,2.111.242L639.43,28.464a1.5,1.5,0,0,1-.242,2.112l-11.837,9.4a1.5,1.5,0,0,1-2.111-.243" fill="#3AADAA"/>
                <path d="M635.951,35.635,624.538,21.318a1.507,1.507,0,0,1,.24-2.119l11.863-9.458a1.508,1.508,0,0,1,2.12.24L650.174,24.3a1.507,1.507,0,0,1-.24,2.119L638.07,35.874A1.508,1.508,0,0,1,635.951,35.635Z" fill="none" stroke="#383E45" stroke-miterlimit="10" stroke-width="2.011"/>
                <path d="M65.614,185.982l1.424-4.989a1.006,1.006,0,0,1,1.243-.691l4.989,1.424a1,1,0,0,1,.69,1.243l-1.423,4.989a1.006,1.006,0,0,1-1.243.691l-4.989-1.424a1.006,1.006,0,0,1-.691-1.243" fill="#3AADAA"/>
                <rect width="4.615" height="4.615" transform="translate(60.268 193.11) rotate(-27.531)" fill="#F6F6F6"/>
                <path d="M571.466,229.478a5.545,5.545,0,1,1,4.585,6.362,5.545,5.545,0,0,1-4.585-6.362" fill="#28AFEA"/>
                <path d="M134.309,105.306a16.62,16.62,0,1,1-16.62,16.62,16.62,16.62,0,0,1,16.62-16.62" fill="#F6F6F6"/>
                <path d="M134.309,105.306a16.62,16.62,0,1,1-16.62,16.62,16.62,16.62,0,0,1,16.62-16.62" fill="#F6F6F6"/>
                <path d="M122.279,125.647a8.31,8.31,0,1,1-8.31,8.31,8.311,8.311,0,0,1,8.31-8.31" fill="#28AFEA"/>
                <rect width="17.56" height="17.56" transform="translate(220.442 9.256) rotate(-31.809)" fill="#F6F6F6"/>
                <path d="M231.148,12.077a8.083,8.083,0,1,1-8.084,8.084A8.084,8.084,0,0,1,231.148,12.077Z" fill="none" stroke="#383E45" stroke-miterlimit="10" stroke-width="2.011"/>
                <line x2="28.193" y2="28.63" transform="translate(129.126 124.184)" fill="none" stroke="#383E45" stroke-linecap="round" stroke-miterlimit="10" stroke-width="2.011"/>
            </g>
            <text transform="translate(276 1348)" fill="#3AADAA" font-size="25.346" font-family="VarelaRound-Regular, Varela Round" letter-spacing="-0.01em">
                <tspan x="0" y="0">Section Title</tspan>
            </text>
            <g transform="translate(267.919 1366)" opacity="0.4">
                <rect width="164" height="2" transform="translate(0.081)" fill="#22263c"/>
                <rect width="154.546" height="2" transform="translate(5 5)" fill="#22263c"/>
            </g>
            <g>
                <rect width="102" height="32" rx="16" transform="translate(299 1399)" fill="#3AADAA"/>
                <text transform="translate(350 1419)" fill="#FFFFFF" font-size="11" font-family="Arial-BoldMT, Arial, sans-serif" font-weight="700">
                    <tspan x="-29.031" y="0">Contact Us</tspan>
                </text>
            </g>
        </g>
        <g class="svgc_footer" transform="translate(0 1663)">
            <rect width="700" height="187" fill="#FOOTER_COLOR" class="svgc_footer_bg"/>
            <g transform="translate(284 81)" opacity="0.4">
                <circle cx="38.5" cy="7.5" r="7.5" fill="#FOOTER_COLOR" filter="url(#filter_readability_kiddo)"/>
                <circle cx="66.5" cy="7.5" r="7.5" fill="#FOOTER_COLOR" filter="url(#filter_readability_kiddo)"/>
                <circle cx="94.5" cy="7.5" r="7.5" fill="#FOOTER_COLOR" filter="url(#filter_readability_kiddo)"/>
                <g opacity="0.4" transform="translate(0 30)">
                    <rect width="131" height="2" fill="#FOOTER_COLOR" filter="url(#filter_readability_kiddo)"/>
                    <rect width="116" height="2" x="8" y="5" fill="#FOOTER_COLOR" filter="url(#filter_readability_kiddo)"/>
                    <rect width="79" height="2" x="26" y="10" fill="#FOOTER_COLOR" filter="url(#filter_readability_kiddo)"/>
                    <rect width="91" height="2" x="20" y="15" fill="#FOOTER_COLOR" filter="url(#filter_readability_kiddo)"/>
                </g>
            </g>
        </g>
    </g>
</svg>
