{
    "name": "Incole.Save.Scriptable",
    "rootNamespace": "",
    "references": [
        "GUID:0e95ce10e2b832f4db622dca4eb3aa9d",
        "GUID:e0e6a41c334e92f4f8eb025dade14810"
    ],
    "includePlatforms": [],
    "excludePlatforms": [],
    "allowUnsafeCode": false,
    "overrideReferences": false,
    "precompiledReferences": [],
    "autoReferenced": true,
    "defineConstraints": [],
    "versionDefines": [],
    "noEngineReferences": false
}