<?xml version="1.0" encoding="UTF-8" standalone="no"?>
<svg
   width="272.73755mm"
   height="202.8799mm"
   viewBox="0 0 272.73755 202.8799"
   version="1.1"
   id="svg929"
   inkscape:version="1.2.2 (b0a8486541, 2022-12-01)"
   sodipodi:docname="matrice-kano.svg"
   xmlns:inkscape="http://www.inkscape.org/namespaces/inkscape"
   xmlns:sodipodi="http://sodipodi.sourceforge.net/DTD/sodipodi-0.dtd"
   xmlns:xlink="http://www.w3.org/1999/xlink"
   xmlns="http://www.w3.org/2000/svg"
   xmlns:svg="http://www.w3.org/2000/svg"
   xmlns:rdf="http://www.w3.org/1999/02/22-rdf-syntax-ns#"
   xmlns:cc="http://creativecommons.org/ns#"
   xmlns:dc="http://purl.org/dc/elements/1.1/">
  <defs
     id="defs923">
    <linearGradient
       inkscape:collect="always"
       id="linearGradient2040">
      <stop
         style="stop-color:#d8dee9;stop-opacity:1;"
         offset="0"
         id="stop2036" />
      <stop
         style="stop-color:#d8dee9;stop-opacity:0;"
         offset="1"
         id="stop2038" />
    </linearGradient>
    <marker
       style="overflow:visible"
       id="Arrow1Mstart"
       refX="0"
       refY="0"
       orient="auto"
       inkscape:stockid="Arrow1Mstart"
       inkscape:isstock="true">
      <path
         transform="matrix(0.4,0,0,0.4,4,0)"
         style="fill:#2e3440;fill-opacity:1;fill-rule:evenodd;stroke:#2e3440;stroke-width:1pt;stroke-opacity:1"
         d="M 0,0 5,-5 -12.5,0 5,5 Z"
         id="path1500" />
    </marker>
    <marker
       id="ExperimentalArrow"
       refX="5"
       refY="3"
       orient="auto-start-reverse"
       inkscape:stockid="ExperimentalArrow"
       inkscape:isstock="true">
      <path
         style="fill:context-stroke;stroke:#000000;stroke-opacity:1"
         d="M 10,3 0,6 V 0 Z"
         id="path1747" />
    </marker>
    <marker
       style="overflow:visible"
       id="Arrow1Lend"
       refX="0"
       refY="0"
       orient="auto"
       inkscape:stockid="Arrow1Lend"
       inkscape:isstock="true">
      <path
         transform="matrix(-0.8,0,0,-0.8,-10,0)"
         style="fill:#000000;fill-opacity:1;fill-rule:evenodd;stroke:#000000;stroke-width:1pt;stroke-opacity:1"
         d="M 0,0 5,-5 -12.5,0 5,5 Z"
         id="path1497" />
    </marker>
    <marker
       style="overflow:visible"
       id="Arrow1Mstart-2"
       refX="0"
       refY="0"
       orient="auto"
       inkscape:stockid="Arrow1Mstart"
       inkscape:isstock="true">
      <path
         transform="matrix(0.4,0,0,0.4,4,0)"
         style="fill:#2e3440;fill-opacity:1;fill-rule:evenodd;stroke:#2e3440;stroke-width:1pt;stroke-opacity:1"
         d="M 0,0 5,-5 -12.5,0 5,5 Z"
         id="path1500-0" />
    </marker>
    <radialGradient
       inkscape:collect="always"
       xlink:href="#linearGradient2040"
       id="radialGradient2042"
       cx="146.59619"
       cy="95.862495"
       fx="146.59619"
       fy="95.862495"
       r="31.900187"
       gradientUnits="userSpaceOnUse"
       gradientTransform="matrix(1.5959244,0,0,1.5959244,-88.160243,-58.55842)" />
    <marker
       style="overflow:visible"
       id="Arrow1Mstart-8"
       refX="0"
       refY="0"
       orient="auto"
       inkscape:stockid="Arrow1Mstart"
       inkscape:isstock="true">
      <path
         transform="matrix(0.4,0,0,0.4,4,0)"
         style="fill:#5e81ac;fill-opacity:1;fill-rule:evenodd;stroke:#5e81ac;stroke-width:1pt;stroke-opacity:1"
         d="M 0,0 5,-5 -12.5,0 5,5 Z"
         id="path1500-4" />
    </marker>
  </defs>
  <sodipodi:namedview
     id="base"
     pagecolor="#ffffff"
     bordercolor="#666666"
     borderopacity="1.0"
     inkscape:pageopacity="0.0"
     inkscape:pageshadow="2"
     inkscape:zoom="0.7"
     inkscape:cx="485"
     inkscape:cy="308.57143"
     inkscape:document-units="mm"
     inkscape:current-layer="layer1"
     inkscape:document-rotation="0"
     showgrid="false"
     fit-margin-top="0"
     fit-margin-left="0"
     fit-margin-right="0"
     fit-margin-bottom="0"
     inkscape:window-width="1920"
     inkscape:window-height="1011"
     inkscape:window-x="0"
     inkscape:window-y="0"
     inkscape:window-maximized="1"
     inkscape:showpageshadow="2"
     inkscape:pagecheckerboard="0"
     inkscape:deskcolor="#d1d1d1" />
  <metadata
     id="metadata926">
    <rdf:RDF>
      <cc:Work
         rdf:about="">
        <dc:format>image/svg+xml</dc:format>
        <dc:type
           rdf:resource="http://purl.org/dc/dcmitype/StillImage" />
        <dc:title />
      </cc:Work>
    </rdf:RDF>
  </metadata>
  <g
     inkscape:label="Calque 1"
     inkscape:groupmode="layer"
     id="layer1"
     transform="translate(-22.866384,-2.1008127)">
    <path
       style="fill:#2e3440;stroke:#2e3440;stroke-width:1.00898;stroke-linecap:butt;stroke-linejoin:miter;stroke-miterlimit:4;stroke-dasharray:none;stroke-opacity:1;marker-start:url(#Arrow1Mstart)"
       d="m 145.77242,13.372697 0.61933,181.814043"
       id="path1492" />
    <circle
       style="fill:url(#radialGradient2042);fill-opacity:1;stroke:none;stroke-width:1.41475;stroke-miterlimit:4;stroke-dasharray:none"
       id="path2008"
       cx="145.79619"
       cy="94.43087"
       r="50.910286" />
    <path
       style="fill:#01526d;stroke:#5e81ac;stroke-width:1.16222;stroke-linecap:butt;stroke-linejoin:miter;stroke-miterlimit:4;stroke-dasharray:none;stroke-opacity:1;marker-start:url(#Arrow1Mstart-8)"
       d="M 227.87102,12.679424 47.564157,193.813"
       id="path1492-3" />
    <path
       style="fill:#2e3440;stroke:#2e3440;stroke-width:1.08266;stroke-linecap:butt;stroke-linejoin:miter;stroke-miterlimit:4;stroke-dasharray:none;stroke-opacity:1;marker-start:url(#Arrow1Mstart-2)"
       d="M 254.58341,94.409971 39.067593,95.01154"
       id="path1492-6" />
    <text
       xml:space="preserve"
       style="font-style:normal;font-variant:normal;font-weight:normal;font-stretch:normal;font-size:7.05556px;line-height:1.25;font-family:sans-serif;-inkscape-font-specification:'sans-serif, Normal';font-variant-ligatures:normal;font-variant-caps:normal;font-variant-numeric:normal;font-variant-east-asian:normal;letter-spacing:0px;word-spacing:0px;fill:#000000;fill-opacity:1;stroke:none;stroke-width:0.264583"
       x="125.02471"
       y="8.6393652"
       id="text1961"><tspan
         sodipodi:role="line"
         id="tspan1959"
         x="125.02471"
         y="8.6393652"
         style="font-style:normal;font-variant:normal;font-weight:normal;font-stretch:normal;font-size:7.05556px;font-family:sans-serif;-inkscape-font-specification:'sans-serif, Normal';font-variant-ligatures:normal;font-variant-caps:normal;font-variant-numeric:normal;font-variant-east-asian:normal;stroke-width:0.264583">Satisfaction</tspan></text>
    <text
       xml:space="preserve"
       style="font-style:normal;font-variant:normal;font-weight:normal;font-stretch:normal;font-size:7.05556px;line-height:1.25;font-family:sans-serif;-inkscape-font-specification:'sans-serif, Normal';font-variant-ligatures:normal;font-variant-caps:normal;font-variant-numeric:normal;font-variant-east-asian:normal;letter-spacing:0px;word-spacing:0px;fill:#000000;fill-opacity:1;stroke:none;stroke-width:0.264583"
       x="123.98328"
       y="202.38194"
       id="text1965"><tspan
         sodipodi:role="line"
         id="tspan1963"
         x="123.98328"
         y="202.38194"
         style="font-style:normal;font-variant:normal;font-weight:normal;font-stretch:normal;font-size:7.05556px;font-family:sans-serif;-inkscape-font-specification:'sans-serif, Normal';font-variant-ligatures:normal;font-variant-caps:normal;font-variant-numeric:normal;font-variant-east-asian:normal;stroke-width:0.264583">Insatisfaction</tspan></text>
    <text
       xml:space="preserve"
       style="font-style:normal;font-weight:normal;font-size:7.05556px;line-height:1.25;font-family:sans-serif;letter-spacing:0px;word-spacing:0px;fill:#000000;fill-opacity:1;stroke:none;stroke-width:0.264583"
       x="22.17392"
       y="104.09863"
       id="text1969"><tspan
         sodipodi:role="line"
         x="22.17392"
         y="104.09863"
         style="font-size:7.05556px;stroke-width:0.264583"
         id="tspan1975">Fonction absente</tspan></text>
    <text
       xml:space="preserve"
       style="font-style:normal;font-weight:normal;font-size:7.05556px;line-height:1.25;font-family:sans-serif;letter-spacing:0px;word-spacing:0px;fill:#000000;fill-opacity:1;stroke:none;stroke-width:0.264583"
       x="232.32402"
       y="88.855629"
       id="text1969-5"><tspan
         sodipodi:role="line"
         x="232.32402"
         y="88.855629"
         style="font-size:7.05556px;stroke-width:0.264583"
         id="tspan1975-4">Fonction présente</tspan></text>
    <text
       xml:space="preserve"
       style="font-style:normal;font-variant:normal;font-weight:normal;font-stretch:normal;font-size:7.05556px;line-height:1.25;font-family:sans-serif;-inkscape-font-specification:'sans-serif, Normal';font-variant-ligatures:normal;font-variant-caps:normal;font-variant-numeric:normal;font-variant-east-asian:normal;letter-spacing:0px;word-spacing:0px;fill:#4c566a;fill-opacity:1;stroke:none;stroke-width:0.264583"
       x="125.84047"
       y="91.973099"
       id="text2006"><tspan
         sodipodi:role="line"
         id="tspan2004"
         x="125.84047"
         y="91.973099"
         style="font-style:normal;font-variant:normal;font-weight:normal;font-stretch:normal;font-size:7.05556px;font-family:sans-serif;-inkscape-font-specification:'sans-serif, Normal';font-variant-ligatures:normal;font-variant-caps:normal;font-variant-numeric:normal;font-variant-east-asian:normal;fill:#4c566a;stroke-width:0.264583">Indiférence</tspan></text>
    <text
       xml:space="preserve"
       style="font-style:normal;font-weight:normal;font-size:7.05556px;line-height:1.25;font-family:sans-serif;letter-spacing:0px;word-spacing:0px;fill:#01526d;fill-opacity:1;stroke:none;stroke-width:0.264583"
       id="text2161"
       transform="rotate(180,145.7347,93.49459)"><textPath
         xlink:href="#path1492-3"
         id="textPath2169"
         style="font-size:7.05556px;fill:#01526d">Performance linéaire</textPath></text>
    <text
       xml:space="preserve"
       style="font-size:7.05556px;line-height:1.25;font-family:sans-serif;-inkscape-font-specification:'sans-serif, Normal';letter-spacing:0px;word-spacing:0px;fill:#01526d;stroke-width:0.264583"
       x="38.73267"
       y="202.31993"
       id="text2263"><tspan
         sodipodi:role="line"
         id="tspan2261"
         x="38.73267"
         y="202.31993"
         style="fill:#01526d;stroke-width:0.264583">0%</tspan></text>
    <text
       xml:space="preserve"
       style="font-size:7.05556px;line-height:1.25;font-family:sans-serif;-inkscape-font-specification:'sans-serif, Normal';letter-spacing:0px;word-spacing:0px;fill:#01526d;stroke-width:0.264583"
       x="235.66902"
       y="8.5773535"
       id="text2267"><tspan
         sodipodi:role="line"
         id="tspan2265"
         x="235.66902"
         y="8.5773535"
         style="fill:#01526d;stroke-width:0.264583">100%</tspan></text>
    <path
       style="fill:none;stroke:#c35151;stroke-width:2;stroke-linecap:butt;stroke-linejoin:miter;stroke-miterlimit:4;stroke-dasharray:none;stroke-opacity:1"
       d="m 87.94861,194.09629 c 46.96894,-87.7634 62.50667,-91.77816 161.50976,-91.66207"
       id="path2269"
       sodipodi:nodetypes="cc" />
    <text
       xml:space="preserve"
       style="font-size:7.05556px;line-height:1.25;font-family:sans-serif;-inkscape-font-specification:'sans-serif, Normal';letter-spacing:0px;word-spacing:0px;fill:#c35151;stroke-width:0.264583;stroke:#c35151"
       x="197.75035"
       y="144.9077"
       id="text2306"><tspan
         sodipodi:role="line"
         x="197.75035"
         y="144.9077"
         style="fill:#c35151;stroke-width:0.264583;stroke:#c35151"
         id="tspan2310">Attentes de base</tspan></text>
    <text
       xml:space="preserve"
       style="font-size:7.05556px;line-height:1.25;font-family:sans-serif;-inkscape-font-specification:'sans-serif, Normal';letter-spacing:0px;word-spacing:0px;fill:#3c845c;stroke-width:0.264583;stroke:#3c845c"
       x="54.104008"
       y="28.85618"
       id="text2306-9"><tspan
         sodipodi:role="line"
         x="54.104008"
         y="28.85618"
         style="fill:#3c845c;stroke-width:0.264583;stroke:#3c845c"
         id="tspan2310-3">Exigences attractives</tspan></text>
    <text
       xml:space="preserve"
       style="font-style:normal;font-variant:normal;font-weight:normal;font-stretch:normal;font-size:4.23333px;line-height:1.25;font-family:sans-serif;-inkscape-font-specification:'sans-serif, Normal';font-variant-ligatures:normal;font-variant-caps:normal;font-variant-numeric:normal;font-variant-east-asian:normal;letter-spacing:0px;word-spacing:0px;fill:#2e3440;stroke-width:0.264583"
       x="49.44733"
       y="36.082111"
       id="text2351"><tspan
         sodipodi:role="line"
         id="tspan2349"
         x="49.44733"
         y="36.082111"
         style="font-style:normal;font-variant:normal;font-weight:normal;font-stretch:normal;font-size:4.23333px;font-family:sans-serif;-inkscape-font-specification:'sans-serif, Normal';font-variant-ligatures:normal;font-variant-caps:normal;font-variant-numeric:normal;font-variant-east-asian:normal;fill:#2e3440;stroke-width:0.264583">Besoins nécessaires, mais peut-être non</tspan><tspan
         sodipodi:role="line"
         x="49.44733"
         y="41.373772"
         style="font-style:normal;font-variant:normal;font-weight:normal;font-stretch:normal;font-size:4.23333px;font-family:sans-serif;-inkscape-font-specification:'sans-serif, Normal';font-variant-ligatures:normal;font-variant-caps:normal;font-variant-numeric:normal;font-variant-east-asian:normal;fill:#2e3440;stroke-width:0.264583"
         id="tspan2353">exprimés.</tspan><tspan
         sodipodi:role="line"
         x="49.44733"
         y="46.665436"
         style="font-style:normal;font-variant:normal;font-weight:normal;font-stretch:normal;font-size:4.23333px;font-family:sans-serif;-inkscape-font-specification:'sans-serif, Normal';font-variant-ligatures:normal;font-variant-caps:normal;font-variant-numeric:normal;font-variant-east-asian:normal;fill:#2e3440;stroke-width:0.264583"
         id="tspan2355">C’est l’effet WOW ! qui surprendra le</tspan><tspan
         sodipodi:role="line"
         x="49.44733"
         y="51.9571"
         style="font-style:normal;font-variant:normal;font-weight:normal;font-stretch:normal;font-size:4.23333px;font-family:sans-serif;-inkscape-font-specification:'sans-serif, Normal';font-variant-ligatures:normal;font-variant-caps:normal;font-variant-numeric:normal;font-variant-east-asian:normal;fill:#2e3440;stroke-width:0.264583"
         id="tspan2357">client ! l’heureuse surprise.</tspan></text>
    <path
       style="fill:none;stroke:#3c845c;stroke-width:2;stroke-linecap:butt;stroke-linejoin:miter;stroke-miterlimit:4;stroke-dasharray:none;stroke-opacity:1"
       d="M 38.866019,81.796483 C 145.58376,82.513857 147.18035,93.512851 188.42642,13.615445"
       id="path2312"
       sodipodi:nodetypes="cc" />
    <text
       xml:space="preserve"
       style="font-style:normal;font-variant:normal;font-weight:normal;font-stretch:normal;font-size:4.23333px;line-height:1.25;font-family:sans-serif;-inkscape-font-specification:'sans-serif, Normal';font-variant-ligatures:normal;font-variant-caps:normal;font-variant-numeric:normal;font-variant-east-asian:normal;letter-spacing:0px;word-spacing:0px;stroke-width:0.264583"
       x="182.64333"
       y="152.91235"
       id="text2365"><tspan
         sodipodi:role="line"
         id="tspan2363"
         x="182.64333"
         y="152.91235"
         style="font-style:normal;font-variant:normal;font-weight:normal;font-stretch:normal;font-size:4.23333px;font-family:sans-serif;-inkscape-font-specification:'sans-serif, Normal';font-variant-ligatures:normal;font-variant-caps:normal;font-variant-numeric:normal;font-variant-east-asian:normal;stroke-width:0.264583">Essentielles au fonctionnement du produit</tspan><tspan
         sodipodi:role="line"
         x="182.64333"
         y="158.20401"
         style="font-style:normal;font-variant:normal;font-weight:normal;font-stretch:normal;font-size:4.23333px;font-family:sans-serif;-inkscape-font-specification:'sans-serif, Normal';font-variant-ligatures:normal;font-variant-caps:normal;font-variant-numeric:normal;font-variant-east-asian:normal;stroke-width:0.264583"
         id="tspan2367">Elles doivent être présentes pour</tspan><tspan
         sodipodi:role="line"
         x="182.64333"
         y="163.49568"
         style="font-style:normal;font-variant:normal;font-weight:normal;font-stretch:normal;font-size:4.23333px;font-family:sans-serif;-inkscape-font-specification:'sans-serif, Normal';font-variant-ligatures:normal;font-variant-caps:normal;font-variant-numeric:normal;font-variant-east-asian:normal;stroke-width:0.264583"
         id="tspan2369">assurer la satisfaction client</tspan></text>
    <text
       xml:space="preserve"
       style="font-size:7.05556px;line-height:1.25;font-family:sans-serif;-inkscape-font-specification:'sans-serif, Normal';letter-spacing:0px;word-spacing:0px;fill:#01526d;stroke-width:0.264583;stroke:#5e81ac"
       x="204.12968"
       y="42.823059"
       id="text2373"><tspan
         sodipodi:role="line"
         id="tspan2371"
         x="204.12968"
         y="42.823059"
         style="fill:#01526d;stroke-width:0.264583;stroke:#5e81ac"> Attentes proportionnelles</tspan></text>
    <text
       xml:space="preserve"
       style="font-style:normal;font-variant:normal;font-weight:normal;font-stretch:normal;font-size:4.23333px;line-height:1.25;font-family:sans-serif;-inkscape-font-specification:'sans-serif, Normal';font-variant-ligatures:normal;font-variant-caps:normal;font-variant-numeric:normal;font-variant-east-asian:normal;letter-spacing:0px;word-spacing:0px;stroke-width:0.264583"
       x="217.23833"
       y="50.89603"
       id="text2377"><tspan
         sodipodi:role="line"
         x="217.23833"
         y="50.89603"
         style="font-style:normal;font-variant:normal;font-weight:normal;font-stretch:normal;font-size:4.23333px;font-family:sans-serif;-inkscape-font-specification:'sans-serif, Normal';font-variant-ligatures:normal;font-variant-caps:normal;font-variant-numeric:normal;font-variant-east-asian:normal;stroke-width:0.264583"
         id="tspan2383">La satisfaction augmente avec </tspan><tspan
         sodipodi:role="line"
         x="217.23833"
         y="56.187691"
         style="font-style:normal;font-variant:normal;font-weight:normal;font-stretch:normal;font-size:4.23333px;font-family:sans-serif;-inkscape-font-specification:'sans-serif, Normal';font-variant-ligatures:normal;font-variant-caps:normal;font-variant-numeric:normal;font-variant-east-asian:normal;stroke-width:0.264583"
         id="tspan2398">le niveau de performance </tspan><tspan
         sodipodi:role="line"
         x="217.23833"
         y="61.479355"
         style="font-style:normal;font-variant:normal;font-weight:normal;font-stretch:normal;font-size:4.23333px;font-family:sans-serif;-inkscape-font-specification:'sans-serif, Normal';font-variant-ligatures:normal;font-variant-caps:normal;font-variant-numeric:normal;font-variant-east-asian:normal;stroke-width:0.264583"
         id="tspan2400">délivré par la fonction.</tspan></text>
  </g>
</svg>
