<?xml version="1.0" encoding="UTF-8" standalone="no"?>
<svg
   xmlns:dc="http://purl.org/dc/elements/1.1/"
   xmlns:cc="http://creativecommons.org/ns#"
   xmlns:rdf="http://www.w3.org/1999/02/22-rdf-syntax-ns#"
   xmlns:svg="http://www.w3.org/2000/svg"
   xmlns="http://www.w3.org/2000/svg"
   xmlns:sodipodi="http://sodipodi.sourceforge.net/DTD/sodipodi-0.dtd"
   xmlns:inkscape="http://www.inkscape.org/namespaces/inkscape"
   version="1.1"
   id="svg3079"
   xml:space="preserve"
   width="1587.4"
   height="1122.52"
   viewBox="0 0 1587.4 1122.52"
   sodipodi:docname="value-proposition-design-fr.svg"
   inkscape:version="1.0 (4035a4fb49, 2020-05-01)">
  <metadata
   id="metadata3085">
    <rdf:RDF>
      <cc:Work
   rdf:about="">
        <dc:format>image/svg+xml</dc:format>
        <dc:type
   rdf:resource="http://purl.org/dc/dcmitype/StillImage" />
        <dc:title></dc:title>
      </cc:Work>
    </rdf:RDF>
  </metadata>
  <defs
   id="defs3083">
    <clipPath
   clipPathUnits="userSpaceOnUse"
   id="clipPath3097">
      <path
   d="M 0,841.89 H 1190.55 V 0 H 0 Z"
   id="path3095"
   inkscape:connector-curvature="0" />
    </clipPath>
    <clipPath
   clipPathUnits="userSpaceOnUse"
   id="clipPath3421">
      <path
   d="M 0,841.89 H 1190.55 V 0 H 0 Z"
   id="path3419"
   inkscape:connector-curvature="0" />
    </clipPath>
    <clipPath
   clipPathUnits="userSpaceOnUse"
   id="clipPath3459">
      <path
   d="M 0,841.89 H 1190.55 V 0 H 0 Z"
   id="path3457"
   inkscape:connector-curvature="0" />
    </clipPath>
  
      
      
    </defs>
  <sodipodi:namedview
   inkscape:guide-bbox="true"
   showguides="true"
   pagecolor="#ffffff"
   bordercolor="#666666"
   inkscape:document-rotation="0"
   borderopacity="1"
   objecttolerance="10"
   gridtolerance="10"
   guidetolerance="10"
   inkscape:pageopacity="0"
   inkscape:pageshadow="2"
   inkscape:window-width="1641"
   inkscape:window-height="907"
   id="namedview3081"
   showgrid="false"
   inkscape:zoom="0.49497475"
   inkscape:cx="627.55257"
   inkscape:cy="498.44576"
   inkscape:window-x="0"
   inkscape:window-y="27"
   inkscape:window-maximized="0"
   inkscape:current-layer="g3087"><sodipodi:guide
     id="guide301"
     orientation="0,-1"
     position="1473.526,23.068757" /><sodipodi:guide
     id="guide303"
     orientation="0,-1"
     position="1461.4285,31.805738" /></sodipodi:namedview>
  <g
   id="g3087"
   inkscape:groupmode="layer"
   inkscape:label="poster-value-proposition-design"
   transform="matrix(1.3333333,0,0,-1.3333333,0,1122.52)">
    
    <path
   inkscape:connector-curvature="0"
   id="path3103"
   style="opacity:1;fill:none;stroke:#231f20;stroke-width:4.564;stroke-linecap:butt;stroke-linejoin:miter;stroke-miterlimit:4;stroke-dasharray:none;stroke-opacity:1;stop-opacity:1"
   d="M 38.282,123.572 H 561.718 V 647.008 H 38.282 Z" />
    
    <g
   style="opacity:1;stop-opacity:1"
   transform="translate(890.5341,123.5723)"
   id="g3109">
      <path
   inkscape:connector-curvature="0"
   id="path3111"
   style="fill:none;stroke:#231f20;stroke-width:4.564;stroke-linecap:butt;stroke-linejoin:miter;stroke-miterlimit:4;stroke-dasharray:none;stroke-opacity:1"
   d="M 0,0 C 144.312,0 261.718,117.406 261.718,261.718 261.718,406.029 144.312,523.436 0,523.436 -144.312,523.436 -261.718,406.029 -261.718,261.718 -261.718,117.406 -144.312,0 0,0 Z" />
    </g>
    <g
   style="opacity:1;stop-opacity:1"
   transform="translate(37,648.2902)"
   id="g3113">
      <path
   inkscape:connector-curvature="0"
   id="path3115"
   style="fill:none;stroke:#231f20;stroke-width:2.017;stroke-linecap:butt;stroke-linejoin:miter;stroke-miterlimit:4;stroke-dasharray:none;stroke-opacity:1"
   d="M 0,0 263,-261.963" />
    </g>
    <g
   style="opacity:1;stop-opacity:1"
   transform="translate(37,122.2902)"
   id="g3117">
      <path
   inkscape:connector-curvature="0"
   id="path3119"
   style="fill:none;stroke:#231f20;stroke-width:2.017;stroke-linecap:butt;stroke-linejoin:miter;stroke-miterlimit:4;stroke-dasharray:none;stroke-opacity:1"
   d="M 0,0 263,264.028" />
    </g>
    <g
   style="opacity:1;stop-opacity:1"
   transform="translate(1097.5273,165.442)"
   id="g3121" />
    <g
   style="opacity:1;stop-opacity:1"
   transform="translate(1097.5273,165.442)"
   id="g3123" />
    <g
   style="opacity:1;stop-opacity:1"
   transform="translate(890.5341,386.3271)"
   id="g3125">
      <path
   inkscape:connector-curvature="0"
   id="path3127"
   style="fill:none;stroke:#231f20;stroke-width:2.017;stroke-linecap:butt;stroke-linejoin:miter;stroke-miterlimit:4;stroke-dasharray:none;stroke-opacity:1"
   d="M 0,0 H -289.259" />
    </g>
    <g
   style="opacity:1;stop-opacity:1"
   transform="translate(589.2585,386.3271)"
   id="g3129">
      <path
   inkscape:connector-curvature="0"
   id="path3131"
   style="fill:none;stroke:#231f20;stroke-width:2.017;stroke-linecap:butt;stroke-linejoin:miter;stroke-miterlimit:4;stroke-dasharray:none;stroke-opacity:1"
   d="M 0,0 H -289.259" />
    </g>
    <g
   style="opacity:1;stop-opacity:1"
   transform="translate(584.5195,391.5946)"
   id="g3133">
      <path
   inkscape:connector-curvature="0"
   id="path3135"
   style="fill:#231f20;fill-opacity:1;fill-rule:nonzero;stroke:none"
   d="m 0,0 v -10.552 l 7.93,5.276 z" />
    </g>
    <g
   style="opacity:1;stop-opacity:1"
   transform="translate(606.0317,391.5946)"
   id="g3137">
      <path
   inkscape:connector-curvature="0"
   id="path3139"
   style="fill:#231f20;fill-opacity:1;fill-rule:nonzero;stroke:none"
   d="m 0,0 v -10.552 l -7.93,5.276 z" />
    </g>
    <g
   style="opacity:1;stop-opacity:1"
   transform="translate(300.0718,421.8129)"
   id="g3141" />
    <text
   id="text3145"
   style="font-variant:normal;font-weight:normal;font-stretch:normal;font-size:16px;font-family:'ARS Maquette Pro';-inkscape-font-specification:ARSMaquettePro-Regular;writing-mode:lr-tb;opacity:1;fill:#4c566a;fill-opacity:1;fill-rule:nonzero;stroke:none;stop-opacity:1;"
   transform="scale(1,-1)"
   x="291.92352"
   y="-533.18201"><tspan
     id="tspan3143"
     sodipodi:role="line"
     x="291.92352"
     y="-533.18201">Créateurs de bénéfices</tspan></text>
    <text
   id="text3149"
   style="font-variant:normal;font-weight:normal;font-stretch:normal;font-size:16px;font-family:'ARS Maquette Pro';-inkscape-font-specification:ARSMaquettePro-Regular;writing-mode:lr-tb;opacity:1;fill:#4c566a;fill-opacity:1;fill-rule:nonzero;stroke:none;stop-opacity:1;"
   transform="scale(1,-1)"
   x="283.82907"
   y="-267.32541"><tspan
     id="tspan3147"
     sodipodi:role="line"
     x="283.82907"
     y="-267.32541">Solutions aux problèmes</tspan></text>
    <text
   id="text3153"
   style="font-variant:normal;font-weight:normal;font-stretch:normal;font-size:16px;font-family:'ARS Maquette Pro';-inkscape-font-specification:ARSMaquettePro-Regular;writing-mode:lr-tb;opacity:1;fill:#4c566a;fill-opacity:1;fill-rule:nonzero;stroke:none;stop-opacity:1;"
   transform="scale(1,-1)"
   x="765.57245"
   y="-267.32541"><tspan
     id="tspan3151"
     sodipodi:role="line"
     x="765.57245"
     y="-267.32541">Problèmes</tspan></text>
    <text
   id="text3157"
   style="font-variant:normal;font-weight:normal;font-stretch:normal;font-size:16px;font-family:'ARS Maquette Pro';-inkscape-font-specification:ARSMaquettePro-Regular;writing-mode:lr-tb;opacity:1;fill:#4c566a;fill-opacity:1;fill-rule:nonzero;stroke:none;stop-opacity:1;"
   transform="scale(1,-1)"
   x="769.15045"
   y="-533.18201"><tspan
     id="tspan3155"
     sodipodi:role="line"
     x="769.15045"
     y="-533.18201">Bénéfices</tspan></text>
    <text
   id="text3161"
   style="font-variant:normal;font-weight:normal;font-stretch:normal;font-size:16px;font-family:'ARS Maquette Pro';-inkscape-font-specification:ARSMaquettePro-Regular;writing-mode:lr-tb;opacity:1;fill:#4c566a;fill-opacity:1;fill-rule:nonzero;stroke:none;stop-opacity:1;"
   transform="scale(1,-1)"
   x="99.856079"
   y="-410.62589"><tspan
     id="tspan3159"
     sodipodi:role="line"
     x="99.856079"
     y="-410.62589">Produits</tspan></text>
    <text
   id="text3165"
   style="font-variant:normal;font-weight:normal;font-stretch:normal;font-size:16px;font-family:'ARS Maquette Pro';-inkscape-font-specification:ARSMaquettePro-Regular;writing-mode:lr-tb;opacity:1;fill:#4c566a;fill-opacity:1;fill-rule:nonzero;stroke:none;stop-opacity:1;"
   transform="scale(1,-1)"
   x="96.314697"
   y="-392.62589"><tspan
     id="tspan3163"
     sodipodi:role="line"
     y="-392.62589"
     x="96.314697 107.0667 111.3867 121.0667 130.4427 136.7307 145.2907 149.1787 157.65871 167.0347">&amp; Services</tspan></text>
    <text
   id="text3173"
   style="font-variant:normal;font-weight:normal;font-stretch:normal;font-size:16px;font-family:'ARS Maquette Pro';-inkscape-font-specification:ARSMaquettePro-Regular;writing-mode:lr-tb;opacity:1;fill:#4c566a;fill-opacity:1;fill-rule:nonzero;stroke:none;stop-opacity:1;"
   transform="scale(1,-1)"
   x="1010.2377"
   y="-392.62589"><tspan
     id="tspan3171"
     sodipodi:role="line"
     x="1010.2377"
     y="-392.62589">Aspirations</tspan></text>
    <path
   inkscape:connector-curvature="0"
   id="path3175"
   style="opacity:1;fill:#ffffff;fill-opacity:1;fill-rule:nonzero;stroke:none;stop-opacity:1"
   d="m 587.457,743.885 h 14.969 v 32.595 h -14.969 z" />
    <path
   inkscape:connector-curvature="0"
   id="path3177"
   style="opacity:1;fill:#ffffff;fill-opacity:1;fill-rule:nonzero;stroke:none;stop-opacity:1"
   d="m 617.216,743.885 h 14.969 v 32.595 h -14.969 z" />
    <path
   inkscape:connector-curvature="0"
   id="path3179"
   style="opacity:1;fill:none;stroke:#231f20;stroke-width:0.922;stroke-linecap:butt;stroke-linejoin:miter;stroke-miterlimit:4;stroke-dasharray:none;stroke-opacity:1;stop-opacity:1"
   d="m 557.794,732.48 h 74.295 v 43.702 h -74.295 z" />
    <g
   style="opacity:1;stop-opacity:1"
   transform="translate(572.6254,744.0194)"
   id="g3181">
      <path
   inkscape:connector-curvature="0"
   id="path3183"
   style="fill:none;stroke:#231f20;stroke-width:0.231;stroke-linecap:butt;stroke-linejoin:miter;stroke-miterlimit:4;stroke-dasharray:none;stroke-opacity:1"
   d="M 0,0 V 31.862" />
    </g>
    <g
   style="opacity:1;stop-opacity:1"
   transform="translate(587.4746,744.0194)"
   id="g3185">
      <path
   inkscape:connector-curvature="0"
   id="path3187"
   style="fill:none;stroke:#231f20;stroke-width:0.231;stroke-linecap:butt;stroke-linejoin:miter;stroke-miterlimit:4;stroke-dasharray:none;stroke-opacity:1"
   d="M 0,0 V 31.862" />
    </g>
    <g
   style="opacity:1;stop-opacity:1"
   transform="translate(602.3238,744.0194)"
   id="g3189">
      <path
   inkscape:connector-curvature="0"
   id="path3191"
   style="fill:none;stroke:#231f20;stroke-width:0.231;stroke-linecap:butt;stroke-linejoin:miter;stroke-miterlimit:4;stroke-dasharray:none;stroke-opacity:1"
   d="M 0,0 V 31.862" />
    </g>
    <g
   style="opacity:1;stop-opacity:1"
   transform="translate(617.1729,744.0194)"
   id="g3193">
      <path
   inkscape:connector-curvature="0"
   id="path3195"
   style="fill:none;stroke:#231f20;stroke-width:0.231;stroke-linecap:butt;stroke-linejoin:miter;stroke-miterlimit:4;stroke-dasharray:none;stroke-opacity:1"
   d="M 0,0 V 31.862" />
    </g>
    <g
   style="opacity:1;stop-opacity:1"
   transform="translate(572.6254,760.0521)"
   id="g3197">
      <path
   inkscape:connector-curvature="0"
   id="path3199"
   style="fill:none;stroke:#231f20;stroke-width:0.231;stroke-linecap:butt;stroke-linejoin:miter;stroke-miterlimit:4;stroke-dasharray:none;stroke-opacity:1"
   d="M 0,0 H 14.916" />
    </g>
    <g
   style="opacity:1;stop-opacity:1"
   transform="translate(594.7995,732.3297)"
   id="g3201">
      <path
   inkscape:connector-curvature="0"
   id="path3203"
   style="fill:none;stroke:#231f20;stroke-width:0.231;stroke-linecap:butt;stroke-linejoin:miter;stroke-miterlimit:4;stroke-dasharray:none;stroke-opacity:1"
   d="M 0,0 V 11.557" />
    </g>
    <g
   style="opacity:1;stop-opacity:1"
   transform="translate(602.2573,760.0521)"
   id="g3205">
      <path
   inkscape:connector-curvature="0"
   id="path3207"
   style="fill:none;stroke:#231f20;stroke-width:0.231;stroke-linecap:butt;stroke-linejoin:miter;stroke-miterlimit:4;stroke-dasharray:none;stroke-opacity:1"
   d="M 0,0 H 14.916" />
    </g>
    <g
   style="opacity:1;stop-opacity:1"
   transform="translate(557.7956,743.9486)"
   id="g3209">
      <path
   inkscape:connector-curvature="0"
   id="path3211"
   style="fill:none;stroke:#231f20;stroke-width:0.231;stroke-linecap:butt;stroke-linejoin:miter;stroke-miterlimit:4;stroke-dasharray:none;stroke-opacity:1"
   d="M 0,0 H 74.445" />
    </g>
    <g
   style="opacity:1;stop-opacity:1"
   transform="translate(38.3727,679.5591)"
   id="g3213">
      <path
   inkscape:connector-curvature="0"
   id="path3215"
   style="fill:none;stroke:#231f20;stroke-width:0.461;stroke-linecap:round;stroke-linejoin:round;stroke-miterlimit:4;stroke-dasharray:0, 1.382;stroke-dashoffset:0;stroke-opacity:1"
   d="M 0,0 548.398,64.246" />
    </g>
    <g
   style="opacity:1;stop-opacity:1"
   transform="translate(37,679.3984)"
   id="g3217">
      <path
   inkscape:connector-curvature="0"
   id="path3219"
   style="fill:none;stroke:#231f20;stroke-width:0.461;stroke-linecap:round;stroke-linejoin:round;stroke-miterlimit:4;stroke-dasharray:none;stroke-opacity:1"
   d="m 0,0 v 0 m 550.457,64.487 v 0" />
    </g>
    <g
   style="opacity:1;stop-opacity:1"
   transform="translate(573.2894,715.6772)"
   id="g3221">
      <path
   inkscape:connector-curvature="0"
   id="path3223"
   style="fill:none;stroke:#231f20;stroke-width:0.461;stroke-linecap:round;stroke-linejoin:round;stroke-miterlimit:4;stroke-dasharray:0, 1.393;stroke-dashoffset:0;stroke-opacity:1"
   d="M 0,0 28.833,59.552" />
    </g>
    <g
   style="opacity:1;stop-opacity:1"
   transform="translate(572.6824,714.4235)"
   id="g3225">
      <path
   inkscape:connector-curvature="0"
   id="path3227"
   style="fill:none;stroke:#231f20;stroke-width:0.461;stroke-linecap:round;stroke-linejoin:round;stroke-miterlimit:4;stroke-dasharray:none;stroke-opacity:1"
   d="m 0,0 v 0 m 29.743,61.433 v 0" />
    </g>
    <g
   style="opacity:1;stop-opacity:1"
   transform="translate(573.038,680.7189)"
   id="g3229">
      <path
   inkscape:connector-curvature="0"
   id="path3231"
   style="fill:none;stroke:#231f20;stroke-width:0.461;stroke-linecap:round;stroke-linejoin:round;stroke-miterlimit:4;stroke-dasharray:0, 1.393;stroke-dashoffset:0;stroke-opacity:1"
   d="M 0,0 29.015,62.535" />
    </g>
    <g
   style="opacity:1;stop-opacity:1"
   transform="translate(572.4518,679.4556)"
   id="g3233">
      <path
   inkscape:connector-curvature="0"
   id="path3235"
   style="fill:none;stroke:#231f20;stroke-width:0.461;stroke-linecap:round;stroke-linejoin:round;stroke-miterlimit:4;stroke-dasharray:none;stroke-opacity:1"
   d="m 0,0 v 0 m 29.894,64.43 v 0" />
    </g>
    <g
   style="opacity:1;stop-opacity:1"
   transform="translate(38.3727,713.5789)"
   id="g3237">
      <path
   inkscape:connector-curvature="0"
   id="path3239"
   style="fill:none;stroke:#231f20;stroke-width:0.461;stroke-linecap:round;stroke-linejoin:round;stroke-miterlimit:4;stroke-dasharray:0, 1.381;stroke-dashoffset:0;stroke-opacity:1"
   d="M 0,0 548.398,62.133" />
    </g>
    <g
   style="opacity:1;stop-opacity:1"
   transform="translate(37,713.4234)"
   id="g3241">
      <path
   inkscape:connector-curvature="0"
   id="path3243"
   style="fill:none;stroke:#231f20;stroke-width:0.461;stroke-linecap:round;stroke-linejoin:round;stroke-miterlimit:4;stroke-dasharray:none;stroke-opacity:1"
   d="m 0,0 v 0 m 550.457,62.366 v 0" />
    </g>
    <g
   style="opacity:1;stop-opacity:1"
   transform="translate(617.9599,715.881)"
   id="g3245">
      <path
   inkscape:connector-curvature="0"
   id="path3247"
   style="fill:none;stroke:#231f20;stroke-width:0.461;stroke-linecap:round;stroke-linejoin:round;stroke-miterlimit:4;stroke-dasharray:0, 1.401;stroke-dashoffset:0;stroke-opacity:1"
   d="M 0,0 -0.781,27.304" />
    </g>
    <g
   style="opacity:1;stop-opacity:1"
   transform="translate(617.9999,714.4807)"
   id="g3249">
      <path
   inkscape:connector-curvature="0"
   id="path3251"
   style="fill:none;stroke:#231f20;stroke-width:0.461;stroke-linecap:round;stroke-linejoin:round;stroke-miterlimit:4;stroke-dasharray:none;stroke-opacity:1"
   d="m 0,0 v 0 m -0.841,29.405 v 0" />
    </g>
    <g
   style="opacity:1;stop-opacity:1"
   transform="translate(1152.1624,679.6252)"
   id="g3253">
      <path
   inkscape:connector-curvature="0"
   id="path3255"
   style="fill:none;stroke:#231f20;stroke-width:0.461;stroke-linecap:round;stroke-linejoin:round;stroke-miterlimit:4;stroke-dasharray:0, 1.384;stroke-dashoffset:0;stroke-opacity:1"
   d="M 0,0 -519.752,64.175" />
    </g>
    <g
   style="opacity:1;stop-opacity:1"
   transform="translate(1153.5355,679.4556)"
   id="g3257">
      <path
   inkscape:connector-curvature="0"
   id="path3259"
   style="fill:none;stroke:#231f20;stroke-width:0.461;stroke-linecap:round;stroke-linejoin:round;stroke-miterlimit:4;stroke-dasharray:none;stroke-opacity:1"
   d="m 0,0 v 0 m -521.811,64.43 v 0" />
    </g>
    <g
   style="opacity:1;stop-opacity:1"
   transform="translate(1152.1636,713.6449)"
   id="g3261">
      <path
   inkscape:connector-curvature="0"
   id="path3263"
   style="fill:none;stroke:#231f20;stroke-width:0.461;stroke-linecap:round;stroke-linejoin:round;stroke-miterlimit:4;stroke-dasharray:0, 1.382;stroke-dashoffset:0;stroke-opacity:1"
   d="M 0,0 -519.292,62.129" />
    </g>
    <g
   style="opacity:1;stop-opacity:1"
   transform="translate(1153.5355,713.4807)"
   id="g3265">
      <path
   inkscape:connector-curvature="0"
   id="path3267"
   style="fill:none;stroke:#231f20;stroke-width:0.461;stroke-linecap:round;stroke-linejoin:round;stroke-miterlimit:4;stroke-dasharray:none;stroke-opacity:1"
   d="m 0,0 v 0 m -521.35,62.375 v 0" />
    </g>
    <path
   inkscape:connector-curvature="0"
   id="path3269"
   style="opacity:1;fill:#efefef;fill-opacity:1;fill-rule:nonzero;stroke:none;stop-opacity:1"
   d="m 36,678.398 h 536.682 v 36.025 H 36 Z" />
    <text
   id="text3273"
   style="font-style:italic;font-variant:normal;font-weight:normal;font-stretch:normal;font-size:12px;font-family:'ARS Maquette Pro';-inkscape-font-specification:ARSMaquettePro-Italic;writing-mode:lr-tb;opacity:1;fill:#231f20;fill-opacity:1;fill-rule:nonzero;stroke:none;stop-opacity:1"
   transform="scale(1,-1)"
   x="6.4718409"
   y="-696.73938"><tspan
     id="tspan3271"
     sodipodi:role="line"
     x="40.839844 48.399841 53.115845 60.327843 67.911842 75.12384 81.243843 84.183838 88.88784 91.82785 99.039841">Proposition de valeur</tspan></text>
    <path
   inkscape:connector-curvature="0"
   id="path3275"
   style="opacity:1;fill:#efefef;fill-opacity:1;fill-rule:nonzero;stroke:none;stop-opacity:1"
   d="m 618,678.456 h 536.536 v 36.025 H 618 Z" />
    <text
   id="text3279"
   style="font-style:italic;font-variant:normal;font-weight:normal;font-stretch:normal;font-size:12px;font-family:'ARS Maquette Pro';-inkscape-font-specification:ARSMaquettePro-Italic;writing-mode:lr-tb;opacity:1;fill:#231f20;fill-opacity:1;fill-rule:nonzero;stroke:none;stop-opacity:1"
   transform="scale(1,-1)"
   x="625.06293"
   y="-696.73938"><tspan
     id="tspan3277"
     sodipodi:role="line"
     x="625.06293"
     y="-696.73938">Segment de Clientèle</tspan></text>
    <g
   style="opacity:1;stop-opacity:1;fill:#4c566a"
   transform="translate(814.2759,244.9073)"
   id="g3281">
      <path
   inkscape:connector-curvature="0"
   id="path3283"
   style="fill:#4c566a;fill-opacity:1;fill-rule:nonzero;stroke:none"
   d="M 0,0 C 1.602,0 2.901,1.299 2.901,2.901 2.901,4.504 1.603,5.803 0,5.803 -1.603,5.803 -2.901,4.504 -2.901,2.901 -2.901,1.299 -1.603,0 0,0 m -12.945,0 c 1.603,0 2.902,1.299 2.902,2.901 0,1.603 -1.299,2.902 -2.902,2.902 -1.602,0 -2.901,-1.299 -2.901,-2.902 0,-1.602 1.299,-2.901 2.901,-2.901 m 6.472,-5.803 c -8.7,0 -10.043,-8.481 -10.043,-8.481 h 3.794 c 0,0 0.893,4.91 6.249,4.91 5.357,0 6.249,-4.91 6.249,-4.91 H 3.57 c 0,0 -1.342,8.481 -10.043,8.481" />
    </g>
    <g
   style="opacity:1;stop-opacity:1;fill:#4c566a"
   transform="translate(801.4493,511.1405)"
   id="g3285">
      <path
   inkscape:connector-curvature="0"
   id="path3287"
   style="fill:#4c566a;fill-opacity:1;fill-rule:nonzero;stroke:none"
   d="M 0,0 C 1.573,0 2.848,1.275 2.848,2.848 2.848,4.422 1.573,5.697 0,5.697 -1.573,5.697 -2.848,4.422 -2.848,2.848 -2.848,1.275 -1.572,0 0,0 m 12.708,0 c 1.573,0 2.848,1.275 2.848,2.848 0,1.574 -1.275,2.849 -2.848,2.849 C 11.135,5.697 9.859,4.422 9.859,2.848 9.859,1.275 11.135,0 12.708,0 m 2.629,-6.135 c 0,0 -1.534,-6.573 -8.983,-6.573 -7.449,0 -8.983,6.573 -8.983,6.573 h -3.725 c 0,0 2.301,-10.079 12.708,-10.079 10.297,0 12.707,10.079 12.707,10.079 z" />
    </g>
    <g
   style="opacity:1;stop-opacity:1;fill:#4c566a"
   id="g3698">
      <g
   id="g3289"
   transform="translate(1037.5228,366.8432)"
   style="opacity:1;stop-opacity:1;fill:#4c566a">
        <path
   d="m 0,0 -3.751,3.752 1.918,1.919 1.722,-1.722 5.641,6.31 2.022,-1.808 z"
   style="fill:#4c566a;fill-opacity:1;fill-rule:nonzero;stroke:none"
   id="path3291"
   inkscape:connector-curvature="0" />
      </g>
      <g
   id="g3293"
   transform="translate(1037.5228,353.952)"
   style="opacity:1;stop-opacity:1;fill:#4c566a">
        <path
   d="m 0,0 -3.751,3.752 1.918,1.918 1.722,-1.721 5.64,6.31 2.024,-1.807 z"
   style="fill:#4c566a;fill-opacity:1;fill-rule:nonzero;stroke:none"
   id="path3295"
   inkscape:connector-curvature="0" />
      </g>
      <g
   id="g3297"
   transform="translate(1039.1674,339.9001)"
   style="opacity:1;stop-opacity:1;fill:#4c566a">
        <path
   d="m 0,0 c -2.805,0 -5.089,2.283 -5.089,5.089 0,2.805 2.284,5.088 5.089,5.088 2.805,0 5.089,-2.283 5.089,-5.088 C 5.089,2.283 2.805,0 0,0 m 0,7.463 c -1.309,0 -2.375,-1.065 -2.375,-2.374 0,-1.31 1.066,-2.375 2.375,-2.375 1.309,0 2.375,1.065 2.375,2.375 0,1.309 -1.066,2.374 -2.375,2.374"
   style="fill:#4c566a;fill-opacity:1;fill-rule:nonzero;stroke:none"
   id="path3299"
   inkscape:connector-curvature="0" />
      </g>
      <path
   d="m 1075.274,368.736 h -25.329 v 4.07 h 25.329 z"
   style="opacity:1;fill:#4c566a;fill-opacity:1;fill-rule:nonzero;stroke:none;stop-opacity:1"
   id="path3301"
   inkscape:connector-curvature="0" />
      <path
   d="m 1075.274,355.843 h -25.329 v 4.071 h 25.329 z"
   style="opacity:1;fill:#4c566a;fill-opacity:1;fill-rule:nonzero;stroke:none;stop-opacity:1"
   id="path3303"
   inkscape:connector-curvature="0" />
      <path
   d="m 1075.274,342.952 h -25.329 v 4.071 h 25.329 z"
   style="opacity:1;fill:#4c566a;fill-opacity:1;fill-rule:nonzero;stroke:none;stop-opacity:1"
   id="path3305"
   inkscape:connector-curvature="0" />
    </g>
    <path
   inkscape:connector-curvature="0"
   id="path3307"
   style="opacity:1;fill:#ffffff;fill-opacity:1;fill-rule:nonzero;stroke:none;stop-opacity:1"
   d="m 261.556,391.604 h 76.888 v 13.261 h -76.888 z" />
    <path
   inkscape:connector-curvature="0"
   id="path3309"
   style="opacity:1;fill:#000000;fill-opacity:1;fill-rule:nonzero;stroke:none;stop-opacity:1"
   d="m 259.837,389.863 h 80.326 v 16.744 h -80.326 z m 76.889,3.483 h -73.452 v 9.779 h 73.452 z" />
    <g
   style="opacity:1;stop-opacity:1"
   transform="translate(265.319,390.2679)"
   id="g3311">
      <path
   inkscape:connector-curvature="0"
   id="path3313"
   style="fill:#ffffff;fill-opacity:1;fill-rule:nonzero;stroke:none"
   d="M 0,0 V -46.524 H 68.053 V 0" />
    </g>
    <g
   style="opacity:1;stop-opacity:1"
   transform="translate(263.6007,342.0026)"
   id="g3315">
      <path
   inkscape:connector-curvature="0"
   id="path3317"
   style="fill:#000000;fill-opacity:1;fill-rule:nonzero;stroke:none"
   d="M 0,0 H 71.49 V 48.265 H 68.053 V 3.483 H 3.437 V 48.265 H 0 Z" />
    </g>
    <path
   inkscape:connector-curvature="0"
   id="path3319"
   style="opacity:1;fill:#000000;fill-opacity:1;fill-rule:nonzero;stroke:none;stop-opacity:1"
   d="m 297.628,342.568 h 3.437 v 62.702 h -3.437 z" />
    <g
   style="opacity:1;stop-opacity:1"
   transform="translate(299.7782,409.6852)"
   id="g3321">
      <path
   inkscape:connector-curvature="0"
   id="path3323"
   style="fill:#ffffff;fill-opacity:1;fill-rule:nonzero;stroke:none"
   d="m 0,0 h 8.725 c 4.925,0 8.872,3.909 8.872,8.899 0,4.99 -3.852,8.899 -8.776,8.899 C 3.896,17.798 0,13.844 0,8.854 Z" />
    </g>
    <g
   style="opacity:1;stop-opacity:1"
   transform="translate(298.0594,407.944)"
   id="g3325">
      <path
   inkscape:connector-curvature="0"
   id="path3327"
   style="fill:#000000;fill-opacity:1;fill-rule:nonzero;stroke:none"
   d="m 0,0 h 10.444 c 5.938,0 10.59,4.674 10.59,10.641 0,5.966 -4.61,10.64 -10.495,10.64 C 4.63,21.281 0,16.587 0,10.595 Z m 10.539,17.798 c 3.958,0 7.058,-3.144 7.058,-7.157 0,-4.014 -3.142,-7.158 -7.153,-7.158 H 3.437 v 7.112 c 0,4.039 3.119,7.203 7.102,7.203" />
    </g>
    <g
   style="opacity:1;stop-opacity:1"
   transform="translate(299.3517,409.6852)"
   id="g3329">
      <path
   inkscape:connector-curvature="0"
   id="path3331"
   style="fill:#ffffff;fill-opacity:1;fill-rule:nonzero;stroke:none"
   d="m 0,0 h -8.725 c -4.925,0 -8.872,3.909 -8.872,8.899 0,4.99 3.852,8.899 8.776,8.899 C -3.896,17.798 0,13.844 0,8.854 Z" />
    </g>
    <g
   style="opacity:1;stop-opacity:1"
   transform="translate(290.6259,407.944)"
   id="g3333">
      <path
   inkscape:connector-curvature="0"
   id="path3335"
   style="fill:#000000;fill-opacity:1;fill-rule:nonzero;stroke:none"
   d="m 0,0 h 10.444 v 10.595 c 0,5.992 -4.629,10.686 -10.539,10.686 -5.885,0 -10.495,-4.674 -10.495,-10.64 C -10.59,4.674 -5.937,0 0,0 M 7.007,3.483 H 0 c -4.011,0 -7.153,3.144 -7.153,7.158 0,4.013 3.101,7.157 7.058,7.157 3.983,0 7.102,-3.164 7.102,-7.203 z" />
    </g>
    <g
   style="opacity:1;stop-opacity:1;fill:#4c566a"
   transform="translate(372.9773,482.011)"
   id="g3337">
      <path
   inkscape:connector-curvature="0"
   id="path3339"
   style="fill:#4c566a;fill-opacity:1;fill-rule:nonzero;stroke:none"
   d="m 0,0 -3.261,3.261 14.138,14.137 6.559,-6.559 6.816,6.817 3.261,-3.261 -10.077,-10.078 -6.559,6.559 z" />
    </g>
    <g
   style="opacity:1;stop-opacity:1;fill:#4c566a"
   transform="translate(404.1351,472.8902)"
   id="g3345">
      <path
   inkscape:connector-curvature="0"
   id="path3347"
   style="fill:#4c566a;fill-opacity:1;fill-rule:nonzero;stroke:none"
   d="m 0,0 h -43.048 v 44.073 h 3.074 V 3.075 H 0 Z" />
    </g>
    <path
   inkscape:connector-curvature="0"
   id="path3349"
   style="opacity:1;fill:#4c566a;fill-opacity:1;fill-rule:nonzero;stroke:none;stop-opacity:1"
   d="m 366.691,508.764 h -3.523 v 3.075 h 3.523 z" />
    <path
   inkscape:connector-curvature="0"
   id="path3351"
   style="opacity:1;fill:#4c566a;fill-opacity:1;fill-rule:nonzero;stroke:none;stop-opacity:1"
   d="m 366.691,499.539 h -3.523 v 3.075 h 3.523 z" />
    <g
   style="fill:#4c566a"
   id="g4866">
      <g
   id="g3341"
   transform="translate(402.0814,492.1501)"
   style="opacity:1;stop-opacity:1;fill:#4c566a">
        <path
   d="M 0,0 3.332,12.439 -9.107,9.107 Z"
   style="fill:#4c566a;fill-opacity:1;fill-rule:nonzero;stroke:none"
   id="path3343"
   inkscape:connector-curvature="0" />
      </g>
      <path
   d="m 366.691,490.315 h -3.523 v 3.075 h 3.523 z"
   style="opacity:1;fill:#4c566a;fill-opacity:1;fill-rule:nonzero;stroke:none;stop-opacity:1"
   id="path3353"
   inkscape:connector-curvature="0" />
    </g>
    <path
   inkscape:connector-curvature="0"
   id="path3355"
   style="opacity:1;fill:#4c566a;fill-opacity:1;fill-rule:nonzero;stroke:none;stop-opacity:1"
   d="m 366.691,481.09 h -3.523 v 3.075 h 3.523 z" />
    <g
   style="opacity:1;stop-opacity:1;fill:#4c566a"
   id="g3687">
      <g
   id="g3357"
   transform="translate(394.2461,208.4527)"
   style="opacity:1;stop-opacity:1;fill:#4c566a">
        <path
   d="M 0,0 C -2.992,0 -5.798,1.158 -7.901,3.261 L -29.919,25.28 c -2.103,2.102 -3.262,4.908 -3.262,7.9 0,2.992 1.159,5.798 3.262,7.901 2.101,2.102 4.907,3.26 7.899,3.26 2.992,0 5.797,-1.158 7.9,-3.26 L 7.901,19.061 c 4.355,-4.356 4.355,-11.445 0,-15.8 C 5.797,1.158 2.992,0 0,0 m -22.02,41.627 c -2.267,0 -4.39,-0.876 -5.981,-2.465 -1.59,-1.59 -2.466,-3.715 -2.466,-5.982 0,-2.267 0.876,-4.391 2.466,-5.981 L -5.982,5.179 C -4.392,3.589 -2.267,2.714 0,2.714 c 2.267,0 4.392,0.875 5.982,2.465 3.297,3.298 3.297,8.665 0,11.963 l -22.02,22.02 c -1.591,1.589 -3.715,2.465 -5.982,2.465"
   style="fill:#4c566a;fill-opacity:1;fill-rule:nonzero;stroke:none"
   id="path3359"
   inkscape:connector-curvature="0" />
      </g>
      <g
   id="g3361"
   transform="translate(378.5262,221.4512)"
   style="opacity:1;stop-opacity:1;fill:#4c566a">
        <path
   d="m 0,0 -13.241,13.241 c -3.817,3.817 -3.817,10.064 0,13.881 3.818,3.818 10.065,3.818 13.882,0 l 13.241,-13.24 z"
   style="fill:#4c566a;fill-opacity:1;fill-rule:nonzero;stroke:none"
   id="path3363"
   inkscape:connector-curvature="0" />
      </g>
    </g>
    <g
   style="fill:#4c566a"
   id="g4884">
      <path
   d="m 102.643,346.806 h -5.157 v 30.297 h 5.157 z"
   style="opacity:1;fill:#4c566a;fill-opacity:1;fill-rule:nonzero;stroke:none;stop-opacity:1"
   id="path3365"
   inkscape:connector-curvature="0" />
      <path
   d="m 125.849,346.806 h -5.157 v 30.297 h 5.157 z"
   style="opacity:1;fill:#4c566a;fill-opacity:1;fill-rule:nonzero;stroke:none;stop-opacity:1"
   id="path3367"
   inkscape:connector-curvature="0" />
      <path
   d="m 107.477,346.806 h -2.256 v 30.297 h 2.256 z"
   style="opacity:1;fill:#4c566a;fill-opacity:1;fill-rule:nonzero;stroke:none;stop-opacity:1"
   id="path3369"
   inkscape:connector-curvature="0" />
      <path
   d="m 113.601,346.806 h -5.157 v 30.297 h 5.157 z"
   style="opacity:1;fill:#4c566a;fill-opacity:1;fill-rule:nonzero;stroke:none;stop-opacity:1"
   id="path3371"
   inkscape:connector-curvature="0" />
      <path
   d="m 118.758,346.806 h -2.578 v 30.297 h 2.578 z"
   style="opacity:1;fill:#4c566a;fill-opacity:1;fill-rule:nonzero;stroke:none;stop-opacity:1"
   id="path3373"
   inkscape:connector-curvature="0" />
      <path
   d="m 131.65,346.806 h -2.578 v 30.297 h 2.578 z"
   style="opacity:1;fill:#4c566a;fill-opacity:1;fill-rule:nonzero;stroke:none;stop-opacity:1"
   id="path3375"
   inkscape:connector-curvature="0" />
      <g
   id="g3377"
   transform="translate(152.8359,363.5444)"
   style="opacity:1;stop-opacity:1;fill:#4c566a">
        <path
   d="M 0,0 C 0,1.792 -1.453,3.244 -3.245,3.244 -5.036,3.244 -6.489,1.792 -6.489,0 Z"
   style="fill:#4c566a;fill-opacity:1;fill-rule:nonzero;stroke:none"
   id="path3379"
   inkscape:connector-curvature="0" />
      </g>
      <g
   id="g3381"
   transform="translate(142.6083,362.7838)"
   style="opacity:1;stop-opacity:1;fill:#4c566a">
        <path
   d="M 0,0 V 14.319 H -5.157 V -3.367 C -3.651,-1.97 -1.917,-0.816 0,0"
   style="fill:#4c566a;fill-opacity:1;fill-rule:nonzero;stroke:none"
   id="path3383"
   inkscape:connector-curvature="0" />
      </g>
      <g
   id="g3385"
   transform="translate(165.9216,340.36)"
   style="opacity:1;stop-opacity:1;fill:#4c566a">
        <path
   d="m 0,0 h -32.66 c -1.424,0 -2.579,1.155 -2.579,2.578 0,1.424 1.155,2.579 2.579,2.579 H 0 C 1.424,5.157 2.578,4.002 2.578,2.578 2.578,1.155 1.424,0 0,0"
   style="fill:#4c566a;fill-opacity:1;fill-rule:nonzero;stroke:none"
   id="path3387"
   inkscape:connector-curvature="0" />
      </g>
      <g
   id="g3389"
   transform="translate(136.1621,358.0944)"
   style="opacity:1;stop-opacity:1;fill:#4c566a">
        <path
   d="M 0,0 V 19.008 H -2.578 V -3.843 C -1.885,-2.449 -1.018,-1.159 0,0"
   style="fill:#4c566a;fill-opacity:1;fill-rule:nonzero;stroke:none"
   id="path3391"
   inkscape:connector-curvature="0" />
      </g>
      <g
   id="g3393"
   transform="translate(149.5916,361.6264)"
   style="opacity:1;stop-opacity:1;fill:#4c566a">
        <path
   d="M 0,0 C -8.007,0 -14.599,-6.18 -15.256,-14.02 H 15.256 C 14.599,-6.18 8.007,0 0,0"
   style="fill:#4c566a;fill-opacity:1;fill-rule:nonzero;stroke:none"
   id="path3395"
   inkscape:connector-curvature="0" />
      </g>
    </g>
    <text
   transform="matrix(1,0,0,-1,36.1416,45.4521)"
   style="font-variant:normal;font-weight:bold;font-stretch:normal;font-size:8.5px;font-family:'ARS Maquette Pro';-inkscape-font-specification:ARSMaquettePro-Bold;writing-mode:lr-tb;fill:#231f20;fill-opacity:1;fill-rule:nonzero;stroke:none"
   id="text3399"><tspan
     x="0 5.2189999 10.9038 15.878 21.134399 26.472401 29.061501 34.6222 40.2169"
     y="0"
     sodipodi:role="line"
     id="tspan3397">copyright</tspan></text>
    <text
   transform="matrix(1,0,0,-1,81.0743,45.4521)"
   style="font-variant:normal;font-weight:bold;font-stretch:normal;font-size:8.5px;font-family:'ARS Maquette Pro Light';-inkscape-font-specification:ARSMaquettePro-Medium;writing-mode:lr-tb;fill:#231f20;fill-opacity:1;fill-rule:nonzero;stroke:none"
   id="text3403"><tspan
     x="0"
     y="0"
     id="tspan3401">:</tspan></text>
    <text
   transform="matrix(1,0,0,-1,86.0552,45.4521)"
   style="font-variant:normal;font-weight:normal;font-stretch:normal;font-size:8.5px;font-family:'ARS Maquette Pro';-inkscape-font-specification:ARSMaquettePro-Regular;writing-mode:lr-tb;fill:#231f20;fill-opacity:1;fill-rule:nonzero;stroke:none"
   id="text3407"><tspan
     x="0 5.3210001 8.8604002 12.4474 17.317051 20.708549 25.912251 31.517151 36.35535 40.692051 45.851551 49.27705 51.657051 57.3036"
     y="0"
     sodipodi:role="line"
     id="tspan3405">Strategyzer AG</tspan></text>
    <text
   transform="matrix(1,0,0,-1,36.1416,36.0329)"
   style="font-style:italic;font-variant:normal;font-weight:normal;font-stretch:normal;font-size:7px;font-family:'ARS Maquette Pro';-inkscape-font-specification:ARSMaquettePro-Italic;writing-mode:lr-tb;fill:#231f20;fill-opacity:1;fill-rule:nonzero;stroke:none"
   id="text3411"><tspan
     x="0 4.2860999 8.6169996 12.775 14.735 21.313601 25.613001 29.585501 33.894001 36.901901 40.541901 42.5019 46.831402 49.316399 51.276402 56.168701 60.508701 64.279602 66.201103 70.531998 74.864304 78.724098 82.364098 84.324097 90.598198 95.030602 99.636597 103.9479 105.7189 107.6789 113.0402 117.3487 121.6796 125.9881 129.0191 133.1302 136.1283 138.0267 142.4409 146.65491 148.6149 152.91431 157.24519 161.7252 163.6852 168.0217 171.01981 174.0508 178.1619 181.0536 185.3894 190.04089 193.9756 197.6058 201.91431"
     y="0"
     sodipodi:role="line"
     id="tspan3409">The makers of Business Model Generation and Strategyzer</tspan></text>
    <g
   id="g3413">
      <text
   transform="scale(1,-1)"
   style="font-variant:normal;font-weight:bold;font-stretch:normal;font-size:28px;font-family:'ARS Maquette Pro';-inkscape-font-specification:ARSMaquettePro-Bold;writing-mode:lr-tb;opacity:1;fill:#231f20;fill-opacity:1;fill-rule:nonzero;stroke:none;stop-opacity:1"
   id="text3425"
   x="-277.67621"
   y="-770.34583"><tspan
     x="36.091797 55.299805 71.707787 88.756981 104.80099 121.20897"
     sodipodi:role="line"
     id="tspan3423">Canvas Proposition de valeur</tspan></text>
      <g
   style="opacity:1;stop-opacity:1"
   id="g3427"
   transform="translate(890.5342,386.3271)">
        <path
   d="M 0,0 184.026,184.018"
   style="fill:none;stroke:#231f20;stroke-width:2.017;stroke-linecap:butt;stroke-linejoin:miter;stroke-miterlimit:4;stroke-dasharray:none;stroke-opacity:1"
   id="path3429"
   inkscape:connector-curvature="0" />
      </g>
      <g
   style="opacity:1;stop-opacity:1"
   id="g3431"
   transform="translate(890.5341,386.6225)">
        <path
   d="M 0,0 184.027,-184.027"
   style="fill:none;stroke:#231f20;stroke-width:2.017;stroke-linecap:butt;stroke-linejoin:miter;stroke-miterlimit:4;stroke-dasharray:none;stroke-opacity:1"
   id="path3433"
   inkscape:connector-curvature="0" />
      </g>
      <g
   style="opacity:1;stop-opacity:1"
   id="g3435"
   transform="translate(860.0468,362.1504)">
        <path
   d="m 0,0 c 3.706,-4.883 8.514,-9.006 14.287,-11.876 22.349,-11.11 49.285,-0.236 57.545,23.232 6.812,19.353 -2.056,41.117 -20.486,50.28 C 28.998,72.747 2.062,61.872 -6.199,38.405 l -6.648,-16.383 c -0.897,-2.165 0.149,-4.666 2.323,-5.558 l 3.311,-1.36 c 0.788,-3.163 1.902,-6.239 3.404,-9.133 L 9.911,5.19 Z"
   style="fill:#ffffff;fill-opacity:1;fill-rule:nonzero;stroke:none"
   id="path3437"
   inkscape:connector-curvature="0" />
      </g>
      <g
   style="opacity:1;stop-opacity:1"
   id="g3439"
   transform="translate(892.846,344.1713)">
        <path
   d="m 0,0 h -0.001 c -6.714,0.001 -13.203,1.534 -19.285,4.559 -5.864,2.914 -10.875,7.08 -14.897,12.379 l -1.231,1.622 6.189,3.241 -8.47,0.483 -0.454,0.874 c -1.376,2.654 -2.494,5.563 -3.326,8.658 l -2.509,1.031 c -3.063,1.259 -4.529,4.762 -3.265,7.811 l 6.643,16.372 c 6.028,17.129 22.372,28.688 40.642,28.688 6.713,0 13.202,-1.533 19.285,-4.559 C 38.627,71.562 47.805,49.037 40.67,28.764 34.615,11.56 18.269,0 0,0 m -30.14,17.421 c 3.462,-4.116 7.626,-7.399 12.403,-9.774 5.598,-2.782 11.565,-4.194 17.736,-4.195 16.799,0 31.828,10.631 37.397,26.454 6.56,18.636 -1.877,39.342 -19.624,48.165 -5.598,2.783 -11.565,4.195 -17.736,4.195 -16.799,0 -31.828,-10.631 -37.397,-26.453 l -6.678,-16.458 c -0.538,-1.302 0.082,-2.784 1.378,-3.317 l 4.121,-1.692 0.211,-0.847 c 0.7,-2.812 1.648,-5.458 2.823,-7.882 l 18.954,-1.079 z"
   style="fill:#000000;fill-opacity:1;fill-rule:nonzero;stroke:none"
   id="path3441"
   inkscape:connector-curvature="0" />
      </g>
      <g
   style="opacity:1;stop-opacity:1"
   id="g3443"
   transform="translate(873.5424,395.845)">
        <path
   d="m 0,0 c -0.536,-2.468 -3.346,-3.603 -5.457,-2.203 -1.173,0.777 -1.775,2.255 -1.478,3.626 0.536,2.468 3.346,3.602 5.458,2.203 C -0.304,2.848 0.298,1.371 0,0"
   style="fill:#000000;fill-opacity:1;fill-rule:nonzero;stroke:none"
   id="path3445"
   inkscape:connector-curvature="0" />
      </g>
    </g>
    <text
   transform="matrix(1,0,0,-1,1062.0441,38.0003)"
   style="font-variant:normal;font-weight:normal;font-stretch:normal;font-size:12px;font-family:'ARS Maquette Pro';-inkscape-font-specification:ARSMaquettePro-Regular;writing-mode:lr-tb;fill:#231f20;fill-opacity:1;fill-rule:nonzero;stroke:none"
   id="text3449"><tspan
     x="0 6.2160001 10.944 15.54 22.344 27.072001 34.104 41.736 47.674801 53.7108 60.742802 64.618797 67.750801 74.110802 81.310799"
     y="0"
     sodipodi:role="line"
     id="tspan3447">strategyzer.com</tspan></text>
    <g
   id="g3451">
      <g
   id="g3453">
        <g
   id="g3455"
   clip-path="url(#clipPath3459)">
          <g
   id="g3461"
   transform="translate(993.025,65.7107)">
            <path
   d="m 0,0 c 0,-7.156 -6.059,-12.957 -13.533,-12.957 -7.475,0 -13.534,5.801 -13.534,12.957 0,4.289 2.186,8.079 5.539,10.437 l 2.665,-3.479 C -21.099,5.386 -22.556,2.86 -22.556,0 c 0,-4.771 4.04,-8.638 9.023,-8.638 4.982,0 9.022,3.867 9.022,8.638 0,2.86 -1.457,5.386 -3.693,6.958 l 2.665,3.479 C -2.186,8.079 0,4.289 0,0 m -18.045,0 c 0,-2.386 2.02,-4.319 4.512,-4.319 2.491,0 4.511,1.933 4.511,4.319 0,1.43 -0.729,2.693 -1.847,3.479 L -13.533,0 -16.198,3.479 C -17.316,2.693 -18.045,1.43 -18.045,0 m -0.818,6.958 2.665,-3.479 c 0.747,0.526 1.666,0.84 2.665,0.84 0.998,0 1.917,-0.314 2.664,-0.84 l 2.665,3.479 c -1.494,1.051 -3.333,1.68 -5.329,1.68 -1.997,0 -3.836,-0.629 -5.33,-1.68"
   style="fill:#231f20;fill-opacity:1;fill-rule:nonzero;stroke:none"
   id="path3463"
   inkscape:connector-curvature="0" />
          </g>
          <g
   id="g3465"
   transform="translate(1011.3054,70.4161)">
            <path
   d="m 0,0 -3.311,-1.971 c -1.112,1.492 -2.865,2.131 -4.618,2.131 -1.558,0 -2.67,-0.533 -2.67,-1.678 0,-1.305 1.78,-1.572 3.783,-1.918 3.895,-0.666 7.332,-1.912 7.332,-5.588 0,-3.356 -2.964,-5.759 -7.944,-5.759 -4.034,0 -7.122,1.652 -8.597,4.449 l 3.478,1.758 c 1.224,-1.997 3.227,-2.744 5.314,-2.744 1.947,0 3.227,0.693 3.227,1.839 0,1.49 -1.808,1.757 -4.034,2.13 -3.784,0.639 -7.233,1.795 -7.233,5.525 0,3.382 3.234,5.758 7.519,5.758 C -4.805,3.932 -1.864,2.637 0,0"
   style="fill:#231f20;fill-opacity:1;fill-rule:nonzero;stroke:none"
   id="path3467"
   inkscape:connector-curvature="0" />
          </g>
          <g
   id="g3469"
   transform="translate(1023.8513,57.073)">
            <path
   d="m 0,0 c -1.029,-0.746 -2.253,-1.44 -4.006,-1.44 -1.892,0 -3.367,0.56 -4.229,1.786 -0.612,0.852 -0.787,1.815 -0.787,3.253 v 6.478 h -2.256 v 3.599 h 2.256 v 3.599 h 4.511 v -3.599 h 3.759 V 10.077 H -4.511 V 3.595 c 0,-1.092 0.585,-1.436 1.504,-1.436 0.751,0 1.058,0.374 1.503,0.72 z"
   style="fill:#231f20;fill-opacity:1;fill-rule:nonzero;stroke:none"
   id="path3471"
   inkscape:connector-curvature="0" />
          </g>
          <g
   id="g3473"
   transform="translate(1062.1962,57.073)">
            <path
   d="m 0,0 c -1.029,-0.746 -2.253,-1.44 -4.006,-1.44 -1.892,0 -3.366,0.56 -4.229,1.786 -0.612,0.852 -0.787,1.815 -0.787,3.253 v 6.478 h -2.256 v 3.599 h 2.256 v 3.599 h 4.511 v -3.599 h 3.759 V 10.077 H -4.511 V 3.595 c 0,-1.092 0.585,-1.436 1.504,-1.436 0.751,0 1.058,0.374 1.503,0.72 z"
   style="fill:#231f20;fill-opacity:1;fill-rule:nonzero;stroke:none"
   id="path3475"
   inkscape:connector-curvature="0" />
          </g>
          <g
   id="g3477"
   transform="translate(1036.6329,69.3098)">
            <path
   d="m 0,0 c 2.031,1.119 3.706,1.44 6.015,1.44 3.784,0 6.767,-1.416 6.767,-5.039 v -5.759 c 0,-0.666 10e-4,-1.1 0.53,-1.1 0.278,0 0.806,0.247 0.973,0.381 l 0.196,-2.752 c -0.585,-0.345 -1.756,-0.847 -2.451,-0.847 -1.42,0 -2.558,0.927 -3.003,2.179 -1.057,-1.412 -2.791,-2.179 -4.516,-2.179 -3.032,0 -5.263,1.469 -5.263,4.318 0,3.436 2.955,4.827 5.263,5.039 2.337,0.214 3.76,0.401 3.76,1.44 0,1.091 -1.357,0.998 -2.415,0.998 -1.502,0 -2.961,-0.118 -4.352,-0.998 z M 8.248,-6.222 C 7.637,-6.916 6.69,-6.969 5.522,-7.155 4.465,-7.315 3.408,-7.582 3.408,-8.86 c 0,-1.092 0.862,-1.598 2.086,-1.598 1.558,0 2.754,0.826 2.754,2.61 z"
   style="fill:#231f20;fill-opacity:1;fill-rule:nonzero;stroke:none"
   id="path3479"
   inkscape:connector-curvature="0" />
          </g>
          <g
   id="g3481"
   transform="translate(1077.7076,62.2607)">
            <path
   d="m 0,0 h -10.683 c 0.139,-1.944 1.613,-2.903 3.756,-2.903 1.696,0 3.116,0.64 4.089,1.679 l 2.726,-2.451 c -1.641,-1.572 -3.93,-2.952 -7.129,-2.952 -5.314,0 -8.27,3.599 -8.27,7.198 0,4.289 3.13,7.918 8.055,7.918 4.729,0 7.734,-2.911 7.734,-7.198 C 0.278,0.838 0.027,0.321 0,0 M -4.118,2.771 C -4.285,4.555 -5.62,5.46 -7.372,5.46 c -1.865,0 -3.144,-1.065 -3.284,-2.689 z"
   style="fill:#231f20;fill-opacity:1;fill-rule:nonzero;stroke:none"
   id="path3483"
   inkscape:connector-curvature="0" />
          </g>
          <g
   id="g3485"
   transform="translate(1142.3677,62.2607)">
            <path
   d="m 0,0 h -10.683 c 0.139,-1.944 1.613,-2.903 3.756,-2.903 1.696,0 3.116,0.64 4.089,1.679 l 2.726,-2.451 c -1.641,-1.572 -3.93,-2.952 -7.129,-2.952 -5.314,0 -8.27,3.599 -8.27,7.198 0,4.289 3.13,7.918 8.055,7.918 4.729,0 7.734,-2.911 7.734,-7.198 C 0.278,0.838 0.027,0.321 0,0 M -4.118,2.771 C -4.285,4.555 -5.62,5.46 -7.372,5.46 c -1.865,0 -3.144,-1.065 -3.284,-2.689 z"
   style="fill:#231f20;fill-opacity:1;fill-rule:nonzero;stroke:none"
   id="path3487"
   inkscape:connector-curvature="0" />
          </g>
          <g
   id="g3489"
   transform="translate(1095.2781,59.0385)">
            <path
   d="m 0,0 c 0,-2.263 -0.267,-4.022 -1.601,-5.434 -1.726,-1.811 -4.424,-2.29 -6.928,-2.29 -2.532,0 -4.646,0.506 -6.483,1.545 l 1.559,3.169 c 1.196,-0.772 2.921,-1.305 4.84,-1.305 2.476,0 4.424,0.879 4.424,3.303 v 0.985 c -1.141,-1.278 -2.969,-1.938 -4.833,-1.938 -4.034,0 -6.767,3.004 -6.767,6.812 0,3.836 2.733,6.864 6.767,6.864 1.891,0 3.692,-0.658 4.833,-1.936 v 1.936 H 0 Z m -7.639,8.364 c -2.226,0 -3.639,-1.492 -3.639,-3.463 0,-1.971 1.413,-3.516 3.639,-3.516 2.198,0 3.478,1.545 3.478,3.516 0,1.944 -1.225,3.463 -3.478,3.463"
   style="fill:#231f20;fill-opacity:1;fill-rule:nonzero;stroke:none"
   id="path3491"
   inkscape:connector-curvature="0" />
          </g>
          <g
   id="g3493"
   transform="translate(1106.611,55.7894)">
            <path
   d="m 0,0 c -1.196,-3.01 -2.67,-4.475 -5.619,-4.475 -1.475,0 -2.81,0.399 -3.951,1.145 l 1.614,2.717 c 0.529,-0.346 1.084,-0.559 1.697,-0.559 0.945,0 1.474,0.532 1.892,1.358 l 0.361,0.666 -5.823,14.108 h 4.511 l 3.51,-9.207 3.257,9.207 H 5.96 Z"
   style="fill:#231f20;fill-opacity:1;fill-rule:nonzero;stroke:none"
   id="path3495"
   inkscape:connector-curvature="0" />
          </g>
          <g
   id="g3497"
   transform="translate(1112.5708,55.6334)">
            <path
   d="m 0,0 v 3.512 l 8.271,8.005 H 0.752 v 3.599 H 13.533 V 12.034 L 6.015,4.319 h 7.518 l 0,-4.319 z"
   style="fill:#231f20;fill-opacity:1;fill-rule:nonzero;stroke:none"
   id="path3499"
   inkscape:connector-curvature="0" />
          </g>
          <g
   id="g3501"
   transform="translate(1153.1632,66.3138)">
            <path
   d="m 0,0 c -0.446,0.24 -0.974,0.426 -1.67,0.426 -1.78,0 -2.833,-1.412 -2.833,-3.515 V -9.961 H -9.014 V 4.436 h 4.511 v -2.16 c 0.918,1.438 2.173,2.16 3.759,2.16 0.723,0 1.439,-0.095 1.856,-0.334 z"
   style="fill:#231f20;fill-opacity:1;fill-rule:nonzero;stroke:none"
   id="path3503"
   inkscape:connector-curvature="0" />
          </g>
          <g
   id="g3505"
   transform="translate(1034.3693,66.3138)">
            <path
   d="m 0,0 c -0.446,0.24 -0.974,0.426 -1.67,0.426 -1.78,0 -2.833,-1.412 -2.833,-3.515 V -9.961 H -9.014 V 4.436 h 4.511 v -2.16 c 0.918,1.438 2.173,2.16 3.759,2.16 0.723,0 1.439,-0.095 1.856,-0.334 z"
   style="fill:#231f20;fill-opacity:1;fill-rule:nonzero;stroke:none"
   id="path3507"
   inkscape:connector-curvature="0" />
          </g>
        </g>
      </g>
    </g>
    <text
   y="-17.298223"
   x="1036.8831"
   transform="scale(1,-1)"
   style="font-variant:normal;font-weight:normal;font-stretch:normal;font-size:12px;font-family:'ARS Maquette Pro';-inkscape-font-specification:ARSMaquettePro-Regular;writing-mode:lr-tb;fill:#231f20;fill-opacity:1;fill-rule:nonzero;stroke:none"
   id="text3750"><tspan
     y="-17.298223"
     x="1036.8831"
     sodipodi:role="line"
     id="tspan3748">traduit par</tspan></text>
  <g
   style="stroke-width:1.01663025;stroke-miterlimit:4;stroke-dasharray:none"
   inkscape:label="Calque 1"
   id="layer1"
   transform="matrix(0.01623009,0,0,-0.01623009,1122.1895,30.458701)"><path
     inkscape:connector-curvature="0"
     id="path3898-4-29"
     style="fill:#ce5c00;fill-opacity:1;fill-rule:nonzero;stroke:#ce5c00;stroke-width:1.01663025;stroke-miterlimit:4;stroke-dasharray:none"
     d="m 1415.3266,417.63549 c 65.3931,65.72296 35.7973,214.24287 -80.2372,349.80555 C 1197.9961,927.45356 994.17711,1010.7783 903.028,924.6035 824.47965,850.21159 874.34255,687.85041 996.27518,555.26974 820.95666,723.91162 736.68191,952.02215 841.64611,1050.4285 c 112.26067,105.0432 362.26129,-8.9856 524.49049,-210.19212 133.1086,-165.23764 164.037,-340.08103 88.5894,-416.26742 -29.3186,-29.51662 -71.3967,-42.75093 -120.5734,-41.28632 32.525,2.81048 60.643,14.30309 81.174,34.95285" /><path
     inkscape:connector-curvature="0"
     id="path3896-6-0"
     style="fill:#204a87;fill-opacity:1;fill-rule:nonzero;stroke:#204a87;stroke-width:1.01663025;stroke-miterlimit:4;stroke-dasharray:none"
     d="m 1313.1868,263.46327 c 47.0788,-38.96404 205.3893,55.15399 353.7641,205.61352 145.5511,147.76781 239.1809,307.05462 209.9018,361.04746 -26.3631,48.82051 -143.8358,-2.2431 -280.0582,-119.83456 174.5795,161.33199 329.9738,234.28567 360.5328,171.18846 31.0604,-63.95487 -78.1128,-247.995 -245.1581,-418.0619 -170.5023,-173.56351 -353.1834,-283.5548 -408.0472,-239.77468 -22.1935,17.62817 -19.924,57.76654 2.4938,112.11564 -10.305,-34.20074 -8.8141,-59.52143 6.5711,-72.29394" /><path
     inkscape:connector-curvature="0"
     id="path3900-6-1"
     style="fill:#4e9a06;fill-opacity:1;fill-rule:nonzero;stroke:#4e9a06;stroke-width:1.01663025;stroke-miterlimit:4;stroke-dasharray:none"
     d="m 1212.8512,355.76127 c -71.687,-71.35711 -23.2491,-206.60312 92.3235,-289.492426 100.8078,-72.1751859 217.9903,-77.941284 272.6957,-21.335882 46.4718,48.06841 40.4286,132.461918 -14.0656,208.819838 77.1892,-92.37632 89.0644,-199.214073 31.8257,-258.7750948 C 1533.0083,-70.098715 1398.2636,-67.195874 1280.3686,12.170441 1141.5732,105.23289 1080.3893,263.30578 1166.155,348.60973 c 33.0924,32.64377 81.5171,46.55101 135.4967,43.74054 -35.309,-2.41464 -66.3827,-14.25032 -88.8004,-36.589" /><path
     inkscape:connector-curvature="0"
     id="path3894-3-3"
     style="fill:#a40000;fill-opacity:1;fill-rule:nonzero;stroke:#a40000;stroke-width:1.01663025;stroke-linecap:butt;stroke-miterlimit:4;stroke-dasharray:none"
     d="M 1324.6582,500.02086 C 1274.8086,550.62266 1086.1106,450.44826 902.71713,269.56167 715.00877,84.861805 623.18662,-94.863644 696.43058,-126.05599 755.38465,-150.98084 902.30799,-70.242274 1045.7479,56.77022 863.34395,-114.78769 664.01113,-230.82217 584.55245,-201.54306 491.80678,-167.1048 599.7,48.140865 827.36191,271.36935 1049.0466,488.83173 1275.9696,606.8982 1335.0029,544.56628 c 21.5997,-22.72133 17.7996,-66.32992 -5.5946,-121.81377 11.0044,34.88687 10.2655,62.00205 -4.7501,77.26835" /><path
     inkscape:connector-curvature="0"
     style="font-style:normal;font-variant:normal;font-weight:normal;font-stretch:normal;font-size:64px;line-height:100%;font-family:'DejaVu Sans';-inkscape-font-specification:'DejaVu Sans';text-align:start;writing-mode:lr-tb;text-anchor:start;fill:#000000;fill-opacity:1;stroke:#000000;stroke-width:1.01663025;stroke-miterlimit:4;stroke-dasharray:none;stroke-opacity:1"
     id="path4367-3"
     d="m -854.7259,583.1405 h 226.69733 c -127.86931,-362.22464 -98.96419,-352.11653 -226.69733,0 z m 66.06835,-388.97807 h 94.56052 l 234.95596,616.50128 h -86.71483 l -56.15815,-158.15132 h -277.90049 l -56.15815,158.15132 h -87.95361 l 235.36875,-616.50128"
     sodipodi:nodetypes="cccccccccccc" /><path
     inkscape:connector-curvature="0"
     style="font-style:normal;font-variant:normal;font-weight:normal;font-stretch:normal;font-size:64px;line-height:100%;font-family:'DejaVu Sans';-inkscape-font-specification:'DejaVu Sans';text-align:start;writing-mode:lr-tb;text-anchor:start;fill:#000000;fill-opacity:1;stroke:#000000;stroke-width:1.01663025;stroke-miterlimit:4;stroke-dasharray:none;stroke-opacity:1"
     id="path4369-0"
     d="m -414.52102,423.60605 h 302.04326 v 58.05862 l -239.1464,278.19774 h 239.1464 v 50.8013 h -310.68296 v -58.05862 l 239.1464,-278.19773 h -230.5067 v -50.80131" /><path
     inkscape:connector-curvature="0"
     sodipodi:nodetypes="ccccccccccccccccc"
     style="font-style:normal;font-variant:normal;font-weight:normal;font-stretch:normal;font-size:64px;line-height:100%;font-family:'DejaVu Sans';-inkscape-font-specification:'DejaVu Sans';text-align:start;writing-mode:lr-tb;text-anchor:start;opacity:1;fill:#000000;fill-opacity:1;stroke:#000000;stroke-width:1.01663025;stroke-miterlimit:4;stroke-dasharray:none;stroke-opacity:1"
     id="path4371-9"
     d="M 149.71065,606.07527 C 87.842869,605.56965 18.67281,610.18664 13.203752,683.83235 13.532037,733.34448 51.194131,755.0344 96.144678,757.44239 184.02497,755.62648 211.27315,681.96905 212.9531,606.07527 h -63.24245 m 126.83051,-26.2647 V 800.64089 H 212.9531 C 220.06718,689.20409 196.71609,799.19844 79.210875,810.66287 2.2620464,810.9067 -45.520091,762.87239 -50.384302,687.9794 -49.761511,585.80943 36.877107,559.80789 123.79165,556.31065 H 212.9531 C 213.50412,486.48518 164.74409,466.25618 103.0564,458.1639 58.951683,457.63083 16.856159,469.88695 -22.04624,489.95793 V 431.20812 C 20.0135,414.5646 64.433409,405.25155 109.62252,404.25234 222.84747,402.4568 279.74526,473.65082 276.54116,579.81057" /><path
     inkscape:connector-curvature="0"
     style="font-style:normal;font-variant:normal;font-weight:normal;font-stretch:normal;font-size:64px;line-height:100%;font-family:'DejaVu Sans';-inkscape-font-specification:'DejaVu Sans';text-align:start;writing-mode:lr-tb;text-anchor:start;fill:#000000;fill-opacity:1;stroke:#000000;stroke-width:1.01663025;stroke-miterlimit:4;stroke-dasharray:none;stroke-opacity:1"
     sodipodi:nodetypes="ccccccccccccccczc"
     id="path4373-1"
     d="m 723.13862,591.21568 v 31.10283 H 430.77185 c 4.17724,84.63334 56.64541,129.8178 138.23488,134.43342 49.18521,0.67768 95.77634,-14.06073 139.27167,-35.94108 v 60.1322 c -45.29446,19.80635 -93.86997,28.70593 -143.07313,29.72045 -123.75476,0.16995 -193.56756,-81.75013 -200.78624,-199.74935 -0.55735,-120.046 71.40556,-198.73009 189.72737,-206.66118 111.72096,0.7009 163.35849,84.75726 168.99222,186.96271 M 659.55057,572.55389 C 658.82961,507.30541 619.6744,462.63322 554.83759,458.16453 482.46639,457.83625 442.62801,505.18148 432.84533,572.89949 l 226.70524,-0.34518 M 460.84486,362.68998 C 461.41065,361.41622 644.39657,228.6371 669,279.18401 c 24.4111,50.15233 -124.02236,84.55058 -208.15514,83.50597 z" /></g></g>
</svg>
