<?xml version="1.0" encoding="UTF-8" standalone="no"?>
<svg
   width="99.01619mm"
   height="40.598896mm"
   viewBox="0 0 99.01619 40.598896"
   version="1.1"
   id="svg3831"
   inkscape:version="1.2.2 (b0a8486541, 2022-12-01)"
   sodipodi:docname="customer-factory.svg"
   xml:space="preserve"
   xmlns:inkscape="http://www.inkscape.org/namespaces/inkscape"
   xmlns:sodipodi="http://sodipodi.sourceforge.net/DTD/sodipodi-0.dtd"
   xmlns="http://www.w3.org/2000/svg"
   xmlns:svg="http://www.w3.org/2000/svg"
   xmlns:rdf="http://www.w3.org/1999/02/22-rdf-syntax-ns#"
   xmlns:cc="http://creativecommons.org/ns#"
   xmlns:dc="http://purl.org/dc/elements/1.1/"><defs
     id="defs3825" /><sodipodi:namedview
     id="base"
     pagecolor="#ffffff"
     bordercolor="#666666"
     borderopacity="1.0"
     inkscape:pageopacity="0.0"
     inkscape:pageshadow="2"
     inkscape:zoom="3.5829044"
     inkscape:cx="350.69314"
     inkscape:cy="15.350675"
     inkscape:document-units="mm"
     inkscape:current-layer="layer1"
     inkscape:document-rotation="0"
     showgrid="false"
     fit-margin-top="0"
     fit-margin-left="0"
     fit-margin-right="0"
     fit-margin-bottom="0"
     inkscape:window-width="1920"
     inkscape:window-height="1011"
     inkscape:window-x="0"
     inkscape:window-y="0"
     inkscape:window-maximized="1"
     inkscape:showpageshadow="2"
     inkscape:pagecheckerboard="0"
     inkscape:deskcolor="#d1d1d1" /><metadata
     id="metadata3828"><rdf:RDF><cc:Work
         rdf:about=""><dc:format>image/svg+xml</dc:format><dc:type
           rdf:resource="http://purl.org/dc/dcmitype/StillImage" /><dc:title /></cc:Work></rdf:RDF></metadata><g
     inkscape:label="Calque 1"
     inkscape:groupmode="layer"
     id="layer1"
     transform="translate(-41.098829,-95.341033)"><g
       id="g1156"
       transform="translate(-115.14935,63.512324)"
       style="fill:#2e3440"><path
         d="m 248.74032,40.940231 c 0,0.239027 -0.19393,0.432956 -0.43296,0.432956 -0.14431,0 -0.27961,-0.07216 -0.36078,-0.193929 l -1.02377,-1.537891 h -0.20294 v 0.595314 l 1.11395,1.853586 c 0.0271,0.0451 0.0406,0.09471 0.0406,0.148829 0,0.157848 -0.13079,0.288635 -0.28864,0.288635 h -0.8659 v 1.226705 c 0,0.279618 -0.2255,0.505113 -0.50512,0.505113 h -0.72159 c -0.27511,0 -0.50511,-0.225495 -0.50511,-0.505113 v -1.226705 h -0.86591 c -0.15785,0 -0.28864,-0.130787 -0.28864,-0.288635 0,-0.05412 0.0136,-0.10373 0.0406,-0.148829 l 1.11395,-1.853586 v -0.595314 h -0.20294 l -1.02376,1.537891 c -0.0812,0.121769 -0.21648,0.193929 -0.36079,0.193929 -0.23903,0 -0.43296,-0.193929 -0.43296,-0.432956 0,-0.08569 0.0271,-0.171378 0.0722,-0.239028 l 1.15455,-1.731818 c 0.18039,-0.266086 0.46001,-0.482563 0.79374,-0.482563 h 1.73183 c 0.33373,0 0.61335,0.216477 0.79374,0.482563 l 1.15456,1.731818 c 0.0451,0.06765 0.0722,0.153339 0.0722,0.239028 z m -1.87614,-3.607955 c 0,0.559233 -0.45099,1.010227 -1.01022,1.010227 -0.55924,0 -1.01023,-0.450994 -1.01023,-1.010227 0,-0.559233 0.45099,-1.010227 1.01023,-1.010227 0.55923,0 1.01022,0.450994 1.01022,1.010227 z"
         id="path5504-7-2-2"
         style="fill:#2e3440;stroke-width:0.00450993" /><path
         d="m 253.72788,39.352731 v 1.876136 c 0,0.239027 -0.19393,0.432955 -0.43296,0.432955 -0.23902,0 -0.43295,-0.193928 -0.43295,-0.432955 v -1.5875 h -0.28863 v 4.113069 c 0,0.279616 -0.2255,0.505113 -0.50512,0.505113 -0.27961,0 -0.50511,-0.225497 -0.50511,-0.505113 v -2.092614 h -0.28865 v 2.092614 c 0,0.279616 -0.22549,0.505113 -0.50511,0.505113 -0.27961,0 -0.50511,-0.225497 -0.50511,-0.505113 v -4.113069 h -0.28864 v 1.5875 c 0,0.239027 -0.19392,0.432955 -0.43295,0.432955 -0.23903,0 -0.43296,-0.193928 -0.43296,-0.432955 v -1.876136 c 0,-0.478054 0.38786,-0.865909 0.86591,-0.865909 h 2.88637 c 0.47805,0 0.86591,0.387855 0.86591,0.865909 z m -1.29886,-2.020455 c 0,0.559233 -0.451,1.010227 -1.01023,1.010227 -0.55924,0 -1.01023,-0.450994 -1.01023,-1.010227 0,-0.559233 0.45099,-1.010227 1.01023,-1.010227 0.55923,0 1.01023,0.450994 1.01023,1.010227 z"
         id="path922-5-7-61"
         style="fill:#2e3440;stroke-width:0.00450993" /></g><path
       d="m 46.991529,112.06248 c 0,0.23902 -0.19393,0.43295 -0.43296,0.43295 -0.14431,0 -0.27961,-0.0722 -0.36079,-0.19393 l -1.02376,-1.53789 h -0.20294 v 0.59531 l 1.11395,1.85359 c 0.0271,0.0451 0.0406,0.0947 0.0406,0.14883 0,0.15785 -0.13079,0.28864 -0.28864,0.28864 h -0.8659 v 1.2267 c 0,0.27962 -0.2255,0.50511 -0.50512,0.50511 h -0.72159 c -0.27511,0 -0.50512,-0.22549 -0.50512,-0.50511 v -1.2267 h -0.8659 c -0.15785,0 -0.28864,-0.13079 -0.28864,-0.28864 0,-0.0541 0.0136,-0.10373 0.0406,-0.14883 l 1.11395,-1.85359 v -0.59531 h -0.20294 l -1.02376,1.53789 c -0.0812,0.12177 -0.21648,0.19393 -0.36079,0.19393 -0.23903,0 -0.43296,-0.19393 -0.43296,-0.43295 0,-0.0857 0.0271,-0.17138 0.0722,-0.23903 l 1.15455,-1.73182 c 0.18039,-0.26609 0.46001,-0.48256 0.79374,-0.48256 h 1.73183 c 0.33373,0 0.61335,0.21647 0.79374,0.48256 l 1.15455,1.73182 c 0.0451,0.0677 0.0722,0.15334 0.0722,0.23903 z m -1.87614,-3.60796 c 0,0.55923 -0.45099,1.01023 -1.01022,1.01023 -0.55924,0 -1.01023,-0.451 -1.01023,-1.01023 0,-0.55923 0.45099,-1.01023 1.01023,-1.01023 0.55923,0 1.01022,0.451 1.01022,1.01023 z"
       id="path5504-35"
       style="fill:#2e3440;stroke-width:0.00450993" /><path
       d="m 51.979069,110.47498 v 1.87613 c 0,0.23903 -0.19393,0.43296 -0.43296,0.43296 -0.23903,0 -0.43295,-0.19393 -0.43295,-0.43296 v -1.5875 h -0.28864 v 4.11307 c 0,0.27962 -0.2255,0.50511 -0.50511,0.50511 -0.27962,0 -0.50511,-0.22549 -0.50511,-0.50511 v -2.09261 h -0.28865 v 2.09261 c 0,0.27962 -0.22549,0.50511 -0.50511,0.50511 -0.27961,0 -0.50511,-0.22549 -0.50511,-0.50511 v -4.11307 h -0.28864 v 1.5875 c 0,0.23903 -0.19392,0.43296 -0.43295,0.43296 -0.23903,0 -0.43296,-0.19393 -0.43296,-0.43296 v -1.87613 c 0,-0.47806 0.38786,-0.86591 0.86591,-0.86591 h 2.88637 c 0.47805,0 0.86591,0.38785 0.86591,0.86591 z m -1.29887,-2.02046 c 0,0.55923 -0.45099,1.01023 -1.01022,1.01023 -0.55924,0 -1.01023,-0.451 -1.01023,-1.01023 0,-0.55923 0.45099,-1.01023 1.01023,-1.01023 0.55923,0 1.01022,0.451 1.01022,1.01023 z"
       id="path922-62"
       style="fill:#2e3440;stroke-width:0.00450993" /><path
       d="m 58.121039,112.06248 c 0,0.23902 -0.19392,0.43295 -0.43296,0.43295 -0.14431,0 -0.27961,-0.0722 -0.36079,-0.19393 l -1.02376,-1.53789 h -0.20294 v 0.59531 l 1.11395,1.85359 c 0.0271,0.0451 0.0406,0.0947 0.0406,0.14883 0,0.15785 -0.13079,0.28864 -0.28864,0.28864 h -0.8659 v 1.2267 c 0,0.27962 -0.2255,0.50511 -0.50512,0.50511 h -0.72159 c -0.27511,0 -0.50512,-0.22549 -0.50512,-0.50511 v -1.2267 h -0.8659 c -0.15785,0 -0.28864,-0.13079 -0.28864,-0.28864 0,-0.0541 0.0136,-0.10373 0.0406,-0.14883 l 1.11395,-1.85359 v -0.59531 h -0.20294 l -1.02376,1.53789 c -0.0812,0.12177 -0.21648,0.19393 -0.36079,0.19393 -0.23903,0 -0.43296,-0.19393 -0.43296,-0.43295 0,-0.0857 0.0271,-0.17138 0.0722,-0.23903 l 1.15455,-1.73182 c 0.18039,-0.26609 0.46001,-0.48256 0.79374,-0.48256 h 1.73183 c 0.33373,0 0.61335,0.21647 0.79374,0.48256 l 1.15455,1.73182 c 0.0451,0.0677 0.0722,0.15334 0.0722,0.23903 z m -1.87614,-3.60796 c 0,0.55923 -0.45099,1.01023 -1.01022,1.01023 -0.55924,0 -1.01023,-0.451 -1.01023,-1.01023 0,-0.55923 0.45099,-1.01023 1.01023,-1.01023 0.55923,0 1.01022,0.451 1.01022,1.01023 z"
       id="path5504-3-9"
       style="fill:#2e3440;stroke-width:0.00450993" /><path
       d="m 63.108589,110.47498 v 1.87613 c 0,0.23903 -0.19393,0.43296 -0.43296,0.43296 -0.23903,0 -0.43295,-0.19393 -0.43295,-0.43296 v -1.5875 h -0.28864 v 4.11307 c 0,0.27962 -0.2255,0.50511 -0.50511,0.50511 -0.27962,0 -0.50511,-0.22549 -0.50511,-0.50511 v -2.09261 h -0.28864 v 2.09261 c 0,0.27962 -0.2255,0.50511 -0.50512,0.50511 -0.27961,0 -0.50511,-0.22549 -0.50511,-0.50511 v -4.11307 h -0.28864 v 1.5875 c 0,0.23903 -0.19392,0.43296 -0.43295,0.43296 -0.23903,0 -0.43296,-0.19393 -0.43296,-0.43296 v -1.87613 c 0,-0.47806 0.38786,-0.86591 0.86591,-0.86591 h 2.88637 c 0.47805,0 0.86591,0.38785 0.86591,0.86591 z m -1.29887,-2.02046 c 0,0.55923 -0.45099,1.01023 -1.01022,1.01023 -0.55924,0 -1.01023,-0.451 -1.01023,-1.01023 0,-0.55923 0.45099,-1.01023 1.01023,-1.01023 0.55923,0 1.01022,0.451 1.01022,1.01023 z"
       id="path922-6-1"
       style="fill:#2e3440;stroke-width:0.00450993" /><path
       d="m 69.25057,112.06248 c 0,0.23902 -0.193932,0.43295 -0.432962,0.43295 -0.144309,0 -0.279609,-0.0722 -0.360778,-0.19393 l -1.023771,-1.53789 h -0.20294 v 0.59531 l 1.113951,1.85359 c 0.0271,0.0451 0.0406,0.0947 0.0406,0.14883 0,0.15785 -0.130792,0.28864 -0.288642,0.28864 h -0.8659 v 1.2267 c 0,0.27962 -0.2255,0.50511 -0.50512,0.50511 h -0.72159 c -0.27511,0 -0.50511,-0.22549 -0.50511,-0.50511 v -1.2267 h -0.86591 c -0.15785,0 -0.28864,-0.13079 -0.28864,-0.28864 0,-0.0541 0.0136,-0.10373 0.0406,-0.14883 l 1.11395,-1.85359 v -0.59531 h -0.20294 l -1.02376,1.53789 c -0.0812,0.12177 -0.21648,0.19393 -0.36079,0.19393 -0.23903,0 -0.43296,-0.19393 -0.43296,-0.43295 0,-0.0857 0.0271,-0.17138 0.0722,-0.23903 l 1.15455,-1.73182 c 0.18039,-0.26609 0.46001,-0.48256 0.79374,-0.48256 h 1.73183 c 0.33373,0 0.61335,0.21647 0.79374,0.48256 l 1.15456,1.73182 c 0.0451,0.0677 0.0722,0.15334 0.0722,0.23903 z m -1.876141,-3.60796 c 0,0.55923 -0.45099,1.01023 -1.01022,1.01023 -0.55924,0 -1.01023,-0.451 -1.01023,-1.01023 0,-0.55923 0.45099,-1.01023 1.01023,-1.01023 0.55923,0 1.01022,0.451 1.01022,1.01023 z"
       id="path5504-7-2"
       style="fill:#2e3440;stroke-width:0.00450993" /><path
       d="m 74.23813,110.47498 v 1.87613 c 0,0.23903 -0.193929,0.43296 -0.432962,0.43296 -0.239019,0 -0.432948,-0.19393 -0.432948,-0.43296 v -1.5875 h -0.288632 v 4.11307 c 0,0.27962 -0.225499,0.50511 -0.505118,0.50511 -0.279612,0 -0.505111,-0.22549 -0.505111,-0.50511 v -2.09261 h -0.28865 v 2.09261 c 0,0.27962 -0.225491,0.50511 -0.505111,0.50511 -0.279609,0 -0.505108,-0.22549 -0.505108,-0.50511 v -4.11307 h -0.288642 v 1.5875 c 0,0.23903 -0.193918,0.43296 -0.432948,0.43296 -0.23903,0 -0.432961,-0.19393 -0.432961,-0.43296 v -1.87613 c 0,-0.47806 0.38786,-0.86591 0.865909,-0.86591 h 2.886372 c 0.478049,0 0.86591,0.38785 0.86591,0.86591 z m -1.298861,-2.02046 c 0,0.55923 -0.451001,1.01023 -1.01023,1.01023 -0.559239,0 -1.010229,-0.451 -1.010229,-1.01023 0,-0.55923 0.45099,-1.01023 1.010229,-1.01023 0.559229,0 1.01023,0.451 1.01023,1.01023 z"
       id="path922-5-7"
       style="fill:#2e3440;stroke-width:0.00450993" /><path
       d="m 94.578889,100.95133 c 0.51676,0 0.944941,0.42817 0.944941,0.94494 v 13.15534 l 7.91387,-6.33405 c 0.16242,-0.13288 0.38389,-0.20671 0.59059,-0.20671 0.51676,0 0.94494,0.42818 0.94494,0.94494 v 5.59582 l 7.91388,-6.33405 c 0.16241,-0.13288 0.38388,-0.20671 0.59058,-0.20671 0.51677,0 0.94495,0.42818 0.94495,0.94494 v 17.00893 c 0,0.51676 -0.42818,0.94494 -0.94495,0.94494 H 88.909249 c -0.516768,0 -0.944949,-0.42818 -0.944949,-0.94494 v -24.56845 c 0,-0.51677 0.428181,-0.94494 0.944949,-0.94494 z"
       id="path1083"
       style="fill:#2e3440;stroke-width:0.0147647" /><path
       d="m 46.871539,121.94925 c 0,0.23903 -0.19393,0.43295 -0.43296,0.43295 -0.14431,0 -0.27961,-0.0722 -0.36079,-0.19392 l -1.02376,-1.53789 h -0.20294 v 0.59531 l 1.11395,1.85358 c 0.0271,0.0451 0.0406,0.0947 0.0406,0.14883 0,0.15785 -0.13079,0.28864 -0.28864,0.28864 h -0.8659 v 1.2267 c 0,0.27962 -0.2255,0.50512 -0.50512,0.50512 h -0.72159 c -0.27511,0 -0.50512,-0.2255 -0.50512,-0.50512 v -1.2267 h -0.8659 c -0.15785,0 -0.28864,-0.13079 -0.28864,-0.28864 0,-0.0541 0.0136,-0.10373 0.0406,-0.14883 l 1.11395,-1.85358 v -0.59531 h -0.20294 l -1.02376,1.53789 c -0.0812,0.12176 -0.21648,0.19392 -0.36079,0.19392 -0.23903,0 -0.43296,-0.19392 -0.43296,-0.43295 0,-0.0857 0.0271,-0.17138 0.0722,-0.23903 l 1.15455,-1.73182 c 0.18039,-0.26608 0.46001,-0.48256 0.79374,-0.48256 h 1.73183 c 0.33373,0 0.61335,0.21648 0.79374,0.48256 l 1.15455,1.73182 c 0.0451,0.0676 0.0722,0.15334 0.0722,0.23903 z m -1.87614,-3.60796 c 0,0.55924 -0.45099,1.01023 -1.01022,1.01023 -0.55924,0 -1.01023,-0.45099 -1.01023,-1.01023 0,-0.55923 0.45099,-1.01022 1.01023,-1.01022 0.55923,0 1.01022,0.45099 1.01022,1.01022 z"
       id="path5504-35-0"
       style="fill:#2e3440;stroke-width:0.00450993" /><path
       d="m 51.859089,120.36175 v 1.87614 c 0,0.23902 -0.19393,0.43295 -0.43296,0.43295 -0.23903,0 -0.43295,-0.19393 -0.43295,-0.43295 v -1.5875 h -0.28864 v 4.11306 c 0,0.27962 -0.2255,0.50512 -0.50511,0.50512 -0.27962,0 -0.50511,-0.2255 -0.50511,-0.50512 v -2.09261 h -0.28865 v 2.09261 c 0,0.27962 -0.22549,0.50512 -0.50511,0.50512 -0.27961,0 -0.50511,-0.2255 -0.50511,-0.50512 v -4.11306 h -0.28864 v 1.5875 c 0,0.23902 -0.19392,0.43295 -0.43295,0.43295 -0.23903,0 -0.43296,-0.19393 -0.43296,-0.43295 v -1.87614 c 0,-0.47806 0.38786,-0.86591 0.86591,-0.86591 h 2.88637 c 0.47805,0 0.86591,0.38785 0.86591,0.86591 z m -1.29887,-2.02046 c 0,0.55924 -0.45099,1.01023 -1.01022,1.01023 -0.55924,0 -1.01023,-0.45099 -1.01023,-1.01023 0,-0.55923 0.45099,-1.01022 1.01023,-1.01022 0.55923,0 1.01022,0.45099 1.01022,1.01022 z"
       id="path922-62-9"
       style="fill:#2e3440;stroke-width:0.00450993" /><path
       d="m 58.001059,121.94925 c 0,0.23903 -0.19392,0.43295 -0.43296,0.43295 -0.14431,0 -0.27961,-0.0722 -0.36079,-0.19392 l -1.02376,-1.53789 h -0.20294 v 0.59531 l 1.11395,1.85358 c 0.0271,0.0451 0.0406,0.0947 0.0406,0.14883 0,0.15785 -0.13079,0.28864 -0.28864,0.28864 h -0.8659 v 1.2267 c 0,0.27962 -0.2255,0.50512 -0.50512,0.50512 h -0.72159 c -0.27511,0 -0.50512,-0.2255 -0.50512,-0.50512 v -1.2267 h -0.8659 c -0.15785,0 -0.28864,-0.13079 -0.28864,-0.28864 0,-0.0541 0.0136,-0.10373 0.0406,-0.14883 l 1.11395,-1.85358 v -0.59531 h -0.20294 l -1.02376,1.53789 c -0.0812,0.12176 -0.21648,0.19392 -0.36079,0.19392 -0.23903,0 -0.43296,-0.19392 -0.43296,-0.43295 0,-0.0857 0.0271,-0.17138 0.0722,-0.23903 l 1.15455,-1.73182 c 0.18039,-0.26608 0.46001,-0.48256 0.79374,-0.48256 h 1.73183 c 0.33373,0 0.61335,0.21648 0.79374,0.48256 l 1.15455,1.73182 c 0.0451,0.0676 0.0722,0.15334 0.0722,0.23903 z m -1.87614,-3.60796 c 0,0.55924 -0.45099,1.01023 -1.01022,1.01023 -0.55924,0 -1.01023,-0.45099 -1.01023,-1.01023 0,-0.55923 0.45099,-1.01022 1.01023,-1.01022 0.55923,0 1.01022,0.45099 1.01022,1.01022 z"
       id="path5504-3-9-3"
       style="fill:#2e3440;stroke-width:0.00450993" /><path
       d="m 62.988609,120.36175 v 1.87614 c 0,0.23902 -0.19393,0.43295 -0.43296,0.43295 -0.23903,0 -0.43295,-0.19393 -0.43295,-0.43295 v -1.5875 h -0.28864 v 4.11306 c 0,0.27962 -0.2255,0.50512 -0.50511,0.50512 -0.27962,0 -0.50511,-0.2255 -0.50511,-0.50512 v -2.09261 h -0.28864 v 2.09261 c 0,0.27962 -0.2255,0.50512 -0.50512,0.50512 -0.27961,0 -0.50511,-0.2255 -0.50511,-0.50512 v -4.11306 h -0.28864 v 1.5875 c 0,0.23902 -0.19392,0.43295 -0.43295,0.43295 -0.23903,0 -0.43296,-0.19393 -0.43296,-0.43295 v -1.87614 c 0,-0.47806 0.38786,-0.86591 0.86591,-0.86591 h 2.88637 c 0.47805,0 0.86591,0.38785 0.86591,0.86591 z m -1.29887,-2.02046 c 0,0.55924 -0.45099,1.01023 -1.01022,1.01023 -0.55924,0 -1.01023,-0.45099 -1.01023,-1.01023 0,-0.55923 0.45099,-1.01022 1.01023,-1.01022 0.55923,0 1.01022,0.45099 1.01022,1.01022 z"
       id="path922-6-1-6"
       style="fill:#2e3440;stroke-width:0.00450993" /><path
       d="m 69.130589,121.94925 c 0,0.23903 -0.193921,0.43295 -0.432951,0.43295 -0.144319,0 -0.279619,-0.0722 -0.360778,-0.19392 l -1.023781,-1.53789 h -0.20294 v 0.59531 l 1.113961,1.85358 c 0.0271,0.0451 0.0406,0.0947 0.0406,0.14883 0,0.15785 -0.130802,0.28864 -0.288652,0.28864 h -0.865899 v 1.2267 c 0,0.27962 -0.2255,0.50512 -0.50512,0.50512 h -0.72159 c -0.27511,0 -0.50511,-0.2255 -0.50511,-0.50512 v -1.2267 h -0.86591 c -0.15785,0 -0.28864,-0.13079 -0.28864,-0.28864 0,-0.0541 0.0136,-0.10373 0.0406,-0.14883 l 1.11395,-1.85358 v -0.59531 h -0.20294 l -1.02376,1.53789 c -0.0812,0.12176 -0.21648,0.19392 -0.36079,0.19392 -0.23903,0 -0.43296,-0.19392 -0.43296,-0.43295 0,-0.0857 0.0271,-0.17138 0.0722,-0.23903 l 1.15455,-1.73182 c 0.18039,-0.26608 0.46001,-0.48256 0.79374,-0.48256 h 1.73183 c 0.33373,0 0.613349,0.21648 0.793739,0.48256 l 1.15456,1.73182 c 0.0451,0.0676 0.0722,0.15334 0.0722,0.23903 z m -1.87614,-3.60796 c 0,0.55924 -0.45099,1.01023 -1.01022,1.01023 -0.55924,0 -1.01023,-0.45099 -1.01023,-1.01023 0,-0.55923 0.45099,-1.01022 1.01023,-1.01022 0.55923,0 1.01022,0.45099 1.01022,1.01022 z"
       id="path5504-7-2-0"
       style="fill:#2e3440;stroke-width:0.00450993" /><path
       d="m 74.118149,120.36175 v 1.87614 c 0,0.23902 -0.193918,0.43295 -0.432951,0.43295 -0.23903,0 -0.432959,-0.19393 -0.432959,-0.43295 v -1.5875 h -0.288621 v 4.11306 c 0,0.27962 -0.225509,0.50512 -0.505129,0.50512 -0.279601,0 -0.505111,-0.2255 -0.505111,-0.50512 v -2.09261 h -0.288649 v 2.09261 c 0,0.27962 -0.225481,0.50512 -0.505101,0.50512 -0.279619,0 -0.505108,-0.2255 -0.505108,-0.50512 v -4.11306 h -0.288642 v 1.5875 c 0,0.23902 -0.193929,0.43295 -0.432948,0.43295 -0.23903,0 -0.432972,-0.19393 -0.432972,-0.43295 v -1.87614 c 0,-0.47806 0.387861,-0.86591 0.86592,-0.86591 h 2.886361 c 0.478049,0 0.86591,0.38785 0.86591,0.86591 z m -1.298861,-2.02046 c 0,0.55924 -0.45099,1.01023 -1.010229,1.01023 -0.559229,0 -1.01023,-0.45099 -1.01023,-1.01023 0,-0.55923 0.451001,-1.01022 1.01023,-1.01022 0.559239,0 1.010229,0.45099 1.010229,1.01022 z"
       id="path922-5-7-6"
       style="fill:#2e3440;stroke-width:0.00450993" /><path
       d="m 133.14449,132.62061 c 0,0.23903 -0.19393,0.43296 -0.43296,0.43296 -0.14431,0 -0.27961,-0.0722 -0.36078,-0.19393 l -1.02377,-1.53789 h -0.20294 v 0.59531 l 1.11395,1.85359 c 0.0271,0.0451 0.0406,0.0947 0.0406,0.14883 0,0.15784 -0.13079,0.28863 -0.28864,0.28863 h -0.8659 v 1.2267 c 0,0.27962 -0.2255,0.50512 -0.50512,0.50512 h -0.72159 c -0.27511,0 -0.50511,-0.2255 -0.50511,-0.50512 v -1.2267 h -0.86591 c -0.15785,0 -0.28864,-0.13079 -0.28864,-0.28863 0,-0.0541 0.0136,-0.10373 0.0406,-0.14883 l 1.11395,-1.85359 v -0.59531 h -0.20294 l -1.02376,1.53789 c -0.0812,0.12177 -0.21648,0.19393 -0.36079,0.19393 -0.23903,0 -0.43296,-0.19393 -0.43296,-0.43296 0,-0.0857 0.0271,-0.17138 0.0722,-0.23903 l 1.15455,-1.73182 c 0.18039,-0.26608 0.46001,-0.48256 0.79374,-0.48256 h 1.73183 c 0.33373,0 0.61335,0.21648 0.79374,0.48256 l 1.15456,1.73182 c 0.0451,0.0676 0.0722,0.15334 0.0722,0.23903 z m -1.87614,-3.60795 c 0,0.55923 -0.45099,1.01022 -1.01022,1.01022 -0.55924,0 -1.01023,-0.45099 -1.01023,-1.01022 0,-0.55924 0.45099,-1.01023 1.01023,-1.01023 0.55923,0 1.01022,0.45099 1.01022,1.01023 z"
       id="path5504-7-2-8"
       style="fill:#2e3440;stroke-width:0.00450993" /><path
       d="m 140.11502,131.03311 v 1.87614 c 0,0.23902 -0.19393,0.43295 -0.43296,0.43295 -0.23902,0 -0.43295,-0.19393 -0.43295,-0.43295 v -1.5875 h -0.28863 v 4.11306 c 0,0.27962 -0.2255,0.50512 -0.50512,0.50512 -0.27961,0 -0.50511,-0.2255 -0.50511,-0.50512 v -2.09261 h -0.28865 v 2.09261 c 0,0.27962 -0.22549,0.50512 -0.50511,0.50512 -0.27961,0 -0.50511,-0.2255 -0.50511,-0.50512 v -4.11306 h -0.28864 v 1.5875 c 0,0.23902 -0.19392,0.43295 -0.43295,0.43295 -0.23903,0 -0.43296,-0.19393 -0.43296,-0.43295 v -1.87614 c 0,-0.47806 0.38786,-0.86591 0.86591,-0.86591 h 2.88637 c 0.47805,0 0.86591,0.38785 0.86591,0.86591 z m -1.29886,-2.02045 c 0,0.55923 -0.451,1.01022 -1.01023,1.01022 -0.55924,0 -1.01023,-0.45099 -1.01023,-1.01022 0,-0.55924 0.45099,-1.01023 1.01023,-1.01023 0.55923,0 1.01023,0.45099 1.01023,1.01023 z"
       id="path922-5-7-7"
       style="fill:#2e3440;stroke-width:0.00450993" /><path
       d="m 135.49506,125.68491 c 0,0.78359 -0.8722,1.41765 -1.94928,1.41765 -0.1689,0 -0.33226,-0.0166 -0.48731,-0.0443 -0.22982,0.16337 -0.49009,0.28243 -0.76975,0.35442 -0.0748,0.0194 -0.15505,0.0332 -0.23812,0.0443 h -0.008 c -0.0415,0 -0.0803,-0.0332 -0.0886,-0.0803 -0.0111,-0.0526 0.0249,-0.0858 0.0554,-0.12183 0.10799,-0.12183 0.22981,-0.22982 0.32395,-0.45963 -0.44855,-0.26028 -0.73651,-0.66176 -0.73651,-1.11031 0,-0.78359 0.87219,-1.41765 1.94927,-1.41765 1.07709,0 1.94927,0.63406 1.94927,1.41765 z m 1.06323,0.70883 c 0,0.45132 -0.28796,0.85003 -0.73651,1.11031 0.0941,0.22981 0.21597,0.3378 0.32395,0.45963 0.0305,0.036 0.0665,0.0692 0.0554,0.12183 -0.0111,0.0498 -0.0526,0.0858 -0.0969,0.0803 -0.0831,-0.0111 -0.16337,-0.0249 -0.23813,-0.0443 -0.27965,-0.072 -0.53992,-0.19106 -0.76973,-0.35442 -0.15506,0.0277 -0.31842,0.0443 -0.48732,0.0443 -0.50117,0 -0.9608,-0.13844 -1.3069,-0.36548 0.0803,0.005 0.16336,0.0111 0.24366,0.0111 0.5953,0 1.15738,-0.17167 1.58655,-0.48178 0.4624,-0.3378 0.71713,-0.79466 0.71713,-1.29029 0,-0.14398 -0.0222,-0.28519 -0.0637,-0.42086 0.46794,0.2575 0.77251,0.66729 0.77251,1.12969 z"
       id="path2023"
       style="fill:#2e3440;stroke-width:0.00276884" /><path
       d="m 84.857079,116.34554 c 0,0.17322 -0.0663,0.34134 -0.1885,0.46361 l -3.316629,3.31664 c -0.122222,0.11718 -0.290401,0.1885 -0.463611,0.1885 -0.173231,0 -0.336259,-0.0713 -0.45852,-0.1885 l -0.382101,-0.38211 c -0.122229,-0.12227 -0.193598,-0.29039 -0.193598,-0.46361 0,-0.17322 0.0713,-0.34134 0.193598,-0.46361 l 1.492732,-1.49274 H 77.9538 c -0.36681,0 -0.596071,-0.30569 -0.596071,-0.65212 v -0.65212 c 0,-0.34644 0.229261,-0.65212 0.596071,-0.65212 h 3.58665 l -1.492732,-1.49783 c -0.122229,-0.11717 -0.193598,-0.2853 -0.193598,-0.45852 0,-0.17322 0.0713,-0.34135 0.193598,-0.45852 l 0.382101,-0.38211 c 0.122221,-0.12227 0.285289,-0.19359 0.45852,-0.19359 0.17321,0 0.341331,0.0713 0.463611,0.19359 l 3.316629,3.31664 c 0.122221,0.11718 0.1885,0.2853 0.1885,0.45852 z"
       id="path2120"
       style="fill:#2e3440;stroke-width:0.00509466" /><path
       d="m 124.87275,106.26126 c 0.0854,0.15071 0.1106,0.32967 0.0646,0.49629 l -1.25035,4.5207 c -0.0486,0.16221 -0.15972,0.30717 -0.31042,0.39257 -0.15071,0.0854 -0.32771,0.10373 -0.49185,0.0621 l -0.52082,-0.14405 c -0.16663,-0.0461 -0.31161,-0.1572 -0.39701,-0.3079 -0.0854,-0.15071 -0.10626,-0.33213 -0.0601,-0.49881 l 0.56275,-2.03465 -3.12044,1.76829 c -0.31914,0.18084 -0.6693,0.0279 -0.8401,-0.27348 l -0.32151,-0.56735 c -0.1708,-0.30141 -0.12205,-0.68039 0.19708,-0.86123 l 3.12045,-1.7683 -2.03717,-0.56719 c -0.16411,-0.0417 -0.30909,-0.15277 -0.39449,-0.30347 -0.0854,-0.15071 -0.10626,-0.33213 -0.0576,-0.49437 l 0.14405,-0.52082 c 0.0461,-0.16664 0.15276,-0.30909 0.30348,-0.39449 0.15069,-0.0854 0.33212,-0.10624 0.49879,-0.0601 l 4.5207,1.25036 c 0.16411,0.0417 0.30466,0.15528 0.39006,0.30598 z"
       id="path2120-4"
       style="fill:#2e3440;stroke-width:0.00509466" /><path
       d="m 124.78205,129.2217 c -0.093,0.14612 -0.23923,0.25234 -0.40798,0.28987 l -4.57889,1.01677 c -0.16603,0.0332 -0.3462,0.003 -0.49232,-0.0899 -0.14613,-0.093 -0.24536,-0.24074 -0.28557,-0.40524 l -0.11713,-0.52753 c -0.0375,-0.16879 -0.007,-0.34893 0.0856,-0.49505 0.093,-0.14613 0.24346,-0.24967 0.41229,-0.28714 l 2.06084,-0.45763 -3.02561,-1.92606 c -0.30943,-0.19698 -0.33868,-0.57796 -0.15264,-0.87021 l 0.35019,-0.55011 c 0.18604,-0.29225 0.54359,-0.42699 0.85303,-0.23001 l 3.02561,1.92606 -0.45488,-2.06515 c -0.0402,-0.16448 -0.0101,-0.34464 0.0829,-0.49076 0.093,-0.14612 0.24345,-0.24966 0.40955,-0.28283 l 0.52752,-0.11715 c 0.16877,-0.0375 0.34463,-0.0101 0.49076,0.0829 0.14612,0.093 0.24964,0.24347 0.28713,0.41228 l 1.01677,4.57889 c 0.0402,0.16449 0.006,0.3419 -0.0872,0.48802 z"
       id="path2120-44"
       style="fill:#2e3440;stroke-width:0.00509466" /><path
       d="m 134.90704,98.547043 0.0952,0.43237 c 0.0109,0.0435 -0.0136,0.087 -0.0544,0.10061 -0.0109,0.003 -0.26377,0.0897 -0.59008,0.0897 -0.84842,0 -1.53097,-0.51123 -1.75939,-1.3107 h -0.25833 c -0.049,0 -0.087,-0.0408 -0.087,-0.087 v -0.30727 c 0,-0.0462 0.038,-0.087 0.087,-0.087 h 0.17948 c -0.003,-0.087 -0.003,-0.19035 0.003,-0.28553 h -0.18219 c -0.0489,0 -0.087,-0.0381 -0.087,-0.087 v -0.31 c 0,-0.0489 0.0381,-0.087 0.087,-0.087 h 0.26649 c 0.24201,-0.76141 0.93815,-1.26719 1.75122,-1.26719 0.28281,0 0.51667,0.0598 0.52755,0.0625 0.0217,0.005 0.0408,0.0217 0.0544,0.0408 0.0109,0.019 0.0136,0.0435 0.008,0.0653 l -0.11693,0.43237 c -0.0109,0.0462 -0.0571,0.0734 -0.10333,0.0598 -0.003,0 -0.18763,-0.0462 -0.3807,-0.0462 -0.45684,0 -0.84026,0.24745 -1.02246,0.65263 h 1.27263 c 0.0272,0 0.0517,0.0109 0.068,0.0326 0.0163,0.019 0.0245,0.0462 0.019,0.0707 l -0.0653,0.31 c -0.008,0.0408 -0.0435,0.0707 -0.087,0.0707 h -1.32701 c -0.008,0.087 -0.005,0.17948 0,0.28553 h 1.24815 c 0.0272,0 0.0517,0.0136 0.068,0.0326 0.0163,0.0217 0.0218,0.049 0.0163,0.0734 l -0.0653,0.30456 c -0.008,0.0408 -0.0435,0.0707 -0.0843,0.0707 h -1.05237 c 0.17403,0.42421 0.56561,0.6907 1.02789,0.6907 0.23658,0 0.42965,-0.0653 0.43237,-0.0653 0.0217,-0.008 0.049,-0.005 0.0707,0.005 0.0217,0.0136 0.0354,0.0354 0.0408,0.0571 z"
       id="path491"
       style="fill:#2e3440;fill-opacity:1;stroke-width:0.00271929" /></g></svg>
