<?xml version="1.0" encoding="UTF-8" standalone="no"?>
<svg
   width="338.4487mm"
   height="204.27306mm"
   viewBox="0 0 338.4487 204.27306"
   version="1.1"
   id="svg8"
   inkscape:version="1.2.2 (b0a8486541, 2022-12-01)"
   sodipodi:docname="pirates-metrics.svg"
   xmlns:inkscape="http://www.inkscape.org/namespaces/inkscape"
   xmlns:sodipodi="http://sodipodi.sourceforge.net/DTD/sodipodi-0.dtd"
   xmlns="http://www.w3.org/2000/svg"
   xmlns:svg="http://www.w3.org/2000/svg"
   xmlns:rdf="http://www.w3.org/1999/02/22-rdf-syntax-ns#"
   xmlns:cc="http://creativecommons.org/ns#"
   xmlns:dc="http://purl.org/dc/elements/1.1/">
  <defs
     id="defs2" />
  <sodipodi:namedview
     id="base"
     pagecolor="#ffffff"
     bordercolor="#666666"
     borderopacity="1.0"
     inkscape:pageopacity="0.0"
     inkscape:pageshadow="2"
     inkscape:zoom="0.54179649"
     inkscape:cx="135.65979"
     inkscape:cy="490.95925"
     inkscape:document-units="mm"
     inkscape:current-layer="layer1"
     inkscape:document-rotation="0"
     showgrid="false"
     inkscape:window-width="1920"
     inkscape:window-height="1011"
     inkscape:window-x="0"
     inkscape:window-y="0"
     inkscape:window-maximized="1"
     fit-margin-top="0"
     fit-margin-left="0"
     fit-margin-right="0"
     fit-margin-bottom="0"
     showguides="true"
     inkscape:guide-bbox="true"
     inkscape:showpageshadow="2"
     inkscape:pagecheckerboard="0"
     inkscape:deskcolor="#d1d1d1">
    <inkscape:grid
       type="xygrid"
       id="grid869"
       originx="0.0016045114"
       originy="-0.0001631703" />
    <sodipodi:guide
       position="155.98234,199.02689"
       orientation="1,0"
       id="guide871"
       inkscape:locked="false" />
    <sodipodi:guide
       position="-0.53014991,204.12207"
       orientation="0,-1"
       id="guide873"
       inkscape:locked="false" />
    <sodipodi:guide
       position="77.995105,211.07678"
       orientation="1,0"
       id="guide875"
       inkscape:locked="false" />
  </sodipodi:namedview>
  <metadata
     id="metadata5">
    <rdf:RDF>
      <cc:Work
         rdf:about="">
        <dc:format>image/svg+xml</dc:format>
        <dc:type
           rdf:resource="http://purl.org/dc/dcmitype/StillImage" />
        <dc:title />
      </cc:Work>
    </rdf:RDF>
  </metadata>
  <g
     inkscape:label="Calque 1"
     inkscape:groupmode="layer"
     id="layer1"
     transform="translate(11.36508,-4.45999)">
    <path
       style="fill:#4c566a;fill-opacity:1;stroke:#000000;stroke-width:0.264583px;stroke-linecap:butt;stroke-linejoin:miter;stroke-opacity:1"
       d="M -11.172953,4.5923045 66.630025,208.36257 144.61726,4.6109813 Z"
       id="path1132"
       sodipodi:nodetypes="cccc" />
    <g
       id="g1110"
       transform="translate(-0.61424183)">
      <rect
         style="opacity:0.999;fill:#8fbcbb;stroke-width:0.00658027"
         id="rect28"
         width="140"
         height="26.54339"
         x="-2.6635292"
         y="19.66371" />
      <text
         xml:space="preserve"
         style="font-style:normal;font-weight:normal;font-size:10.5833px;line-height:1.25;font-family:sans-serif;letter-spacing:0px;word-spacing:0px;fill:#000000;fill-opacity:1;stroke:none;stroke-width:0.264583"
         x="41.671452"
         y="35.855114"
         id="text1028"><tspan
           sodipodi:role="line"
           id="tspan1026"
           x="41.671452"
           y="35.855114"
           style="stroke-width:0.264583">Aquisition</tspan></text>
    </g>
    <g
       id="g1115"
       transform="translate(-0.61424159,-15.505974)">
      <rect
         style="opacity:0.999;fill:#b48ead;stroke-width:0.00609215"
         id="rect28-3"
         width="120"
         height="26.543392"
         x="7.3364706"
         y="70.07798" />
      <text
         xml:space="preserve"
         style="font-style:normal;font-weight:normal;font-size:10.5833px;line-height:1.25;font-family:sans-serif;letter-spacing:0px;word-spacing:0px;fill:#000000;fill-opacity:1;stroke:none;stroke-width:0.264583"
         x="41.252876"
         y="87.295158"
         id="text1032"><tspan
           sodipodi:role="line"
           id="tspan1030"
           x="41.252876"
           y="87.295158"
           style="stroke-width:0.264583">Activation</tspan></text>
    </g>
    <g
       id="g1120"
       transform="translate(-0.61424255,-7.1410693)">
      <rect
         style="opacity:0.999;fill:#a3be8c;stroke-width:0.00556136"
         id="rect28-6"
         width="100"
         height="26.543392"
         x="17.336472"
         y="96.621368" />
      <text
         xml:space="preserve"
         style="font-style:normal;font-weight:normal;font-size:10.5833px;line-height:1.25;font-family:sans-serif;letter-spacing:0px;word-spacing:0px;fill:#000000;fill-opacity:1;stroke:none;stroke-width:0.264583"
         x="41.751553"
         y="114.05042"
         id="text1036"><tspan
           sodipodi:role="line"
           id="tspan1034"
           x="41.751553"
           y="114.05042"
           style="stroke-width:0.264583">Rétention</tspan></text>
    </g>
    <rect
       style="opacity:0.999;fill:#ebcb8b;stroke-width:0.00497421"
       id="rect28-7"
       width="80"
       height="26.543392"
       x="26.722229"
       y="124.3886" />
    <rect
       style="opacity:0.999;fill:#d08770;stroke-width:0.00430781"
       id="rect28-5"
       width="60"
       height="26.543392"
       x="36.722229"
       y="159.29691" />
    <text
       xml:space="preserve"
       style="font-style:normal;font-weight:normal;font-size:10.5833px;line-height:1.25;font-family:sans-serif;letter-spacing:0px;word-spacing:0px;fill:#000000;fill-opacity:1;stroke:none;stroke-width:0.264583"
       x="43.914909"
       y="176.3513"
       id="text1040"><tspan
         sodipodi:role="line"
         id="tspan1038"
         x="43.914909"
         y="176.3513"
         style="stroke-width:0.264583">Revenus</tspan></text>
    <text
       xml:space="preserve"
       style="font-style:normal;font-weight:normal;font-size:10.5833px;line-height:1.25;font-family:sans-serif;letter-spacing:0px;word-spacing:0px;fill:#000000;fill-opacity:1;stroke:none;stroke-width:0.264583"
       x="39.83765"
       y="141.81766"
       id="text1044"><tspan
         sodipodi:role="line"
         id="tspan1042"
         x="39.83765"
         y="141.81766"
         style="stroke-width:0.264583">Réference</tspan></text>
    <rect
       style="opacity:0.999;fill:#b48ead;stroke-width:0.00554781"
       id="rect1072-3"
       width="173.97311"
       height="34.908005"
       x="153.11052"
       y="49.955864" />
    <rect
       style="opacity:0.999;fill:#a3be8c;stroke-width:0.00554781"
       id="rect1072-5"
       width="173.97311"
       height="34.908005"
       x="153.1105"
       y="84.863869" />
    <rect
       style="opacity:0.999;fill:#8fbcbb;stroke-width:0.0055478"
       id="rect1072"
       width="173.97311"
       height="34.908001"
       x="153.11052"
       y="15.047863" />
    <text
       xml:space="preserve"
       style="font-style:normal;font-weight:normal;font-size:10.5833px;line-height:1.25;font-family:sans-serif;letter-spacing:0px;word-spacing:0px;fill:#2e3440;fill-opacity:1;stroke:none;stroke-width:0.264583"
       x="156.3324"
       y="30.299681"
       id="text1048"><tspan
         sodipodi:role="line"
         id="tspan1046"
         x="156.3324"
         y="30.299681"
         style="fill:#2e3440;stroke-width:0.264583">Comment les clients vous</tspan><tspan
         sodipodi:role="line"
         x="156.3324"
         y="43.528805"
         style="fill:#2e3440;stroke-width:0.264583"
         id="tspan2000">trouvent et s’inscrivent ?</tspan></text>
    <rect
       style="opacity:0.999;fill:#ebcb8b;stroke-width:0.00554781"
       id="rect1072-6"
       width="173.97311"
       height="34.908005"
       x="153.11049"
       y="119.77187" />
    <text
       xml:space="preserve"
       style="font-style:normal;font-weight:normal;font-size:10.5833px;line-height:1.25;font-family:sans-serif;letter-spacing:0px;word-spacing:0px;fill:#2e3440;fill-opacity:1;stroke:none;stroke-width:0.264583"
       x="156.3324"
       y="64.338417"
       id="text1052"><tspan
         sodipodi:role="line"
         id="tspan1050"
         x="156.3324"
         y="64.338417"
         style="fill:#2e3440;stroke-width:0.264583">Comment se passe leurs </tspan><tspan
         sodipodi:role="line"
         x="156.3324"
         y="77.567543"
         style="fill:#2e3440;stroke-width:0.264583"
         id="tspan2002">premières expérience ?</tspan></text>
    <rect
       style="opacity:0.999;fill:#d08770;stroke-width:0.00554781"
       id="rect1072-2"
       width="173.97311"
       height="34.908005"
       x="153.11049"
       y="154.67987" />
    <text
       xml:space="preserve"
       style="font-style:normal;font-weight:normal;font-size:10.5833px;line-height:1.25;font-family:sans-serif;letter-spacing:0px;word-spacing:0px;fill:#2e3440;fill-opacity:1;stroke:none;stroke-width:0.264583"
       x="156.3324"
       y="97.59153"
       id="text1056"><tspan
         sodipodi:role="line"
         id="tspan1054"
         x="156.3324"
         y="97.59153"
         style="fill:#2e3440;stroke-width:0.264583">Est-ce que les clients</tspan><tspan
         sodipodi:role="line"
         x="156.3324"
         y="110.82066"
         style="fill:#2e3440;stroke-width:0.264583"
         id="tspan2004">reviennent ?</tspan></text>
    <text
       xml:space="preserve"
       style="font-style:normal;font-weight:normal;font-size:10.5833px;line-height:1.25;font-family:sans-serif;letter-spacing:0px;word-spacing:0px;fill:#2e3440;fill-opacity:1;stroke:none;stroke-width:0.264583"
       x="156.3324"
       y="168.43903"
       id="text1060"><tspan
         sodipodi:role="line"
         id="tspan1058"
         x="156.3324"
         y="168.43903"
         style="fill:#2e3440;stroke-width:0.264583">Comment les revenus sont </tspan><tspan
         sodipodi:role="line"
         x="156.3324"
         y="181.66815"
         style="fill:#2e3440;stroke-width:0.264583"
         id="tspan2006">générés ?</tspan></text>
    <text
       xml:space="preserve"
       style="font-style:normal;font-weight:normal;font-size:10.5833px;line-height:1.25;font-family:sans-serif;letter-spacing:0px;word-spacing:0px;fill:#2e3440;fill-opacity:1;stroke:none;stroke-width:0.264583"
       x="156.3324"
       y="134.99123"
       id="text1064"><tspan
         sodipodi:role="line"
         id="tspan1062"
         x="156.3324"
         y="134.99123"
         style="fill:#2e3440;stroke-width:0.264583">Les clients en parlent-ils autour </tspan><tspan
         sodipodi:role="line"
         x="156.3324"
         y="148.22035"
         style="fill:#2e3440;stroke-width:0.264583"
         id="tspan2008">d’eux ?</tspan></text>
  </g>
</svg>
