<?xml version="1.0" encoding="UTF-8" standalone="no"?>
<svg
   xmlns:dc="http://purl.org/dc/elements/1.1/"
   xmlns:cc="http://creativecommons.org/ns#"
   xmlns:rdf="http://www.w3.org/1999/02/22-rdf-syntax-ns#"
   xmlns:svg="http://www.w3.org/2000/svg"
   xmlns="http://www.w3.org/2000/svg"
   xmlns:sodipodi="http://sodipodi.sourceforge.net/DTD/sodipodi-0.dtd"
   xmlns:inkscape="http://www.inkscape.org/namespaces/inkscape"
   version="1.1"
   id="svg3079"
   xml:space="preserve"
   width="1491.3788"
   height="704.00037"
   viewBox="0 0 1491.3788 704.00035"
   sodipodi:docname="value-proposition-design-fr-clients.svg"
   inkscape:version="1.0.1 (3bc2e813f5, 2020-09-07)">
  <metadata
   id="metadata3085">
    <rdf:RDF>
      <cc:Work
   rdf:about="">
        <dc:format>image/svg+xml</dc:format>
        <dc:type
   rdf:resource="http://purl.org/dc/dcmitype/StillImage" />
        <dc:title></dc:title>
      </cc:Work>
    </rdf:RDF>
  </metadata>
  <defs
   id="defs3083">
    <clipPath
   clipPathUnits="userSpaceOnUse"
   id="clipPath3097">
      <path
   d="M 0,841.89 H 1190.55 V 0 H 0 Z"
   id="path3095"
   inkscape:connector-curvature="0" />
    </clipPath>
    <clipPath
   clipPathUnits="userSpaceOnUse"
   id="clipPath3421">
      <path
   d="M 0,841.89 H 1190.55 V 0 H 0 Z"
   id="path3419"
   inkscape:connector-curvature="0" />
    </clipPath>
    <clipPath
   clipPathUnits="userSpaceOnUse"
   id="clipPath3459">
      <path
   d="M 0,841.89 H 1190.55 V 0 H 0 Z"
   id="path3457"
   inkscape:connector-curvature="0" />
    </clipPath>
  
      
      
    
      
      
      
      
      
      
    </defs>
  <sodipodi:namedview
   inkscape:guide-bbox="true"
   showguides="true"
   pagecolor="#ffffff"
   bordercolor="#666666"
   inkscape:document-rotation="0"
   borderopacity="1"
   objecttolerance="10"
   gridtolerance="10"
   guidetolerance="10"
   inkscape:pageopacity="0"
   inkscape:pageshadow="2"
   inkscape:window-width="1920"
   inkscape:window-height="1016"
   id="namedview3081"
   showgrid="false"
   inkscape:zoom="0.49497475"
   inkscape:cx="1065.0782"
   inkscape:cy="249.33783"
   inkscape:window-x="0"
   inkscape:window-y="27"
   inkscape:window-maximized="1"
   inkscape:current-layer="g3087"
   fit-margin-top="0"
   fit-margin-left="0"
   fit-margin-right="0"
   fit-margin-bottom="0" />
  <g
   id="g3087"
   inkscape:groupmode="layer"
   inkscape:label="poster-value-proposition-design"
   transform="matrix(1.3333333,0,0,-1.3333333,-47.999999,865.72038)">
    
    <path
   inkscape:connector-curvature="0"
   id="path3103"
   style="opacity:1;fill:none;stroke:#231f20;stroke-width:4.564;stroke-linecap:butt;stroke-linejoin:miter;stroke-miterlimit:4;stroke-dasharray:none;stroke-opacity:1;stop-opacity:1"
   d="M 38.282,123.572 H 561.718 V 647.008 H 38.282 Z" />
    
    <g
   style="opacity:1;stop-opacity:1;fill:#bf616a"
   transform="translate(890.5341,123.5723)"
   id="g3109">
      <path
   inkscape:connector-curvature="0"
   id="path3111"
   style="fill:#bf616a;stroke:#231f20;stroke-width:4.564;stroke-linecap:butt;stroke-linejoin:miter;stroke-miterlimit:4;stroke-dasharray:none;stroke-opacity:1"
   d="M 0,0 C 144.312,0 261.718,117.406 261.718,261.718 261.718,406.029 144.312,523.436 0,523.436 -144.312,523.436 -261.718,406.029 -261.718,261.718 -261.718,117.406 -144.312,0 0,0 Z" />
    </g>
    <g
   style="opacity:1;stop-opacity:1"
   transform="translate(37,648.2902)"
   id="g3113">
      <path
   inkscape:connector-curvature="0"
   id="path3115"
   style="fill:none;stroke:#231f20;stroke-width:2.017;stroke-linecap:butt;stroke-linejoin:miter;stroke-miterlimit:4;stroke-dasharray:none;stroke-opacity:1"
   d="M 0,0 263,-261.963" />
    </g>
    <g
   style="opacity:1;stop-opacity:1"
   transform="translate(37,122.2902)"
   id="g3117">
      <path
   inkscape:connector-curvature="0"
   id="path3119"
   style="fill:none;stroke:#231f20;stroke-width:2.017;stroke-linecap:butt;stroke-linejoin:miter;stroke-miterlimit:4;stroke-dasharray:none;stroke-opacity:1"
   d="M 0,0 263,264.028" />
    </g>
    <g
   style="opacity:1;stop-opacity:1"
   transform="translate(1097.5273,165.442)"
   id="g3121" />
    <g
   style="opacity:1;stop-opacity:1"
   transform="translate(1097.5273,165.442)"
   id="g3123" />
    <g
   style="opacity:1;stop-opacity:1"
   transform="translate(890.5341,386.3271)"
   id="g3125">
      <path
   inkscape:connector-curvature="0"
   id="path3127"
   style="fill:none;stroke:#231f20;stroke-width:2.017;stroke-linecap:butt;stroke-linejoin:miter;stroke-miterlimit:4;stroke-dasharray:none;stroke-opacity:1"
   d="M 0,0 H -289.259" />
    </g>
    <g
   style="opacity:1;stop-opacity:1"
   transform="translate(589.2585,386.3271)"
   id="g3129">
      <path
   inkscape:connector-curvature="0"
   id="path3131"
   style="fill:none;stroke:#231f20;stroke-width:2.017;stroke-linecap:butt;stroke-linejoin:miter;stroke-miterlimit:4;stroke-dasharray:none;stroke-opacity:1"
   d="M 0,0 H -289.259" />
    </g>
    <g
   style="opacity:1;stop-opacity:1"
   transform="translate(584.5195,391.5946)"
   id="g3133">
      <path
   inkscape:connector-curvature="0"
   id="path3135"
   style="fill:#231f20;fill-opacity:1;fill-rule:nonzero;stroke:none"
   d="m 0,0 v -10.552 l 7.93,5.276 z" />
    </g>
    <g
   style="opacity:1;stop-opacity:1"
   transform="translate(606.0317,391.5946)"
   id="g3137">
      <path
   inkscape:connector-curvature="0"
   id="path3139"
   style="fill:#231f20;fill-opacity:1;fill-rule:nonzero;stroke:none"
   d="m 0,0 v -10.552 l -7.93,5.276 z" />
    </g>
    <g
   style="opacity:1;stop-opacity:1"
   transform="translate(300.0718,421.8129)"
   id="g3141" />
    <text
   id="text3145"
   style="font-variant:normal;font-weight:normal;font-stretch:normal;font-size:16px;font-family:'ARS Maquette Pro';-inkscape-font-specification:ARSMaquettePro-Regular;writing-mode:lr-tb;opacity:1;fill:#4c566a;fill-opacity:1;fill-rule:nonzero;stroke:none;stop-opacity:1"
   transform="scale(1,-1)"
   x="291.92352"
   y="-533.18201"><tspan
     id="tspan3143"
     sodipodi:role="line"
     x="291.92352"
     y="-533.18201">Créateurs de bénéfices</tspan></text>
    <text
   id="text3149"
   style="font-variant:normal;font-weight:normal;font-stretch:normal;font-size:16px;font-family:'ARS Maquette Pro';-inkscape-font-specification:ARSMaquettePro-Regular;writing-mode:lr-tb;opacity:1;fill:#4c566a;fill-opacity:1;fill-rule:nonzero;stroke:none;stop-opacity:1"
   transform="scale(1,-1)"
   x="283.82907"
   y="-267.32541"><tspan
     id="tspan3147"
     sodipodi:role="line"
     x="283.82907"
     y="-267.32541">Solutions aux problèmes</tspan></text>
    <text
   id="text3153"
   style="font-variant:normal;font-weight:normal;font-stretch:normal;font-size:16px;font-family:'ARS Maquette Pro';-inkscape-font-specification:ARSMaquettePro-Regular;writing-mode:lr-tb;opacity:1;fill:#eceff4;fill-opacity:1;fill-rule:nonzero;stroke:none;stop-opacity:1;"
   transform="scale(1,-1)"
   x="765.57245"
   y="-267.32541"><tspan
     id="tspan3151"
     sodipodi:role="line"
     x="765.57245"
     y="-267.32541">Problèmes</tspan></text>
    <text
   id="text3157"
   style="font-variant:normal;font-weight:normal;font-stretch:normal;font-size:16px;font-family:'ARS Maquette Pro';-inkscape-font-specification:ARSMaquettePro-Regular;writing-mode:lr-tb;opacity:1;fill:#eceff4;fill-opacity:1;fill-rule:nonzero;stroke:none;stop-opacity:1;"
   transform="scale(1,-1)"
   x="769.15045"
   y="-533.18201"><tspan
     id="tspan3155"
     sodipodi:role="line"
     x="769.15045"
     y="-533.18201">Bénéfices</tspan></text>
    <text
   id="text3161"
   style="font-variant:normal;font-weight:normal;font-stretch:normal;font-size:16px;font-family:'ARS Maquette Pro';-inkscape-font-specification:ARSMaquettePro-Regular;writing-mode:lr-tb;opacity:1;fill:#4c566a;fill-opacity:1;fill-rule:nonzero;stroke:none;stop-opacity:1"
   transform="scale(1,-1)"
   x="99.856079"
   y="-410.62589"><tspan
     id="tspan3159"
     sodipodi:role="line"
     x="99.856079"
     y="-410.62589">Produits</tspan></text>
    <text
   id="text3165"
   style="font-variant:normal;font-weight:normal;font-stretch:normal;font-size:16px;font-family:'ARS Maquette Pro';-inkscape-font-specification:ARSMaquettePro-Regular;writing-mode:lr-tb;opacity:1;fill:#4c566a;fill-opacity:1;fill-rule:nonzero;stroke:none;stop-opacity:1"
   transform="scale(1,-1)"
   x="96.314697"
   y="-392.62589"><tspan
     id="tspan3163"
     sodipodi:role="line"
     y="-392.62589"
     x="96.314697 107.0667 111.3867 121.0667 130.4427 136.7307 145.2907 149.1787 157.65871 167.0347">&amp; Services</tspan></text>
    <text
   id="text3173"
   style="font-variant:normal;font-weight:normal;font-stretch:normal;font-size:16px;font-family:'ARS Maquette Pro';-inkscape-font-specification:ARSMaquettePro-Regular;writing-mode:lr-tb;opacity:1;fill:#eceff4;fill-opacity:1;fill-rule:nonzero;stroke:none;stop-opacity:1;"
   transform="scale(1,-1)"
   x="1010.2377"
   y="-392.62589"><tspan
     id="tspan3171"
     sodipodi:role="line"
     x="1010.2377"
     y="-392.62589">Aspirations</tspan></text>
    
    
    
    
    
    
    
    
    
    
    
    
    
    
    
    
    
    
    
    
    
    
    
    
    
    
    
    
    
    <g
   style="opacity:1;fill:#eceff4;stop-opacity:1"
   transform="translate(814.2759,244.9073)"
   id="g3281">
      <path
   inkscape:connector-curvature="0"
   id="path3283"
   style="fill:#eceff4;fill-opacity:1;fill-rule:nonzero;stroke:none"
   d="M 0,0 C 1.602,0 2.901,1.299 2.901,2.901 2.901,4.504 1.603,5.803 0,5.803 -1.603,5.803 -2.901,4.504 -2.901,2.901 -2.901,1.299 -1.603,0 0,0 m -12.945,0 c 1.603,0 2.902,1.299 2.902,2.901 0,1.603 -1.299,2.902 -2.902,2.902 -1.602,0 -2.901,-1.299 -2.901,-2.902 0,-1.602 1.299,-2.901 2.901,-2.901 m 6.472,-5.803 c -8.7,0 -10.043,-8.481 -10.043,-8.481 h 3.794 c 0,0 0.893,4.91 6.249,4.91 5.357,0 6.249,-4.91 6.249,-4.91 H 3.57 c 0,0 -1.342,8.481 -10.043,8.481" />
    </g>
    <g
   style="opacity:1;fill:#eceff4;stop-opacity:1"
   transform="translate(801.4493,511.1405)"
   id="g3285">
      <path
   inkscape:connector-curvature="0"
   id="path3287"
   style="fill:#eceff4;fill-opacity:1;fill-rule:nonzero;stroke:none"
   d="M 0,0 C 1.573,0 2.848,1.275 2.848,2.848 2.848,4.422 1.573,5.697 0,5.697 -1.573,5.697 -2.848,4.422 -2.848,2.848 -2.848,1.275 -1.572,0 0,0 m 12.708,0 c 1.573,0 2.848,1.275 2.848,2.848 0,1.574 -1.275,2.849 -2.848,2.849 C 11.135,5.697 9.859,4.422 9.859,2.848 9.859,1.275 11.135,0 12.708,0 m 2.629,-6.135 c 0,0 -1.534,-6.573 -8.983,-6.573 -7.449,0 -8.983,6.573 -8.983,6.573 h -3.725 c 0,0 2.301,-10.079 12.708,-10.079 10.297,0 12.707,10.079 12.707,10.079 z" />
    </g>
    <g
   style="opacity:1;fill:#eceff4;stop-opacity:1"
   id="g3698">
      <g
   id="g3289"
   transform="translate(1037.5228,366.8432)"
   style="opacity:1;fill:#eceff4;stop-opacity:1">
        <path
   d="m 0,0 -3.751,3.752 1.918,1.919 1.722,-1.722 5.641,6.31 2.022,-1.808 z"
   style="fill:#eceff4;fill-opacity:1;fill-rule:nonzero;stroke:none"
   id="path3291"
   inkscape:connector-curvature="0" />
      </g>
      <g
   id="g3293"
   transform="translate(1037.5228,353.952)"
   style="opacity:1;fill:#eceff4;stop-opacity:1">
        <path
   d="m 0,0 -3.751,3.752 1.918,1.918 1.722,-1.721 5.64,6.31 2.024,-1.807 z"
   style="fill:#eceff4;fill-opacity:1;fill-rule:nonzero;stroke:none"
   id="path3295"
   inkscape:connector-curvature="0" />
      </g>
      <g
   id="g3297"
   transform="translate(1039.1674,339.9001)"
   style="opacity:1;fill:#eceff4;stop-opacity:1">
        <path
   d="m 0,0 c -2.805,0 -5.089,2.283 -5.089,5.089 0,2.805 2.284,5.088 5.089,5.088 2.805,0 5.089,-2.283 5.089,-5.088 C 5.089,2.283 2.805,0 0,0 m 0,7.463 c -1.309,0 -2.375,-1.065 -2.375,-2.374 0,-1.31 1.066,-2.375 2.375,-2.375 1.309,0 2.375,1.065 2.375,2.375 0,1.309 -1.066,2.374 -2.375,2.374"
   style="fill:#eceff4;fill-opacity:1;fill-rule:nonzero;stroke:none"
   id="path3299"
   inkscape:connector-curvature="0" />
      </g>
      <path
   d="m 1075.274,368.736 h -25.329 v 4.07 h 25.329 z"
   style="opacity:1;fill:#eceff4;fill-opacity:1;fill-rule:nonzero;stroke:none;stop-opacity:1"
   id="path3301"
   inkscape:connector-curvature="0" />
      <path
   d="m 1075.274,355.843 h -25.329 v 4.071 h 25.329 z"
   style="opacity:1;fill:#eceff4;fill-opacity:1;fill-rule:nonzero;stroke:none;stop-opacity:1"
   id="path3303"
   inkscape:connector-curvature="0" />
      <path
   d="m 1075.274,342.952 h -25.329 v 4.071 h 25.329 z"
   style="opacity:1;fill:#eceff4;fill-opacity:1;fill-rule:nonzero;stroke:none;stop-opacity:1"
   id="path3305"
   inkscape:connector-curvature="0" />
    </g>
    <path
   inkscape:connector-curvature="0"
   id="path3307"
   style="opacity:1;fill:#ffffff;fill-opacity:1;fill-rule:nonzero;stroke:none;stop-opacity:1"
   d="m 261.556,391.604 h 76.888 v 13.261 h -76.888 z" />
    <path
   inkscape:connector-curvature="0"
   id="path3309"
   style="opacity:1;fill:#000000;fill-opacity:1;fill-rule:nonzero;stroke:none;stop-opacity:1"
   d="m 259.837,389.863 h 80.326 v 16.744 h -80.326 z m 76.889,3.483 h -73.452 v 9.779 h 73.452 z" />
    <g
   style="opacity:1;stop-opacity:1"
   transform="translate(265.319,390.2679)"
   id="g3311">
      <path
   inkscape:connector-curvature="0"
   id="path3313"
   style="fill:#ffffff;fill-opacity:1;fill-rule:nonzero;stroke:none"
   d="M 0,0 V -46.524 H 68.053 V 0" />
    </g>
    <g
   style="opacity:1;stop-opacity:1"
   transform="translate(263.6007,342.0026)"
   id="g3315">
      <path
   inkscape:connector-curvature="0"
   id="path3317"
   style="fill:#000000;fill-opacity:1;fill-rule:nonzero;stroke:none"
   d="M 0,0 H 71.49 V 48.265 H 68.053 V 3.483 H 3.437 V 48.265 H 0 Z" />
    </g>
    <path
   inkscape:connector-curvature="0"
   id="path3319"
   style="opacity:1;fill:#000000;fill-opacity:1;fill-rule:nonzero;stroke:none;stop-opacity:1"
   d="m 297.628,342.568 h 3.437 v 62.702 h -3.437 z" />
    <g
   style="opacity:1;stop-opacity:1"
   transform="translate(299.7782,409.6852)"
   id="g3321">
      <path
   inkscape:connector-curvature="0"
   id="path3323"
   style="fill:#ffffff;fill-opacity:1;fill-rule:nonzero;stroke:none"
   d="m 0,0 h 8.725 c 4.925,0 8.872,3.909 8.872,8.899 0,4.99 -3.852,8.899 -8.776,8.899 C 3.896,17.798 0,13.844 0,8.854 Z" />
    </g>
    <g
   style="opacity:1;stop-opacity:1"
   transform="translate(298.0594,407.944)"
   id="g3325">
      <path
   inkscape:connector-curvature="0"
   id="path3327"
   style="fill:#000000;fill-opacity:1;fill-rule:nonzero;stroke:none"
   d="m 0,0 h 10.444 c 5.938,0 10.59,4.674 10.59,10.641 0,5.966 -4.61,10.64 -10.495,10.64 C 4.63,21.281 0,16.587 0,10.595 Z m 10.539,17.798 c 3.958,0 7.058,-3.144 7.058,-7.157 0,-4.014 -3.142,-7.158 -7.153,-7.158 H 3.437 v 7.112 c 0,4.039 3.119,7.203 7.102,7.203" />
    </g>
    <g
   style="opacity:1;stop-opacity:1"
   transform="translate(299.3517,409.6852)"
   id="g3329">
      <path
   inkscape:connector-curvature="0"
   id="path3331"
   style="fill:#ffffff;fill-opacity:1;fill-rule:nonzero;stroke:none"
   d="m 0,0 h -8.725 c -4.925,0 -8.872,3.909 -8.872,8.899 0,4.99 3.852,8.899 8.776,8.899 C -3.896,17.798 0,13.844 0,8.854 Z" />
    </g>
    <g
   style="opacity:1;stop-opacity:1"
   transform="translate(290.6259,407.944)"
   id="g3333">
      <path
   inkscape:connector-curvature="0"
   id="path3335"
   style="fill:#000000;fill-opacity:1;fill-rule:nonzero;stroke:none"
   d="m 0,0 h 10.444 v 10.595 c 0,5.992 -4.629,10.686 -10.539,10.686 -5.885,0 -10.495,-4.674 -10.495,-10.64 C -10.59,4.674 -5.937,0 0,0 M 7.007,3.483 H 0 c -4.011,0 -7.153,3.144 -7.153,7.158 0,4.013 3.101,7.157 7.058,7.157 3.983,0 7.102,-3.164 7.102,-7.203 z" />
    </g>
    <g
   style="opacity:1;fill:#4c566a;stop-opacity:1"
   transform="translate(372.9773,482.011)"
   id="g3337">
      <path
   inkscape:connector-curvature="0"
   id="path3339"
   style="fill:#4c566a;fill-opacity:1;fill-rule:nonzero;stroke:none"
   d="m 0,0 -3.261,3.261 14.138,14.137 6.559,-6.559 6.816,6.817 3.261,-3.261 -10.077,-10.078 -6.559,6.559 z" />
    </g>
    <g
   style="opacity:1;fill:#4c566a;stop-opacity:1"
   transform="translate(404.1351,472.8902)"
   id="g3345">
      <path
   inkscape:connector-curvature="0"
   id="path3347"
   style="fill:#4c566a;fill-opacity:1;fill-rule:nonzero;stroke:none"
   d="m 0,0 h -43.048 v 44.073 h 3.074 V 3.075 H 0 Z" />
    </g>
    <path
   inkscape:connector-curvature="0"
   id="path3349"
   style="opacity:1;fill:#4c566a;fill-opacity:1;fill-rule:nonzero;stroke:none;stop-opacity:1"
   d="m 366.691,508.764 h -3.523 v 3.075 h 3.523 z" />
    <path
   inkscape:connector-curvature="0"
   id="path3351"
   style="opacity:1;fill:#4c566a;fill-opacity:1;fill-rule:nonzero;stroke:none;stop-opacity:1"
   d="m 366.691,499.539 h -3.523 v 3.075 h 3.523 z" />
    <g
   style="fill:#4c566a"
   id="g4866">
      <g
   id="g3341"
   transform="translate(402.0814,492.1501)"
   style="opacity:1;fill:#4c566a;stop-opacity:1">
        <path
   d="M 0,0 3.332,12.439 -9.107,9.107 Z"
   style="fill:#4c566a;fill-opacity:1;fill-rule:nonzero;stroke:none"
   id="path3343"
   inkscape:connector-curvature="0" />
      </g>
      <path
   d="m 366.691,490.315 h -3.523 v 3.075 h 3.523 z"
   style="opacity:1;fill:#4c566a;fill-opacity:1;fill-rule:nonzero;stroke:none;stop-opacity:1"
   id="path3353"
   inkscape:connector-curvature="0" />
    </g>
    <path
   inkscape:connector-curvature="0"
   id="path3355"
   style="opacity:1;fill:#4c566a;fill-opacity:1;fill-rule:nonzero;stroke:none;stop-opacity:1"
   d="m 366.691,481.09 h -3.523 v 3.075 h 3.523 z" />
    <g
   style="opacity:1;fill:#4c566a;stop-opacity:1"
   id="g3687">
      <g
   id="g3357"
   transform="translate(394.2461,208.4527)"
   style="opacity:1;fill:#4c566a;stop-opacity:1">
        <path
   d="M 0,0 C -2.992,0 -5.798,1.158 -7.901,3.261 L -29.919,25.28 c -2.103,2.102 -3.262,4.908 -3.262,7.9 0,2.992 1.159,5.798 3.262,7.901 2.101,2.102 4.907,3.26 7.899,3.26 2.992,0 5.797,-1.158 7.9,-3.26 L 7.901,19.061 c 4.355,-4.356 4.355,-11.445 0,-15.8 C 5.797,1.158 2.992,0 0,0 m -22.02,41.627 c -2.267,0 -4.39,-0.876 -5.981,-2.465 -1.59,-1.59 -2.466,-3.715 -2.466,-5.982 0,-2.267 0.876,-4.391 2.466,-5.981 L -5.982,5.179 C -4.392,3.589 -2.267,2.714 0,2.714 c 2.267,0 4.392,0.875 5.982,2.465 3.297,3.298 3.297,8.665 0,11.963 l -22.02,22.02 c -1.591,1.589 -3.715,2.465 -5.982,2.465"
   style="fill:#4c566a;fill-opacity:1;fill-rule:nonzero;stroke:none"
   id="path3359"
   inkscape:connector-curvature="0" />
      </g>
      <g
   id="g3361"
   transform="translate(378.5262,221.4512)"
   style="opacity:1;fill:#4c566a;stop-opacity:1">
        <path
   d="m 0,0 -13.241,13.241 c -3.817,3.817 -3.817,10.064 0,13.881 3.818,3.818 10.065,3.818 13.882,0 l 13.241,-13.24 z"
   style="fill:#4c566a;fill-opacity:1;fill-rule:nonzero;stroke:none"
   id="path3363"
   inkscape:connector-curvature="0" />
      </g>
    </g>
    <g
   style="fill:#4c566a"
   id="g4884">
      <path
   d="m 102.643,346.806 h -5.157 v 30.297 h 5.157 z"
   style="opacity:1;fill:#4c566a;fill-opacity:1;fill-rule:nonzero;stroke:none;stop-opacity:1"
   id="path3365"
   inkscape:connector-curvature="0" />
      <path
   d="m 125.849,346.806 h -5.157 v 30.297 h 5.157 z"
   style="opacity:1;fill:#4c566a;fill-opacity:1;fill-rule:nonzero;stroke:none;stop-opacity:1"
   id="path3367"
   inkscape:connector-curvature="0" />
      <path
   d="m 107.477,346.806 h -2.256 v 30.297 h 2.256 z"
   style="opacity:1;fill:#4c566a;fill-opacity:1;fill-rule:nonzero;stroke:none;stop-opacity:1"
   id="path3369"
   inkscape:connector-curvature="0" />
      <path
   d="m 113.601,346.806 h -5.157 v 30.297 h 5.157 z"
   style="opacity:1;fill:#4c566a;fill-opacity:1;fill-rule:nonzero;stroke:none;stop-opacity:1"
   id="path3371"
   inkscape:connector-curvature="0" />
      <path
   d="m 118.758,346.806 h -2.578 v 30.297 h 2.578 z"
   style="opacity:1;fill:#4c566a;fill-opacity:1;fill-rule:nonzero;stroke:none;stop-opacity:1"
   id="path3373"
   inkscape:connector-curvature="0" />
      <path
   d="m 131.65,346.806 h -2.578 v 30.297 h 2.578 z"
   style="opacity:1;fill:#4c566a;fill-opacity:1;fill-rule:nonzero;stroke:none;stop-opacity:1"
   id="path3375"
   inkscape:connector-curvature="0" />
      <g
   id="g3377"
   transform="translate(152.8359,363.5444)"
   style="opacity:1;fill:#4c566a;stop-opacity:1">
        <path
   d="M 0,0 C 0,1.792 -1.453,3.244 -3.245,3.244 -5.036,3.244 -6.489,1.792 -6.489,0 Z"
   style="fill:#4c566a;fill-opacity:1;fill-rule:nonzero;stroke:none"
   id="path3379"
   inkscape:connector-curvature="0" />
      </g>
      <g
   id="g3381"
   transform="translate(142.6083,362.7838)"
   style="opacity:1;fill:#4c566a;stop-opacity:1">
        <path
   d="M 0,0 V 14.319 H -5.157 V -3.367 C -3.651,-1.97 -1.917,-0.816 0,0"
   style="fill:#4c566a;fill-opacity:1;fill-rule:nonzero;stroke:none"
   id="path3383"
   inkscape:connector-curvature="0" />
      </g>
      <g
   id="g3385"
   transform="translate(165.9216,340.36)"
   style="opacity:1;fill:#4c566a;stop-opacity:1">
        <path
   d="m 0,0 h -32.66 c -1.424,0 -2.579,1.155 -2.579,2.578 0,1.424 1.155,2.579 2.579,2.579 H 0 C 1.424,5.157 2.578,4.002 2.578,2.578 2.578,1.155 1.424,0 0,0"
   style="fill:#4c566a;fill-opacity:1;fill-rule:nonzero;stroke:none"
   id="path3387"
   inkscape:connector-curvature="0" />
      </g>
      <g
   id="g3389"
   transform="translate(136.1621,358.0944)"
   style="opacity:1;fill:#4c566a;stop-opacity:1">
        <path
   d="M 0,0 V 19.008 H -2.578 V -3.843 C -1.885,-2.449 -1.018,-1.159 0,0"
   style="fill:#4c566a;fill-opacity:1;fill-rule:nonzero;stroke:none"
   id="path3391"
   inkscape:connector-curvature="0" />
      </g>
      <g
   id="g3393"
   transform="translate(149.5916,361.6264)"
   style="opacity:1;fill:#4c566a;stop-opacity:1">
        <path
   d="M 0,0 C -8.007,0 -14.599,-6.18 -15.256,-14.02 H 15.256 C 14.599,-6.18 8.007,0 0,0"
   style="fill:#4c566a;fill-opacity:1;fill-rule:nonzero;stroke:none"
   id="path3395"
   inkscape:connector-curvature="0" />
      </g>
    </g>
    
    
    
    
    <g
   id="g3427"
   transform="translate(890.5342,386.3271)">
        <path
   d="M 0,0 184.026,184.018"
   style="fill:none;stroke:#231f20;stroke-width:2.017;stroke-linecap:butt;stroke-linejoin:miter;stroke-miterlimit:4;stroke-dasharray:none;stroke-opacity:1"
   id="path3429"
   inkscape:connector-curvature="0" />
      </g><g
   id="g3431"
   transform="translate(890.5341,386.6225)">
        <path
   d="M 0,0 184.027,-184.027"
   style="fill:none;stroke:#231f20;stroke-width:2.017;stroke-linecap:butt;stroke-linejoin:miter;stroke-miterlimit:4;stroke-dasharray:none;stroke-opacity:1"
   id="path3433"
   inkscape:connector-curvature="0" />
      </g><g
   id="g3435"
   transform="translate(860.0468,362.1504)"
   style="fill:#eceff4">
        <path
   d="m 0,0 c 3.706,-4.883 8.514,-9.006 14.287,-11.876 22.349,-11.11 49.285,-0.236 57.545,23.232 6.812,19.353 -2.056,41.117 -20.486,50.28 C 28.998,72.747 2.062,61.872 -6.199,38.405 l -6.648,-16.383 c -0.897,-2.165 0.149,-4.666 2.323,-5.558 l 3.311,-1.36 c 0.788,-3.163 1.902,-6.239 3.404,-9.133 L 9.911,5.19 Z"
   style="fill:#eceff4;fill-opacity:1;fill-rule:nonzero;stroke:none"
   id="path3437"
   inkscape:connector-curvature="0" />
      </g><g
   id="g3439"
   transform="translate(892.846,344.1713)">
        <path
   d="m 0,0 h -0.001 c -6.714,0.001 -13.203,1.534 -19.285,4.559 -5.864,2.914 -10.875,7.08 -14.897,12.379 l -1.231,1.622 6.189,3.241 -8.47,0.483 -0.454,0.874 c -1.376,2.654 -2.494,5.563 -3.326,8.658 l -2.509,1.031 c -3.063,1.259 -4.529,4.762 -3.265,7.811 l 6.643,16.372 c 6.028,17.129 22.372,28.688 40.642,28.688 6.713,0 13.202,-1.533 19.285,-4.559 C 38.627,71.562 47.805,49.037 40.67,28.764 34.615,11.56 18.269,0 0,0 m -30.14,17.421 c 3.462,-4.116 7.626,-7.399 12.403,-9.774 5.598,-2.782 11.565,-4.194 17.736,-4.195 16.799,0 31.828,10.631 37.397,26.454 6.56,18.636 -1.877,39.342 -19.624,48.165 -5.598,2.783 -11.565,4.195 -17.736,4.195 -16.799,0 -31.828,-10.631 -37.397,-26.453 l -6.678,-16.458 c -0.538,-1.302 0.082,-2.784 1.378,-3.317 l 4.121,-1.692 0.211,-0.847 c 0.7,-2.812 1.648,-5.458 2.823,-7.882 l 18.954,-1.079 z"
   style="fill:#000000;fill-opacity:1;fill-rule:nonzero;stroke:none"
   id="path3441"
   inkscape:connector-curvature="0" />
      </g><g
   id="g3443"
   transform="translate(873.5424,395.845)">
        <path
   d="m 0,0 c -0.536,-2.468 -3.346,-3.603 -5.457,-2.203 -1.173,0.777 -1.775,2.255 -1.478,3.626 0.536,2.468 3.346,3.602 5.458,2.203 C -0.304,2.848 0.298,1.371 0,0"
   style="fill:#000000;fill-opacity:1;fill-rule:nonzero;stroke:none"
   id="path3445"
   inkscape:connector-curvature="0" />
      </g>
    
    
    
  </g>
</svg>
