<?xml version="1.0" encoding="UTF-8" standalone="no"?>
<svg
   xmlns:dc="http://purl.org/dc/elements/1.1/"
   xmlns:cc="http://creativecommons.org/ns#"
   xmlns:rdf="http://www.w3.org/1999/02/22-rdf-syntax-ns#"
   xmlns:svg="http://www.w3.org/2000/svg"
   xmlns="http://www.w3.org/2000/svg"
   xmlns:sodipodi="http://sodipodi.sourceforge.net/DTD/sodipodi-0.dtd"
   xmlns:inkscape="http://www.inkscape.org/namespaces/inkscape"
   version="1.1"
   id="svg2"
   xml:space="preserve"
   width="2245.3333"
   height="1586.6667"
   viewBox="0 0 2245.3333 1586.6667"
   sodipodi:docname="pirate-metrics-canvas.svg"
   inkscape:version="1.0.1 (3bc2e813f5, 2020-09-07)"><metadata
     id="metadata8"><rdf:RDF><cc:Work
         rdf:about=""><dc:format>image/svg+xml</dc:format><dc:type
           rdf:resource="http://purl.org/dc/dcmitype/StillImage" /><dc:title></dc:title></cc:Work></rdf:RDF></metadata><defs
     id="defs6"><clipPath
       clipPathUnits="userSpaceOnUse"
       id="clipPath24"><path
         d="m 1528,20 h 128 v 42 h -128 z"
         id="path22" /></clipPath><clipPath
       clipPathUnits="userSpaceOnUse"
       id="clipPath50"><path
         d="m 1528,62 h 128 V 20 h -128 z"
         clip-rule="evenodd"
         id="path48" /></clipPath><clipPath
       clipPathUnits="userSpaceOnUse"
       id="clipPath56"><path
         d="M 0,0 H 1684 V 1190 H 0 Z"
         id="path54" /></clipPath><clipPath
       clipPathUnits="userSpaceOnUse"
       id="clipPath68"><path
         d="M 28,1106 H 1656 V 83 H 28 Z"
         id="path66" /></clipPath><clipPath
       clipPathUnits="userSpaceOnUse"
       id="clipPath74"><path
         d="M 0,0 H 1684 V 1190 H 0 Z"
         id="path72" /></clipPath><clipPath
       clipPathUnits="userSpaceOnUse"
       id="clipPath84"><path
         d="M 0,0 H 1684 V 1190 H 0 Z"
         id="path82" /></clipPath><clipPath
       clipPathUnits="userSpaceOnUse"
       id="clipPath104"><path
         d="M 130.6094,1112 C 215.3244,974.7022 258.0454,836.2545 258.7724,696.657 259.4995,557.0595 218.2474,413.4539 135.0162,265.84 H -30 V 1116 Z"
         id="path102" /></clipPath><clipPath
       clipPathUnits="userSpaceOnUse"
       id="clipPath110"><path
         d="M 0,0 H 1684 V 1190 H 0 Z"
         id="path108" /></clipPath><clipPath
       clipPathUnits="userSpaceOnUse"
       id="clipPath120"><path
         d="m 1324.609,1112 c 84.715,-137.2978 127.436,-275.7455 128.163,-415.343 0.727,-139.5975 -40.525,-283.2031 -123.756,-430.817 H 1704 V 1116 Z"
         id="path118" /></clipPath><clipPath
       clipPathUnits="userSpaceOnUse"
       id="clipPath126"><path
         d="M 0,0 H 1684 V 1190 H 0 Z"
         id="path124" /></clipPath><clipPath
       clipPathUnits="userSpaceOnUse"
       id="clipPath136"><path
         d="M 0,0 H 1684 V 1190 H 0 Z"
         id="path134" /></clipPath><clipPath
       clipPathUnits="userSpaceOnUse"
       id="clipPath176"><path
         d="m 832,1166 h 324 v -44 H 832 Z"
         id="path174" /></clipPath><clipPath
       clipPathUnits="userSpaceOnUse"
       id="clipPath182"><path
         d="M 0,0 H 1684 V 1190 H 0 Z"
         id="path180" /></clipPath><clipPath
       clipPathUnits="userSpaceOnUse"
       id="clipPath192"><path
         d="m 1166,1166 h 324 v -44 h -324 z"
         id="path190" /></clipPath><clipPath
       clipPathUnits="userSpaceOnUse"
       id="clipPath198"><path
         d="M 0,0 H 1684 V 1190 H 0 Z"
         id="path196" /></clipPath><clipPath
       clipPathUnits="userSpaceOnUse"
       id="clipPath208"><path
         d="m 1500,1166 h 156 v -44 h -156 z"
         id="path206" /></clipPath><clipPath
       clipPathUnits="userSpaceOnUse"
       id="clipPath214"><path
         d="M 0,0 H 1684 V 1190 H 0 Z"
         id="path212" /></clipPath><clipPath
       clipPathUnits="userSpaceOnUse"
       id="clipPath224"><path
         d="M 0,0 H 1684 V 1190 H 0 Z"
         id="path222" /></clipPath><clipPath
       clipPathUnits="userSpaceOnUse"
       id="clipPath244"><path
         d="m 1506,1116 h 74 v 50 h -74 z"
         id="path242" /></clipPath><clipPath
       clipPathUnits="userSpaceOnUse"
       id="clipPath258"><path
         d="M 0,0 H 1684 V 1190 H 0 Z"
         id="path256" /></clipPath><clipPath
       clipPathUnits="userSpaceOnUse"
       id="clipPath288"><path
         d="m 65.28831,1128.835 -11.40887,5.665 11.40968,5.665 c 0.63481,0.324 0.89275,1.113 0.57454,1.761 l -1.14989,2.348 c -0.3174,0.648 -1.08962,0.912 -1.72523,0.588 l -14.98872,-7.442 -14.98871,7.442 c -0.63481,0.324 -1.40703,0.061 -1.72524,-0.588 l -1.14988,-2.348 c -0.31741,-0.648 -0.06027,-1.437 0.57454,-1.761 l 11.40968,-5.665 -11.40888,-5.665 c -0.63481,-0.324 -0.89275,-1.112 -0.57454,-1.761 l 1.14989,-2.348 c 0.3174,-0.648 1.08962,-0.912 1.72523,-0.587 l 14.98791,7.442 14.98872,-7.442 c 0.63481,-0.324 1.40702,-0.061 1.72523,0.587 l 1.14989,2.348 c 0.3174,0.649 0.05946,1.437 -0.57535,1.761 z m -23.2348,17.701 -0.44034,-2.122 c -0.21455,-1.035 0.43552,-2.039 1.32185,-2.039 h 10.13122 c 0.88632,0 1.5364,1.004 1.32185,2.039 l -0.44196,2.122 c 3.35726,1.838 5.62489,5.147 5.62489,8.964 0,5.799 -5.18052,10.5 -11.5712,10.5 -6.39067,0 -11.57119,-4.701 -11.57119,-10.5 0,-3.817 2.26763,-7.126 5.62488,-8.964 z m 10.44622,10.277 c 1.41828,0 2.57138,-1.178 2.57138,-2.625 0,-1.448 -1.1531,-2.625 -2.57138,-2.625 -1.41827,0 -2.57137,1.177 -2.57137,2.625 0,1.447 1.1531,2.625 2.57137,2.625 z m -8.99982,0 c 1.41828,0 2.57138,-1.178 2.57138,-2.625 0,-1.448 -1.1531,-2.625 -2.57138,-2.625 -1.41827,0 -2.57137,1.177 -2.57137,2.625 0,1.447 1.1531,2.625 2.57137,2.625 z"
         id="path286" /></clipPath><clipPath
       clipPathUnits="userSpaceOnUse"
       id="clipPath294"><path
         d="M 0,0 H 1684 V 1190 H 0 Z"
         id="path292" /></clipPath><clipPath
       clipPathUnits="userSpaceOnUse"
       id="clipPath304"><path
         d="m 1330,90 h 316 v 16 h -316 z"
         id="path302" /></clipPath><clipPath
       clipPathUnits="userSpaceOnUse"
       id="clipPath318"><path
         d="m 1024,568 c 68.483,0 124,55.5167 124,124 0,68.4833 -55.517,124 -124,124 -68.4833,0 -124,-55.5167 -124,-124 0,-68.4833 55.5167,-124 124,-124 z"
         id="path316" /></clipPath><clipPath
       clipPathUnits="userSpaceOnUse"
       id="clipPath324"><path
         d="M 0,0 H 1684 V 1190 H 0 Z"
         id="path322" /></clipPath><clipPath
       clipPathUnits="userSpaceOnUse"
       id="clipPath334"><path
         d="m 1002,646 h 184 v 92 h -184 z"
         id="path332" /></clipPath><clipPath
       clipPathUnits="userSpaceOnUse"
       id="clipPath354"><path
         d="M 0,0 H 1684 V 1190 H 0 Z"
         id="path352" /></clipPath><clipPath
       clipPathUnits="userSpaceOnUse"
       id="clipPath360"><path
         d="m 934,666 h 55 v 54 h -55 z"
         id="path358" /></clipPath><clipPath
       clipPathUnits="userSpaceOnUse"
       id="clipPath364"><path
         d="m 944.9688,696.375 h -8.4376 c -1.3979,0 -2.5312,-1.1333 -2.5312,-2.5312 V 668.5312 C 934,667.1333 935.1333,666 936.5312,666 h 8.4376 c 1.3979,0 2.5312,1.1333 2.5312,2.5312 v 25.3126 c 0,1.3979 -1.1333,2.5312 -2.5312,2.5312 z M 940.75,670.2188 c -1.398,0 -2.5312,1.1332 -2.5312,2.5312 0,1.398 1.1332,2.5312 2.5312,2.5312 1.398,0 2.5312,-1.1332 2.5312,-2.5312 0,-1.398 -1.1332,-2.5312 -2.5312,-2.5312 z m 33.75,41.1906 c 0,-4.4736 -2.739,-6.9829 -3.5097,-9.9719 h 10.7286 c 3.5224,0 6.2645,-2.9263 6.281,-6.1275 0.009,-1.8919 -0.7959,-3.9286 -2.0502,-5.1888 l -0.0116,-0.0116 c 1.0374,-2.4613 0.8687,-5.9101 -0.9817,-8.3815 0.9156,-2.7311 -0.007,-6.0859 -1.7278,-7.8845 0.4533,-1.856 0.2367,-3.4356 -0.6484,-4.7073 C 980.4276,666.0436 975.0923,666 970.5807,666 l -0.3001,10e-5 c -5.0928,0.002 -9.2608,1.856 -12.6098,3.346 -1.683,0.7487 -3.8835,1.6756 -5.5531,1.7063 -0.6897,0.0126 -1.2427,0.5755 -1.2427,1.2654 v 22.546 c 0,0.3375 0.1352,0.6614 0.3753,0.8987 4.178,4.1285 5.9746,8.4995 9.399,11.9297 1.5614,1.5643 2.1292,3.9273 2.6782,6.2123 0.469,1.9513 1.4501,6.0955 3.5787,6.0955 2.5313,0 7.5938,-0.8438 7.5938,-8.5906 z"
         id="path362" /></clipPath><clipPath
       clipPathUnits="userSpaceOnUse"
       id="clipPath368"><path
         d="m 934,666 h 54 v 54 h -54 z"
         id="path366" /></clipPath><clipPath
       clipPathUnits="userSpaceOnUse"
       id="clipPath390"><path
         d="m 122,162 h 184 v 92 H 122 Z"
         id="path388" /></clipPath><clipPath
       clipPathUnits="userSpaceOnUse"
       id="clipPath410"><path
         d="M 0,0 H 1684 V 1190 H 0 Z"
         id="path408" /></clipPath><clipPath
       clipPathUnits="userSpaceOnUse"
       id="clipPath416"><path
         d="m 52,180 h 52 v 52 H 52 Z"
         id="path414" /></clipPath><clipPath
       clipPathUnits="userSpaceOnUse"
       id="clipPath420"><path
         d="m 78,232 c -14.3629,0 -26,-11.6371 -26,-26 0,-14.3629 11.6371,-26 26,-26 14.3629,0 26,11.6371 26,26 0,14.3629 -11.6371,26 -26,26 z M 66.25806,211.0323 c 0,1.8556 1.4992,3.3548 3.35484,3.3548 1.85565,0 3.35484,-1.4992 3.35484,-3.3548 0,-1.8557 -1.49919,-3.3549 -3.35484,-3.3549 -1.85564,0 -3.35484,1.4992 -3.35484,3.3549 z m 19.63629,-19.217 c -3.27096,1.0065 -6.22741,1.6041 -7.89435,1.6041 -1.66694,0 -4.62339,-0.5976 -7.89435,-1.6041 -1.20565,-0.3669 -2.35888,0.6605 -2.1492,1.8976 0.73387,4.1936 6.30081,6.4161 10.04355,6.4161 3.74274,0 9.30968,-2.233 10.04355,-6.4161 0.20968,-1.2476 -0.95403,-2.2645 -2.1492,-1.8976 z m 0.49275,15.8621 c -1.85565,0 -3.35484,1.4992 -3.35484,3.3549 0,1.8556 1.49919,3.3548 3.35484,3.3548 1.85564,0 3.35484,-1.4992 3.35484,-3.3548 0,-1.8557 -1.4992,-3.3549 -3.35484,-3.3549 z"
         id="path418" /></clipPath><clipPath
       clipPathUnits="userSpaceOnUse"
       id="clipPath424"><path
         d="m 52,180 h 52 v 52 H 52 Z"
         id="path422" /></clipPath><clipPath
       clipPathUnits="userSpaceOnUse"
       id="clipPath446"><path
         d="m 1447,878 c 59.094,0 107,47.9055 107,107 0,59.094 -47.906,107 -107,107 -59.094,0 -107,-47.906 -107,-107 0,-59.0945 47.906,-107 107,-107 z"
         id="path444" /></clipPath><clipPath
       clipPathUnits="userSpaceOnUse"
       id="clipPath452"><path
         d="M 0,0 H 1684 V 1190 H 0 Z"
         id="path450" /></clipPath><clipPath
       clipPathUnits="userSpaceOnUse"
       id="clipPath462"><path
         d="m 1447,290 c 59.094,0 107,47.9055 107,107 0,59.0945 -47.906,107 -107,107 -59.094,0 -107,-47.9055 -107,-107 0,-59.0945 47.906,-107 107,-107 z"
         id="path460" /></clipPath><clipPath
       clipPathUnits="userSpaceOnUse"
       id="clipPath468"><path
         d="M 0,0 H 1684 V 1190 H 0 Z"
         id="path466" /></clipPath><clipPath
       clipPathUnits="userSpaceOnUse"
       id="clipPath478"><path
         d="m 1485,588 c 59.094,0 107,47.9055 107,107 0,59.0945 -47.906,107 -107,107 -59.094,0 -107,-47.9055 -107,-107 0,-59.0945 47.906,-107 107,-107 z"
         id="path476" /></clipPath><clipPath
       clipPathUnits="userSpaceOnUse"
       id="clipPath484"><path
         d="M 0,0 H 1684 V 1190 H 0 Z"
         id="path482" /></clipPath><clipPath
       clipPathUnits="userSpaceOnUse"
       id="clipPath494"><path
         d="m 608,478 c 118.1889,0 214,95.8111 214,214 0,118.1889 -95.8111,214 -214,214 -118.1889,0 -214,-95.8111 -214,-214 0,-118.1889 95.8111,-214 214,-214 z"
         id="path492" /></clipPath><clipPath
       clipPathUnits="userSpaceOnUse"
       id="clipPath500"><path
         d="M 0,0 H 1684 V 1190 H 0 Z"
         id="path498" /></clipPath><clipPath
       clipPathUnits="userSpaceOnUse"
       id="clipPath510"><path
         d="m 580,646 h 184 v 92 H 580 Z"
         id="path508" /></clipPath><clipPath
       clipPathUnits="userSpaceOnUse"
       id="clipPath530"><path
         d="M 0,0 H 1684 V 1190 H 0 Z"
         id="path528" /></clipPath><clipPath
       clipPathUnits="userSpaceOnUse"
       id="clipPath536"><path
         d="m 516,666 h 46 v 54 h -46 z"
         id="path534" /></clipPath><clipPath
       clipPathUnits="userSpaceOnUse"
       id="clipPath540"><path
         d="m 539,693 c 7.2594,0 13.1429,6.0434 13.1429,13.5 0,7.4566 -5.8835,13.5 -13.1429,13.5 -7.2594,0 -13.1429,-6.0434 -13.1429,-13.5 0,-7.4566 5.8835,-13.5 13.1429,-13.5 z m 9.2,-3.375 h -1.7147 c -2.2795,-1.0758 -4.8157,-1.6875 -7.4853,-1.6875 -2.6696,0 -5.1955,0.6117 -7.4853,1.6875 H 529.8 c -7.6188,0 -13.8,-6.3492 -13.8,-14.175 v -4.3875 C 516,668.2676 518.2076,666 520.9286,666 h 36.1428 c 2.721,0 4.9286,2.2676 4.9286,5.0625 v 4.3875 c 0,7.8258 -6.1812,14.175 -13.8,14.175 z"
         id="path538" /></clipPath><clipPath
       clipPathUnits="userSpaceOnUse"
       id="clipPath544"><path
         d="m 516,666 h 46 v 54 h -46 z"
         id="path542" /></clipPath><clipPath
       clipPathUnits="userSpaceOnUse"
       id="clipPath566"><path
         d="m 234,1020 h 184 v 92 H 234 Z"
         id="path564" /></clipPath><clipPath
       clipPathUnits="userSpaceOnUse"
       id="clipPath580"><path
         d="m 630,1020 h 184 v 92 H 630 Z"
         id="path578" /></clipPath><clipPath
       clipPathUnits="userSpaceOnUse"
       id="clipPath594"><path
         d="m 1012,1020 h 184 v 92 h -184 z"
         id="path592" /></clipPath><clipPath
       clipPathUnits="userSpaceOnUse"
       id="clipPath608"><path
         d="m 1012,266 h 184 v 92 h -184 z"
         id="path606" /></clipPath><clipPath
       clipPathUnits="userSpaceOnUse"
       id="clipPath622"><path
         d="m 1204,642 h 184 v 92 h -184 z"
         id="path620" /></clipPath><clipPath
       clipPathUnits="userSpaceOnUse"
       id="clipPath636"><path
         d="m 1462,938 h 184 v 92 h -184 z"
         id="path634" /></clipPath><clipPath
       clipPathUnits="userSpaceOnUse"
       id="clipPath656"><path
         d="M 0,0 H 1684 V 1190 H 0 Z"
         id="path654" /></clipPath><clipPath
       clipPathUnits="userSpaceOnUse"
       id="clipPath662"><path
         d="m 1390,959 h 58 v 49 h -58 z"
         id="path660" /></clipPath><clipPath
       clipPathUnits="userSpaceOnUse"
       id="clipPath666"><path
         d="m 1440.768,1002.763 c -5.768,4.784 -14.347,3.923 -19.642,-1.394 l -2.073,-2.0795 -2.074,2.0795 c -5.284,5.317 -13.874,6.178 -19.642,1.394 -6.611,-5.4917 -6.958,-15.3474 -1.042,-21.2997 l 20.368,-20.4695 c 1.316,-1.3216 3.453,-1.3216 4.769,0 l 20.368,20.4695 c 5.926,5.9523 5.579,15.808 -1.032,21.2997 z"
         clip-rule="evenodd"
         id="path664" /></clipPath><clipPath
       clipPathUnits="userSpaceOnUse"
       id="clipPath670"><path
         d="m 1392,960 h 54 v 46 h -54 z"
         id="path668" /></clipPath><clipPath
       clipPathUnits="userSpaceOnUse"
       id="clipPath692"><path
         d="m 1500,644 h 184 v 92 h -184 z"
         id="path690" /></clipPath><clipPath
       clipPathUnits="userSpaceOnUse"
       id="clipPath712"><path
         d="M 0,0 H 1684 V 1190 H 0 Z"
         id="path710" /></clipPath><clipPath
       clipPathUnits="userSpaceOnUse"
       id="clipPath718"><path
         d="m 1432,662 h 57 v 56 h -57 z"
         id="path716" /></clipPath><clipPath
       clipPathUnits="userSpaceOnUse"
       id="clipPath722"><path
         d="m 1455.577,693.0741 h -22.245 c -0.735,0 -1.332,0.597 -1.332,1.3333 v 22.2593 c 0,0.7363 0.597,1.3333 1.332,1.3333 h 5.33 c 0.736,0 1.333,-0.597 1.333,-1.3333 v -8.6791 c 5.082,5.6481 12.465,9.1824 20.672,9.1227 15.202,-0.1104 27.365,-12.4025 27.333,-27.6146 C 1487.968,674.3047 1475.651,662 1460.463,662 c -7.117,0 -13.602,2.7014 -18.489,7.135 -0.566,0.5136 -0.593,1.3949 -0.052,1.9356 l 3.772,3.7741 c 0.496,0.4971 1.294,0.5241 1.821,0.0583 3.446,-3.0514 7.978,-4.903 12.948,-4.903 10.8,0 19.542,8.7462 19.542,19.5556 0,10.8074 -8.74,19.5555 -19.542,19.5555 -6.496,0 -12.246,-3.164 -15.798,-8.037 h 10.912 c 0.736,0 1.332,-0.597 1.332,-1.3333 v -5.3334 c 0,-0.7363 -0.596,-1.3333 -1.332,-1.3333 z"
         clip-rule="evenodd"
         id="path720" /></clipPath><clipPath
       clipPathUnits="userSpaceOnUse"
       id="clipPath726"><path
         d="m 1432,662 h 56 v 56 h -56 z"
         id="path724" /></clipPath><clipPath
       clipPathUnits="userSpaceOnUse"
       id="clipPath748"><path
         d="m 116,646 h 184 v 92 H 116 Z"
         id="path746" /></clipPath><clipPath
       clipPathUnits="userSpaceOnUse"
       id="clipPath768"><path
         d="M 0,0 H 1684 V 1190 H 0 Z"
         id="path766" /></clipPath><clipPath
       clipPathUnits="userSpaceOnUse"
       id="clipPath774"><path
         d="m 52,666 h 46 v 54 H 52 Z"
         id="path772" /></clipPath><clipPath
       clipPathUnits="userSpaceOnUse"
       id="clipPath778"><path
         d="m 75,693 c 7.25938,0 13.14286,6.0434 13.14286,13.5 0,7.4566 -5.88348,13.5 -13.14286,13.5 -7.25938,0 -13.14286,-6.0434 -13.14286,-13.5 0,-7.4566 5.88348,-13.5 13.14286,-13.5 z m 9.2,-3.375 H 82.48527 C 80.2058,688.5492 77.66964,687.9375 75,687.9375 c -2.66964,0 -5.19554,0.6117 -7.48527,1.6875 H 65.8 c -7.61875,0 -13.8,-6.3492 -13.8,-14.175 v -4.3875 C 52,668.2676 54.20759,666 56.92857,666 H 93.07143 C 95.79241,666 98,668.2676 98,671.0625 v 4.3875 c 0,7.8258 -6.18125,14.175 -13.8,14.175 z"
         id="path776" /></clipPath><clipPath
       clipPathUnits="userSpaceOnUse"
       id="clipPath782"><path
         d="m 52,666 h 46 v 54 H 52 Z"
         id="path780" /></clipPath><clipPath
       clipPathUnits="userSpaceOnUse"
       id="clipPath808"><path
         d="m 1460,356 h 184 v 92 h -184 z"
         id="path806" /></clipPath><clipPath
       clipPathUnits="userSpaceOnUse"
       id="clipPath828"><path
         d="M 0,0 H 1684 V 1190 H 0 Z"
         id="path826" /></clipPath><clipPath
       clipPathUnits="userSpaceOnUse"
       id="clipPath834"><path
         d="m 1391,373 h 56 v 56 h -56 z"
         id="path832" /></clipPath><clipPath
       clipPathUnits="userSpaceOnUse"
       id="clipPath838"><path
         d="m 1401.496,374.1545 c -6,0.3116 -10.008,5.9137 -9.443,11.8161 1.243,12.9787 9.04,21.2436 19.704,27.5549 0.606,0.3589 1.439,0.4817 2.171,0.4742 2.767,-0.0286 6.842,-0.0286 9.641,-0.0286 1.557,0 2.427,0 3.213,-0.5292 5.206,-3.3095 16.067,-12.9441 18.382,-22.0295 0.738,-2.8944 1.021,-6.0594 0.713,-9.0196 -0.467,-4.4996 -4.402,-8.0369 -8.998,-8.2325 -5.918,-0.252 -11.856,-0.0614 -17.785,-0.0614 -10e-4,-0.004 0,-0.007 0,-0.0103 -5.866,0 -11.745,-0.2379 -17.596,0.0659 z m 24.72,25.2029 c -1.293,1.3451 -2.846,2.37 -4.883,2.6902 v 3.2668 h -3.623 v -3.3308 c -3.137,-0.6726 -4.981,-2.9145 -4.981,-6.1492 0,-5.6047 8.345,-5.957 8.345,-8.5192 0,-1.2491 -0.647,-1.7935 -2.264,-1.7935 -1.359,0 -2.717,0.5124 -4.464,1.7935 l -2.393,-3.7151 c 1.617,-1.4413 3.914,-2.2099 5.757,-2.4341 v -3.2027 h 3.623 v 3.3949 c 3.396,0.8006 5.045,3.2347 5.045,6.3413 0,5.8289 -8.344,5.957 -8.344,8.3911 0,1.2811 0.679,1.6654 2.069,1.6654 1.197,0 2.2,-0.5124 3.364,-1.5373 z"
         clip-rule="evenodd"
         id="path836" /></clipPath><clipPath
       clipPathUnits="userSpaceOnUse"
       id="clipPath842"><path
         d="m 1392,374 h 54 v 54 h -54 z"
         id="path840" /></clipPath><clipPath
       clipPathUnits="userSpaceOnUse"
       id="clipPath846"><path
         d="m 1420.077,427.985 c 3.154,-0.001 6.308,0.0436 9.46,-0.0158 2.498,-0.0469 3.108,-1.1969 1.774,-3.2269 -1.213,-1.8465 -2.398,-3.7189 -3.755,-5.4632 -0.463,-0.5956 -1.396,-1.1598 -2.134,-1.1847 -3.6,-0.1213 -7.209,-0.1317 -10.808,0.004 -0.794,0.03 -1.787,0.6423 -2.29,1.283 -1.323,1.6876 -2.443,3.5284 -3.615,5.3262 -1.38,2.1175 -0.747,3.2304 1.908,3.2682 3.153,0.0448 6.307,0.0106 9.46,0.009"
         clip-rule="evenodd"
         id="path844" /></clipPath><clipPath
       clipPathUnits="userSpaceOnUse"
       id="clipPath850"><path
         d="m 1392,374 h 54 v 54 h -54 z"
         id="path848" /></clipPath></defs><sodipodi:namedview
     pagecolor="#ffffff"
     bordercolor="#666666"
     borderopacity="1"
     objecttolerance="10"
     gridtolerance="10"
     guidetolerance="10"
     inkscape:pageopacity="0"
     inkscape:pageshadow="2"
     inkscape:window-width="1920"
     inkscape:window-height="1016"
     id="namedview4"
     showgrid="false"
     inkscape:zoom="0.47457981"
     inkscape:cx="1122.6666"
     inkscape:cy="793.33337"
     inkscape:window-x="0"
     inkscape:window-y="27"
     inkscape:window-maximized="1"
     inkscape:current-layer="g10" /><g
     id="g10"
     inkscape:groupmode="layer"
     inkscape:label="pirate-metrics-canvas"
     transform="matrix(1.3333333,0,0,-1.3333333,0,1586.6667)"><g
       id="g12" /><g
       id="g14"><path
         d="M 0,1190 H 1684 V 0 H 0 Z"
         style="fill:#ffffff;fill-opacity:1;fill-rule:nonzero;stroke:none"
         id="path16" /></g><g
       id="g18"><g
         id="g20"
         clip-path="url(#clipPath24)"><g
           id="g26"
           transform="matrix(2,0,0,-2,1528,62)"><text
             transform="translate(6.41192,15)"
             style="font-variant:normal;font-weight:900;font-size:12.96px;font-family:SourceSansPro;-inkscape-font-specification:SourceSansPro-Black;writing-mode:lr-tb;fill:#000000;fill-opacity:1;fill-rule:nonzero;stroke:none"
             id="text30"><tspan
               x="0 10.67904 18.84384"
               y="0"
               sodipodi:role="line"
               id="tspan28">WRK</tspan></text></g><g
           id="g32"
           transform="matrix(2,0,0,-2,1528,62)"><text
             transform="translate(33.39464,15)"
             style="font-variant:normal;font-weight:900;font-size:12.96px;font-family:SourceSansPro;-inkscape-font-specification:SourceSansPro-Black;writing-mode:lr-tb;fill:#000000;fill-opacity:1;fill-rule:nonzero;stroke:none"
             id="text36"><tspan
               x="0"
               y="0"
               id="tspan34">S</tspan></text></g><g
           id="g38"
           transform="matrix(2,0,0,-2,1528,62)"><text
             transform="translate(40.74008,15)"
             style="font-variant:normal;font-weight:900;font-size:12.96px;font-family:SourceSansPro;-inkscape-font-specification:SourceSansPro-Black;writing-mode:lr-tb;fill:#000000;fill-opacity:1;fill-rule:nonzero;stroke:none"
             id="text42"><tspan
               x="0 8.8387203"
               y="0"
               sodipodi:role="line"
               id="tspan40">HP</tspan></text></g></g></g><g
       id="g44"><g
         id="g46"
         clip-path="url(#clipPath50)"><g
           id="g52"
           clip-path="url(#clipPath56)"><g
             id="g58"
             transform="matrix(2,0,0,-2,1528,62)"><path
               d="M 0,0 H 64 V 21 H 0 Z"
               style="fill:none;stroke:#000000;stroke-width:2.4;stroke-linecap:butt;stroke-linejoin:miter;stroke-miterlimit:10;stroke-dasharray:none;stroke-opacity:1"
               id="path60" /></g></g></g></g><g
       id="g62"><g
         id="g64"
         clip-path="url(#clipPath68)"><g
           id="g70"
           clip-path="url(#clipPath74)"><path
             d="M 18,1116 H 1666 V 73 H 18 Z"
             style="fill:#f2f2f2;fill-opacity:1;fill-rule:nonzero;stroke:none"
             id="path76" /></g></g></g><g
       id="g78"><g
         id="g80"
         clip-path="url(#clipPath84)"><g
           id="g86"
           transform="matrix(2,0,0,-2,1024,908)"><path
             d="M 0.4249045,109 311,1"
             style="fill:none;stroke:#ffffff;stroke-width:8;stroke-linecap:round;stroke-linejoin:round;stroke-miterlimit:10;stroke-dasharray:0, 16;stroke-dashoffset:0;stroke-opacity:1"
             id="path88" /></g><g
           id="g90"
           transform="matrix(2,0,0,2,1020,478)"><path
             d="M 0.4249045,102 324,0"
             style="fill:none;stroke:#ffffff;stroke-width:8;stroke-linecap:round;stroke-linejoin:round;stroke-miterlimit:10;stroke-dasharray:0, 16;stroke-dashoffset:0;stroke-opacity:1"
             id="path92" /></g><g
           id="g94"
           transform="matrix(2,0,0,-2,564,1112)"><path
             d="M 0,0 43.08308,207.6715 1.48138,423.08"
             style="fill:none;stroke:#ffffff;stroke-width:8;stroke-linecap:round;stroke-linejoin:round;stroke-miterlimit:10;stroke-dasharray:0, 16;stroke-dashoffset:0;stroke-opacity:1"
             id="path96" /></g></g></g><g
       id="g98"><g
         id="g100"
         clip-path="url(#clipPath104)"><g
           id="g106"
           clip-path="url(#clipPath110)"><path
             d="M -40,1126 H 268.7819 V 255.84 H -40 Z"
             style="fill:#ffffff;fill-opacity:1;fill-rule:nonzero;stroke:none"
             id="path112" /></g></g></g><g
       id="g114"><g
         id="g116"
         clip-path="url(#clipPath120)"><g
           id="g122"
           clip-path="url(#clipPath126)"><path
             d="M 1314.609,1126 H 1714 V 255.84 h -399.391 z"
             style="fill:#ffffff;fill-opacity:1;fill-rule:nonzero;stroke:none"
             id="path128" /></g></g></g><g
       id="g130"><g
         id="g132"
         clip-path="url(#clipPath136)"><g
           id="g138"
           transform="matrix(2,0,0,-2,960,1112)"><path
             d="M 0,0 43.08308,207.6715 1.48138,423.08"
             style="fill:none;stroke:#ffffff;stroke-width:8;stroke-linecap:round;stroke-linejoin:round;stroke-miterlimit:10;stroke-dasharray:0, 16;stroke-dashoffset:0;stroke-opacity:1"
             id="path140" /></g><g
           id="g142"
           transform="matrix(2,0,0,-2,28,60)"><text
             transform="translate(0,15)"
             style="font-variant:normal;font-weight:normal;font-size:16.8px;font-family:FontAwesome;-inkscape-font-specification:FontAwesome5BrandsRegular;writing-mode:lr-tb;fill:#222222;fill-opacity:1;fill-rule:nonzero;stroke:none"
             id="text146"><tspan
               x="0"
               y="0"
               id="tspan144">!</tspan></text></g><g
           id="g148"
           transform="matrix(2,0,0,-2,28,60)" /><g
           id="g150"
           transform="matrix(2,0,0,-2,28,60)"><text
             transform="translate(19.00937,15)"
             style="font-variant:normal;font-weight:normal;font-size:16.8px;font-family:FontAwesome;-inkscape-font-specification:FontAwesome5BrandsRegular;writing-mode:lr-tb;fill:#222222;fill-opacity:1;fill-rule:nonzero;stroke:none"
             id="text154"><tspan
               x="0"
               y="0"
               id="tspan152">&quot;</tspan></text></g><g
           id="g156"
           transform="matrix(2,0,0,-2,28,60)" /><g
           id="g158"
           transform="matrix(2,0,0,-2,28,60)"><text
             transform="translate(38.01875,15)"
             style="font-variant:normal;font-weight:normal;font-size:16.8px;font-family:FontAwesome;-inkscape-font-specification:FontAwesome5BrandsRegular;writing-mode:lr-tb;fill:#222222;fill-opacity:1;fill-rule:nonzero;stroke:none"
             id="text162"><tspan
               x="0"
               y="0"
               id="tspan160">#</tspan></text></g><g
           id="g164"
           transform="matrix(2,0,0,-2,84,1176)"><text
             transform="translate(0,25)"
             style="font-variant:normal;font-weight:900;font-size:24px;font-family:SourceSansPro;-inkscape-font-specification:SourceSansPro-Black;writing-mode:lr-tb;fill:#222222;fill-opacity:1;fill-rule:nonzero;stroke:none"
             id="text168"><tspan
               x="0 14.832 21.743999 31.775999 44.784 54.383999 67.008003 72.047997 90.671997 103.296 112.896 122.928 129.84 141.168 152.01601 157.056 171.12 184.12801 198.09599 211.15199 224.16"
               y="0"
               sodipodi:role="line"
               id="tspan166">Pirate Metrics Canvas</tspan></text></g></g></g><g
       id="g170"><g
         id="g172"
         clip-path="url(#clipPath176)"><g
           id="g178"
           clip-path="url(#clipPath182)"><path
             d="m 822,1176 h 344 v -64 H 822 Z"
             style="fill:#f2f2f2;fill-opacity:1;fill-rule:nonzero;stroke:none"
             id="path184" /></g></g></g><g
       id="g186"><g
         id="g188"
         clip-path="url(#clipPath192)"><g
           id="g194"
           clip-path="url(#clipPath198)"><path
             d="m 1156,1176 h 344 v -64 h -344 z"
             style="fill:#f2f2f2;fill-opacity:1;fill-rule:nonzero;stroke:none"
             id="path200" /></g></g></g><g
       id="g202"><g
         id="g204"
         clip-path="url(#clipPath208)"><g
           id="g210"
           clip-path="url(#clipPath214)"><path
             d="m 1490,1176 h 176 v -64 h -176 z"
             style="fill:#f2f2f2;fill-opacity:1;fill-rule:nonzero;stroke:none"
             id="path216" /></g></g></g><g
       id="g218"><g
         id="g220"
         clip-path="url(#clipPath224)"><g
           id="g226"
           transform="matrix(2,0,0,-2,838,1166)"><text
             transform="translate(0,19)"
             style="font-variant:normal;font-weight:300;font-size:8px;font-family:SourceSansPro;-inkscape-font-specification:SourceSansPro-Light;writing-mode:lr-tb;fill:#222222;fill-opacity:0.5;fill-rule:nonzero;stroke:none"
             id="text230"><tspan
               x="0 4.408 6.9439998 11.224 13.056 16.92 20.511999"
               y="0"
               sodipodi:role="line"
               id="tspan228">Project</tspan></text></g><g
           id="g232"
           transform="matrix(2,0,0,-2,1172,1166)"><text
             transform="translate(0,19)"
             style="font-variant:normal;font-weight:300;font-size:8px;font-family:SourceSansPro;-inkscape-font-specification:SourceSansPro-Light;writing-mode:lr-tb;fill:#222222;fill-opacity:0.5;fill-rule:nonzero;stroke:none"
             id="text236"><tspan
               x="0 4.1360002 8 11.992"
               y="0"
               sodipodi:role="line"
               id="tspan234">Team</tspan></text></g></g></g><g
       id="g238"><g
         id="g240"
         clip-path="url(#clipPath244)"><g
           id="g246"
           transform="matrix(2,0,0,-2,1506,1166)"><text
             transform="translate(0,19)"
             style="font-variant:normal;font-weight:300;font-size:8px;font-family:SourceSansPro;-inkscape-font-specification:SourceSansPro-Light;writing-mode:lr-tb;fill:#222222;fill-opacity:0.5;fill-rule:nonzero;stroke:none"
             id="text250"><tspan
               x="0 3.872 7.7360001 10.272 13.512 15.344 19.624001"
               y="0"
               sodipodi:role="line"
               id="tspan248">Version</tspan></text></g></g></g><g
       id="g252"><g
         id="g254"
         clip-path="url(#clipPath258)"><g
           id="g260"
           transform="matrix(2,0,0,-2,143.8574,61.05273)"><path
             d="M 0.5,0 V 17.95898"
             style="fill:none;stroke:#000000;stroke-width:0.25;stroke-linecap:butt;stroke-linejoin:miter;stroke-miterlimit:10;stroke-dasharray:none;stroke-opacity:1"
             id="path262" /></g><g
           id="g264"
           transform="matrix(2,0,0,-2,154,74)"><text
             transform="translate(0,22)"
             style="font-variant:normal;font-weight:900;font-size:16.8px;font-family:SourceSansPro;-inkscape-font-specification:SourceSansPro-Black;writing-mode:lr-tb;fill:#222222;fill-opacity:1;fill-rule:nonzero;stroke:none"
             id="text268"><tspan
               x="0 13.8432 24.4272 34.9776 44.452801 55.9104"
               y="0"
               sodipodi:role="line"
               id="tspan266">WRKSHP</tspan></text></g><g
           id="g270"
           transform="matrix(2,0,0,-2,154,74)"><text
             transform="translate(66.2928,22)"
             style="font-variant:normal;font-weight:300;font-size:16.8px;font-family:SourceSansPro;-inkscape-font-specification:SourceSansPro-Light;writing-mode:lr-tb;fill:#222222;fill-opacity:1;fill-rule:nonzero;stroke:none"
             id="text274"><tspan
               x="0 3.6791999 8.9208002 17.9088 26.896799 30.878401"
               y="0"
               sodipodi:role="line"
               id="tspan272">.tools</tspan></text></g><g
           id="g276"
           transform="matrix(2,0,0,-2,44,106)"><text
             transform="translate(0,6)"
             style="font-variant:normal;font-weight:300;font-size:6px;font-family:SourceSansPro;-inkscape-font-specification:SourceSansPro-Light;writing-mode:lr-tb;fill:#231f20;fill-opacity:0.5;fill-rule:nonzero;stroke:none"
             id="text280"><tspan
               x="0 1.398 3.99 7.1999998 10.392 12.822 14.016 17.214001 20.436001 22.23 25.59 27.870001 29.664 32.748001 35.862 37.056 39.804001 43.014 46.206001 48.077999 51.192001 55.301998 58.200001 60.630001 63.84 68.711998 71.610001"
               y="0"
               sodipodi:role="line"
               id="tspan278">Icons CC-BY-SA FontAwesome </tspan></text></g></g></g><g
       id="g282"><g
         id="g284"
         clip-path="url(#clipPath288)"><g
           id="g290"
           clip-path="url(#clipPath294)"><path
             d="m 20,1176 h 56 v -62 H 20 Z"
             style="fill:#000000;fill-opacity:1;fill-rule:nonzero;stroke:none"
             id="path296" /></g></g></g><g
       id="g298"><g
         id="g300"
         clip-path="url(#clipPath304)"><g
           id="g306"
           transform="matrix(2,0,0,-2,1330,106)"><text
             transform="translate(64.172,6)"
             style="font-variant:normal;font-weight:300;font-size:6px;font-family:SourceSansPro;-inkscape-font-specification:SourceSansPro-Light;writing-mode:lr-tb;fill:#231f20;fill-opacity:0.5;fill-rule:nonzero;stroke:none"
             id="text310"><tspan
               x="0 3.4260001 6.4200001 8.8500004 11.748 15.012 16.205999 19.416 22.608 23.802 27.396 30.389999 32.993999 35.891998 37.085999 41.279999 43.973999 47.316002 48.737999 51.911999 53.754002 56.591999 57.563999 59.993999 61.188 64.494003 65.867996 67.632004 70.625999 72.438004 75.335999 76.529999 80.723999 83.556 85.428001 87.330002 88.704002 91.398003"
               y="0"
               sodipodi:role="line"
               id="tspan308">Based on Dave McClure’s Pirate Metrics</tspan></text></g></g></g><g
       id="g312"><g
         id="g314"
         clip-path="url(#clipPath318)"><g
           id="g320"
           clip-path="url(#clipPath324)"><path
             d="m 890,826 h 268 V 558 H 890 Z"
             style="fill:#ffffff;fill-opacity:1;fill-rule:nonzero;stroke:none"
             id="path326" /></g></g></g><g
       id="g328"><g
         id="g330"
         clip-path="url(#clipPath334)"><g
           id="g336"
           transform="matrix(2,0,0,-2,1002,738)"><text
             transform="translate(0,19)"
             style="font-variant:normal;font-weight:300;font-size:14px;font-family:SourceSansPro;-inkscape-font-specification:SourceSansPro-Light;writing-mode:lr-tb;fill:#231f20;fill-opacity:1;fill-rule:nonzero;stroke:none"
             id="text340"><tspan
               x="0 7.2659998 13.552 17.92 21.125999 27.202"
               y="0"
               sodipodi:role="line"
               id="tspan338">Active</tspan></text></g><g
           id="g342"
           transform="matrix(2,0,0,-2,1002,738)"><text
             transform="translate(0,37)"
             style="font-variant:normal;font-weight:300;font-size:14px;font-family:SourceSansPro;-inkscape-font-specification:SourceSansPro-Light;writing-mode:lr-tb;fill:#231f20;fill-opacity:1;fill-rule:nonzero;stroke:none"
             id="text346"><tspan
               x="0 6.2859998 13.692 19.362 23.59 31.08 42.448002 49.209999 53.507999"
               y="0"
               sodipodi:role="line"
               id="tspan344">customers</tspan></text></g></g></g><g
       id="g348"><g
         id="g350"
         clip-path="url(#clipPath354)"><g
           id="g356" /><g
           id="g382"><g
             clip-path="url(#clipPath360)"
             opacity="0.3"
             id="g380"><g
               id="g370" /><g
               id="g378"><g
                 clip-path="url(#clipPath364)"
                 id="g376"><g
                   clip-path="url(#clipPath368)"
                   id="g374"><path
                     d="m 924,730 h 74 v -74 h -74 z"
                     style="fill:#000000;fill-opacity:1;fill-rule:nonzero;stroke:none"
                     id="path372" /></g></g></g></g></g></g></g><g
       id="g384"><g
         id="g386"
         clip-path="url(#clipPath390)"><g
           id="g392"
           transform="matrix(2,0,0,-2,122,254)"><text
             transform="translate(0,19)"
             style="font-variant:normal;font-weight:300;font-size:14px;font-family:SourceSansPro;-inkscape-font-specification:SourceSansPro-Light;writing-mode:lr-tb;fill:#231f20;fill-opacity:1;fill-rule:nonzero;stroke:none"
             id="text396"><tspan
               x="0 6.2859998 13.776 19.445999"
               y="0"
               sodipodi:role="line"
               id="tspan394">Lost</tspan></text></g><g
           id="g398"
           transform="matrix(2,0,0,-2,122,254)"><text
             transform="translate(0,37)"
             style="font-variant:normal;font-weight:300;font-size:14px;font-family:SourceSansPro;-inkscape-font-specification:SourceSansPro-Light;writing-mode:lr-tb;fill:#231f20;fill-opacity:1;fill-rule:nonzero;stroke:none"
             id="text402"><tspan
               x="0 6.2859998 13.692 19.362 23.59 31.08 42.448002 49.209999 53.507999"
               y="0"
               sodipodi:role="line"
               id="tspan400">customers</tspan></text></g></g></g><g
       id="g404"><g
         id="g406"
         clip-path="url(#clipPath410)"><g
           id="g412" /><g
           id="g438"><g
             clip-path="url(#clipPath416)"
             opacity="0.3"
             id="g436"><g
               id="g426" /><g
               id="g434"><g
                 clip-path="url(#clipPath420)"
                 id="g432"><g
                   clip-path="url(#clipPath424)"
                   id="g430"><path
                     d="m 42,242 h 72 V 170 H 42 Z"
                     style="fill:#000000;fill-opacity:1;fill-rule:nonzero;stroke:none"
                     id="path428" /></g></g></g></g></g></g></g><g
       id="g440"><g
         id="g442"
         clip-path="url(#clipPath446)"><g
           id="g448"
           clip-path="url(#clipPath452)"><path
             d="m 1330,1102 h 234 V 868 h -234 z"
             style="fill:#ffffff;fill-opacity:1;fill-rule:nonzero;stroke:none"
             id="path454" /></g></g></g><g
       id="g456"><g
         id="g458"
         clip-path="url(#clipPath462)"><g
           id="g464"
           clip-path="url(#clipPath468)"><path
             d="m 1330,514 h 234 V 280 h -234 z"
             style="fill:#ffffff;fill-opacity:1;fill-rule:nonzero;stroke:none"
             id="path470" /></g></g></g><g
       id="g472"><g
         id="g474"
         clip-path="url(#clipPath478)"><g
           id="g480"
           clip-path="url(#clipPath484)"><path
             d="m 1368,812 h 234 V 578 h -234 z"
             style="fill:#ffffff;fill-opacity:1;fill-rule:nonzero;stroke:none"
             id="path486" /></g></g></g><g
       id="g488"><g
         id="g490"
         clip-path="url(#clipPath494)"><g
           id="g496"
           clip-path="url(#clipPath500)"><path
             d="M 384,916 H 832 V 468 H 384 Z"
             style="fill:#ffffff;fill-opacity:1;fill-rule:nonzero;stroke:none"
             id="path502" /></g></g></g><g
       id="g504"><g
         id="g506"
         clip-path="url(#clipPath510)"><g
           id="g512"
           transform="matrix(2,0,0,-2,580,738)"><text
             transform="translate(0,19)"
             style="font-variant:normal;font-weight:300;font-size:14px;font-family:SourceSansPro;-inkscape-font-specification:SourceSansPro-Light;writing-mode:lr-tb;fill:#231f20;fill-opacity:1;fill-rule:nonzero;stroke:none"
             id="text516"><tspan
               x="0 7.2659998 13.314 20.832001 28.238001 31.444 35.742001 42.504002"
               y="0"
               sodipodi:role="line"
               id="tspan514">Acquired</tspan></text></g><g
           id="g518"
           transform="matrix(2,0,0,-2,580,738)"><text
             transform="translate(0,37)"
             style="font-variant:normal;font-weight:300;font-size:14px;font-family:SourceSansPro;-inkscape-font-specification:SourceSansPro-Light;writing-mode:lr-tb;fill:#231f20;fill-opacity:1;fill-rule:nonzero;stroke:none"
             id="text522"><tspan
               x="0 6.2859998 13.692 19.362 23.59 31.08 42.448002 49.209999 53.507999"
               y="0"
               sodipodi:role="line"
               id="tspan520">customers</tspan></text></g></g></g><g
       id="g524"><g
         id="g526"
         clip-path="url(#clipPath530)"><g
           id="g532" /><g
           id="g558"><g
             clip-path="url(#clipPath536)"
             opacity="0.3"
             id="g556"><g
               id="g546" /><g
               id="g554"><g
                 clip-path="url(#clipPath540)"
                 id="g552"><g
                   clip-path="url(#clipPath544)"
                   id="g550"><path
                     d="m 506,730 h 66 v -74 h -66 z"
                     style="fill:#000000;fill-opacity:1;fill-rule:nonzero;stroke:none"
                     id="path548" /></g></g></g></g></g></g></g><g
       id="g560"><g
         id="g562"
         clip-path="url(#clipPath566)"><g
           id="g568"
           transform="matrix(2,0,0,-2,234,1112)"><text
             transform="translate(0,28)"
             style="font-variant:normal;font-weight:300;font-size:14px;font-family:SourceSansPro;-inkscape-font-specification:SourceSansPro-Light;writing-mode:lr-tb;fill:#231f20;fill-opacity:1;fill-rule:nonzero;stroke:none"
             id="text572"><tspan
               x="0 7.2659998 13.314 20.832001 28.238001 31.444 37.113998 40.32 44.688 47.894001 55.383999"
               y="0"
               sodipodi:role="line"
               id="tspan570">Acquisition</tspan></text></g></g></g><g
       id="g574"><g
         id="g576"
         clip-path="url(#clipPath580)"><g
           id="g582"
           transform="matrix(2,0,0,-2,630,1112)"><text
             transform="translate(0,28)"
             style="font-variant:normal;font-weight:300;font-size:14px;font-family:SourceSansPro;-inkscape-font-specification:SourceSansPro-Light;writing-mode:lr-tb;fill:#231f20;fill-opacity:1;fill-rule:nonzero;stroke:none"
             id="text586"><tspan
               x="0 7.2659998 13.552 17.92 21.125999 26.922001 33.908001 38.276001 41.481998 48.972"
               y="0"
               sodipodi:role="line"
               id="tspan584">Activation</tspan></text></g></g></g><g
       id="g588"><g
         id="g590"
         clip-path="url(#clipPath594)"><g
           id="g596"
           transform="matrix(2,0,0,-2,1012,1112)"><text
             transform="translate(0,28)"
             style="font-variant:normal;font-weight:300;font-size:14px;font-family:SourceSansPro;-inkscape-font-specification:SourceSansPro-Light;writing-mode:lr-tb;fill:#231f20;fill-opacity:1;fill-rule:nonzero;stroke:none"
             id="text600"><tspan
               x="0 7.6020002 14.21 18.438 25.200001 32.647999 37.015999 40.222 47.712002"
               y="0"
               sodipodi:role="line"
               id="tspan598">Retention</tspan></text></g></g></g><g
       id="g602"><g
         id="g604"
         clip-path="url(#clipPath608)"><g
           id="g610"
           transform="matrix(2,0,0,-2,1012,358)"><text
             transform="translate(0,28)"
             style="font-variant:normal;font-weight:300;font-size:14px;font-family:SourceSansPro;-inkscape-font-specification:SourceSansPro-Light;writing-mode:lr-tb;fill:#231f20;fill-opacity:1;fill-rule:nonzero;stroke:none"
             id="text614"><tspan
               x="0 7.6020002 14.532 20.608 27.370001 34.818001 42.223999"
               y="0"
               sodipodi:role="line"
               id="tspan612">Revenue</tspan></text></g></g></g><g
       id="g616"><g
         id="g618"
         clip-path="url(#clipPath622)"><g
           id="g624"
           transform="matrix(2,0,0,-2,1204,734)"><text
             transform="translate(0,28)"
             style="font-variant:normal;font-weight:300;font-size:14px;font-family:SourceSansPro;-inkscape-font-specification:SourceSansPro-Light;writing-mode:lr-tb;fill:#231f20;fill-opacity:1;fill-rule:nonzero;stroke:none"
             id="text628"><tspan
               x="0 7.6020002 14.364 17.906 24.667999 29.106001 33.222 40.208"
               y="0"
               sodipodi:role="line"
               id="tspan626">Referral</tspan></text></g></g></g><g
       id="g630"><g
         id="g632"
         clip-path="url(#clipPath636)"><g
           id="g638"
           transform="matrix(2,0,0,-2,1462,1030)"><text
             transform="translate(0,19)"
             style="font-variant:normal;font-weight:300;font-size:14px;font-family:SourceSansPro;-inkscape-font-specification:SourceSansPro-Light;writing-mode:lr-tb;fill:#231f20;fill-opacity:1;fill-rule:nonzero;stroke:none"
             id="text642"><tspan
               x="0 7.6020002 14.21 18.284 25.27 28.476 35.924 42.686001"
               y="0"
               sodipodi:role="line"
               id="tspan640">Retained</tspan></text></g><g
           id="g644"
           transform="matrix(2,0,0,-2,1462,1030)"><text
             transform="translate(0,37)"
             style="font-variant:normal;font-weight:300;font-size:14px;font-family:SourceSansPro;-inkscape-font-specification:SourceSansPro-Light;writing-mode:lr-tb;fill:#231f20;fill-opacity:1;fill-rule:nonzero;stroke:none"
             id="text648"><tspan
               x="0 6.2859998 13.692 19.362 23.59 31.08 42.448002 49.209999 53.507999"
               y="0"
               sodipodi:role="line"
               id="tspan646">customers</tspan></text></g></g></g><g
       id="g650"><g
         id="g652"
         clip-path="url(#clipPath656)"><g
           id="g658" /><g
           id="g684"><g
             clip-path="url(#clipPath662)"
             opacity="0.3"
             id="g682"><g
               id="g672" /><g
               id="g680"><g
                 clip-path="url(#clipPath666)"
                 id="g678"><g
                   clip-path="url(#clipPath670)"
                   id="g676"><path
                     d="M 1382.104,1015.901 H 1456 v -65.8984 h -73.896 z"
                     style="fill:#000000;fill-opacity:1;fill-rule:nonzero;stroke:none"
                     id="path674" /></g></g></g></g></g></g></g><g
       id="g686"><g
         id="g688"
         clip-path="url(#clipPath692)"><g
           id="g694"
           transform="matrix(2,0,0,-2,1500,736)"><text
             transform="translate(0,19)"
             style="font-variant:normal;font-weight:300;font-size:14px;font-family:SourceSansPro;-inkscape-font-specification:SourceSansPro-Light;writing-mode:lr-tb;fill:#231f20;fill-opacity:1;fill-rule:nonzero;stroke:none"
             id="text698"><tspan
               x="0 7.6020002 14.364 17.906 24.667999 29.106001 33.403999 40.166"
               y="0"
               sodipodi:role="line"
               id="tspan696">Referred</tspan></text></g><g
           id="g700"
           transform="matrix(2,0,0,-2,1500,736)"><text
             transform="translate(0,37)"
             style="font-variant:normal;font-weight:300;font-size:14px;font-family:SourceSansPro;-inkscape-font-specification:SourceSansPro-Light;writing-mode:lr-tb;fill:#231f20;fill-opacity:1;fill-rule:nonzero;stroke:none"
             id="text704"><tspan
               x="0 6.2859998 13.692 19.362 23.59 31.08 42.448002 49.209999 53.507999"
               y="0"
               sodipodi:role="line"
               id="tspan702">customers</tspan></text></g></g></g><g
       id="g706"><g
         id="g708"
         clip-path="url(#clipPath712)"><g
           id="g714" /><g
           id="g740"><g
             clip-path="url(#clipPath718)"
             opacity="0.3"
             id="g738"><g
               id="g728" /><g
               id="g736"><g
                 clip-path="url(#clipPath722)"
                 id="g734"><g
                   clip-path="url(#clipPath726)"
                   id="g732"><path
                     d="m 1422,728 h 76 v -76 h -76 z"
                     style="fill:#000000;fill-opacity:1;fill-rule:nonzero;stroke:none"
                     id="path730" /></g></g></g></g></g></g></g><g
       id="g742"><g
         id="g744"
         clip-path="url(#clipPath748)"><g
           id="g750"
           transform="matrix(2,0,0,-2,116,738)"><text
             transform="translate(0,19)"
             style="font-variant:normal;font-weight:300;font-size:14px;font-family:SourceSansPro;-inkscape-font-specification:SourceSansPro-Light;writing-mode:lr-tb;fill:#231f20;fill-opacity:1;fill-rule:nonzero;stroke:none"
             id="text754"><tspan
               x="0 7.3639998 14.854 19.082001 25.844 33.292 37.66 40.866001 47.852001"
               y="0"
               sodipodi:role="line"
               id="tspan752">Potential</tspan></text></g><g
           id="g756"
           transform="matrix(2,0,0,-2,116,738)"><text
             transform="translate(0,37)"
             style="font-variant:normal;font-weight:300;font-size:14px;font-family:SourceSansPro;-inkscape-font-specification:SourceSansPro-Light;writing-mode:lr-tb;fill:#231f20;fill-opacity:1;fill-rule:nonzero;stroke:none"
             id="text760"><tspan
               x="0 6.2859998 13.692 19.362 23.59 31.08 42.448002 49.209999 53.507999"
               y="0"
               sodipodi:role="line"
               id="tspan758">customers</tspan></text></g></g></g><g
       id="g762"><g
         id="g764"
         clip-path="url(#clipPath768)"><g
           id="g770" /><g
           id="g796"><g
             clip-path="url(#clipPath774)"
             opacity="0.3"
             id="g794"><g
               id="g784" /><g
               id="g792"><g
                 clip-path="url(#clipPath778)"
                 id="g790"><g
                   clip-path="url(#clipPath782)"
                   id="g788"><path
                     d="m 42,730 h 66 V 656 H 42 Z"
                     style="fill:#000000;fill-opacity:1;fill-rule:nonzero;stroke:none"
                     id="path786" /></g></g></g></g></g><g
           id="g798"
           transform="matrix(2,0,0,-2,12,268)"><path
             d="M 822,1.08 H 1"
             style="fill:none;stroke:#ffffff;stroke-width:8;stroke-linecap:butt;stroke-linejoin:miter;stroke-miterlimit:10;stroke-dasharray:none;stroke-opacity:1"
             id="path800" /></g></g></g><g
       id="g802"><g
         id="g804"
         clip-path="url(#clipPath808)"><g
           id="g810"
           transform="matrix(2,0,0,-2,1460,448)"><text
             transform="translate(0,19)"
             style="font-variant:normal;font-weight:300;font-size:14px;font-family:SourceSansPro;-inkscape-font-specification:SourceSansPro-Light;writing-mode:lr-tb;fill:#231f20;fill-opacity:1;fill-rule:nonzero;stroke:none"
             id="text814"><tspan
               x="0 7.0419998 14.028 20.132 23.337999 30.785999 37.604"
               y="0"
               sodipodi:role="line"
               id="tspan812">Paying </tspan></text></g><g
           id="g816"
           transform="matrix(2,0,0,-2,1460,448)"><text
             transform="translate(0,37)"
             style="font-variant:normal;font-weight:300;font-size:14px;font-family:SourceSansPro;-inkscape-font-specification:SourceSansPro-Light;writing-mode:lr-tb;fill:#231f20;fill-opacity:1;fill-rule:nonzero;stroke:none"
             id="text820"><tspan
               x="0 6.2859998 13.692 19.362 23.59 31.08 42.448002 49.209999 53.507999"
               y="0"
               sodipodi:role="line"
               id="tspan818">customers</tspan></text></g></g></g><g
       id="g822"><g
         id="g824"
         clip-path="url(#clipPath828)"><g
           id="g830" /><g
           id="g872"><g
             clip-path="url(#clipPath834)"
             opacity="0.3"
             id="g870"><g
               id="g852" /><g
               id="g860"><g
                 clip-path="url(#clipPath838)"
                 id="g858"><g
                   clip-path="url(#clipPath842)"
                   id="g856"><path
                     d="m 1382,424 h 74 v -60 h -74 z"
                     style="fill:#000000;fill-opacity:1;fill-rule:nonzero;stroke:none"
                     id="path854" /></g></g></g><g
               id="g868"><g
                 clip-path="url(#clipPath846)"
                 id="g866"><g
                   clip-path="url(#clipPath850)"
                   id="g864"><path
                     d="m 1398,438 h 44 v -30 h -44 z"
                     style="fill:#000000;fill-opacity:1;fill-rule:nonzero;stroke:none"
                     id="path862" /></g></g></g></g></g></g></g></g></svg>
