<?xml version="1.0" encoding="UTF-8" standalone="no"?>
<svg
   version="1.1"
   x="0px"
   y="0px"
   viewBox="0 0 816.59998 980"
   enable-background="new 0 0 1000 1000"
   xml:space="preserve"
   id="svg1323"
   sodipodi:docname="practice.svg"
   width="816.59998"
   height="980"
   inkscape:version="1.2.2 (b0a8486541, 2022-12-01)"
   xmlns:inkscape="http://www.inkscape.org/namespaces/inkscape"
   xmlns:sodipodi="http://sodipodi.sourceforge.net/DTD/sodipodi-0.dtd"
   xmlns="http://www.w3.org/2000/svg"
   xmlns:svg="http://www.w3.org/2000/svg"
   xmlns:rdf="http://www.w3.org/1999/02/22-rdf-syntax-ns#"
   xmlns:cc="http://creativecommons.org/ns#"
   xmlns:dc="http://purl.org/dc/elements/1.1/"><defs
   id="defs1327" /><sodipodi:namedview
   pagecolor="#ffffff"
   bordercolor="#666666"
   borderopacity="1"
   objecttolerance="10"
   gridtolerance="10"
   guidetolerance="10"
   inkscape:pageopacity="0"
   inkscape:pageshadow="2"
   inkscape:window-width="1920"
   inkscape:window-height="1011"
   id="namedview1325"
   showgrid="false"
   fit-margin-top="0"
   fit-margin-left="0"
   fit-margin-right="0"
   fit-margin-bottom="0"
   inkscape:zoom="0.53245141"
   inkscape:cx="382.1945"
   inkscape:cy="520.23526"
   inkscape:window-x="0"
   inkscape:window-y="0"
   inkscape:window-maximized="1"
   inkscape:current-layer="svg1323"
   inkscape:showpageshadow="2"
   inkscape:pagecheckerboard="0"
   inkscape:deskcolor="#d1d1d1" />
<metadata
   id="metadata1317"> Svg Vector Icons : http://www.onlinewebfonts.com/icon <rdf:RDF><cc:Work
     rdf:about=""><dc:format>image/svg+xml</dc:format><dc:type
       rdf:resource="http://purl.org/dc/dcmitype/StillImage" /><dc:title /></cc:Work></rdf:RDF></metadata>
<g
   id="g1321"
   style="fill:#01526d"
   transform="translate(-91.7,-10)"><path
     d="M 295.6,459.2 C 211.1,589.8 91.7,788.3 91.7,867.5 91.7,990 214.2,990 214.2,990 H 500 v 0 h 285.8 c 0,0 122.5,0 122.5,-122.5 0,-79.2 -119.4,-277.7 -203.9,-408.3 z M 622.5,336.7 V 50.8 h 40.8 V 10 h -40.8 v 0 H 500 v 0 H 377.5 v 0 h -40.9 v 40.8 h 40.9 v 285.8 c 0,0 -285.8,408.3 -285.8,530.8 C 91.7,990 214.2,990 214.2,990 H 500 v 0 h 285.8 c 0,0 122.5,0 122.5,-122.5 C 908.3,745 622.5,336.7 622.5,336.7 Z M 785.8,949.2 H 500 214.2 c -13.6,0 -81.7,-4 -81.7,-81.7 0,-79.8 170.8,-353.6 278.4,-507.4 l 7.4,-10.6 V 336.7 50.8 h 163.3 v 285.8 12.8 L 589,360 c 107.7,153.8 278.5,427.6 278.5,507.4 0,74.7 -62.7,81.4 -81.7,81.8 z M 377.5,785.8 c 0,22.5 -18.3,40.8 -40.8,40.8 -22.5,0 -40.8,-18.3 -40.8,-40.8 0,-22.5 18.3,-40.8 40.8,-40.8 22.5,0 40.8,18.3 40.8,40.8 z M 540.8,622.5 c 0,45.1 -36.6,81.7 -81.7,81.7 -45.1,0 -81.7,-36.6 -81.7,-81.7 0,-45.1 36.6,-81.7 81.7,-81.7 45.1,0 81.7,36.6 81.7,81.7 z m 163.4,163.3 c 0,45.1 -36.6,81.7 -81.7,81.7 -45.1,0 -81.7,-36.6 -81.7,-81.7 0,-45.1 36.6,-81.7 81.7,-81.7 45.1,0.1 81.7,36.6 81.7,81.7 z"
     id="path1319"
     style="fill:#01526d" /></g>
</svg>
