<?xml version="1.0" encoding="UTF-8" standalone="no"?>
<svg
   xmlns:dc="http://purl.org/dc/elements/1.1/"
   xmlns:cc="http://creativecommons.org/ns#"
   xmlns:rdf="http://www.w3.org/1999/02/22-rdf-syntax-ns#"
   xmlns:svg="http://www.w3.org/2000/svg"
   xmlns="http://www.w3.org/2000/svg"
   xmlns:sodipodi="http://sodipodi.sourceforge.net/DTD/sodipodi-0.dtd"
   xmlns:inkscape="http://www.inkscape.org/namespaces/inkscape"
   sodipodi:docname="3-steps-step-1.2.svg"
   inkscape:version="1.0.1 (3bc2e813f5, 2020-09-07)"
   id="svg178"
   version="1.1"
   viewBox="0 0 591.62586 173.7065"
   height="173.7065mm"
   width="591.62585mm">
  <defs
     id="defs172">
    <rect
       x="275.57492"
       y="21.568821"
       width="146.50832"
       height="40.150997"
       id="rect42" />
    <rect
       x="275.57492"
       y="21.568821"
       width="146.50832"
       height="40.150997"
       id="rect101" />
    <rect
       x="86.695015"
       y="24.287807"
       width="115.59326"
       height="31.058367"
       id="rect36" />
    <rect
       x="86.695015"
       y="24.287807"
       width="115.59326"
       height="31.058367"
       id="rect104" />
    <rect
       x="366.1315"
       y="79.205826"
       width="78.349869"
       height="39.902073"
       id="rect30" />
    <rect
       x="366.1315"
       y="79.205826"
       width="78.349869"
       height="39.902073"
       id="rect107" />
    <rect
       x="246.75893"
       y="77.828049"
       width="70.979286"
       height="48.071011"
       id="rect24" />
    <rect
       x="246.75893"
       y="77.828049"
       width="70.979286"
       height="48.071011"
       id="rect110" />
    <rect
       x="139.51672"
       y="74.101814"
       width="63.250431"
       height="41.234032"
       id="rect18" />
    <rect
       x="139.51672"
       y="74.101814"
       width="63.250431"
       height="41.234032"
       id="rect113" />
    <rect
       x="49.402206"
       y="70.938385"
       width="63.789341"
       height="30.468447"
       id="rect12" />
    <rect
       x="49.402206"
       y="70.938385"
       width="63.789341"
       height="30.468447"
       id="rect116" />
  </defs>
  <sodipodi:namedview
     inkscape:window-maximized="1"
     inkscape:window-y="27"
     inkscape:window-x="0"
     inkscape:window-height="1016"
     inkscape:window-width="1920"
     fit-margin-bottom="0"
     fit-margin-right="0"
     fit-margin-left="0"
     fit-margin-top="0"
     showgrid="false"
     inkscape:document-rotation="0"
     inkscape:current-layer="layer1"
     inkscape:document-units="mm"
     inkscape:cy="417.92069"
     inkscape:cx="1143.3624"
     inkscape:zoom="0.45425934"
     inkscape:pageshadow="2"
     inkscape:pageopacity="0.0"
     borderopacity="1.0"
     bordercolor="#666666"
     pagecolor="#ffffff"
     id="base" />
  <metadata
     id="metadata175">
    <rdf:RDF>
      <cc:Work
         rdf:about="">
        <dc:format>image/svg+xml</dc:format>
        <dc:type
           rdf:resource="http://purl.org/dc/dcmitype/StillImage" />
        <dc:title></dc:title>
      </cc:Work>
    </rdf:RDF>
  </metadata>
  <g
     transform="translate(59.825264,-74.161843)"
     id="layer1"
     inkscape:groupmode="layer"
     inkscape:label="Calque 1">
    <rect
       ry="0"
       y="74.647598"
       x="329.53168"
       height="172.73499"
       width="201.78314"
       id="rect562"
       style="opacity:0.999;fill:#434c5e;stroke:none;stroke-width:0.97151" />
    <rect
       y="74.647598"
       x="-59.34201"
       height="172.73497"
       width="388.87372"
       id="rect560"
       style="opacity:0.999;fill:#3b4252;stroke:none;stroke-width:0.966508" />
    <g
       transform="translate(-52.916669)"
       id="g546"
       style="stroke:none">
      <rect
         y="92.295357"
         x="10.174766"
         height="44.450741"
         width="136.07619"
         id="rect393"
         style="opacity:0.999;fill:#8fbcbb;stroke:none;stroke-width:0.793008" />
      <text
         id="text365"
         y="111.64753"
         x="27.027515"
         style="font-style:normal;font-weight:normal;font-size:10.5833px;line-height:1.25;font-family:sans-serif;letter-spacing:0px;word-spacing:0px;fill:#000000;fill-opacity:1;stroke:none;stroke-width:0.264583"
         xml:space="preserve"><tspan
           style="stroke-width:0.264583;stroke:none"
           y="111.64753"
           x="27.027515"
           id="tspan363"
           sodipodi:role="line">Adéquation</tspan><tspan
           id="tspan367"
           style="stroke-width:0.264583;stroke:none"
           y="124.87666"
           x="27.027515"
           sodipodi:role="line">Problème / Solution</tspan></text>
    </g>
    <rect
       style="opacity:0.999;fill:#8fbcbb;stroke:none;stroke-width:0.793008"
       id="rect393-6"
       width="136.07619"
       height="44.450741"
       x="162.5069"
       y="92.295357" />
    <text
       xml:space="preserve"
       style="font-style:normal;font-weight:normal;font-size:10.5833px;line-height:1.25;font-family:sans-serif;letter-spacing:0px;word-spacing:0px;fill:#000000;fill-opacity:1;stroke:none;stroke-width:0.264583"
       x="187.59943"
       y="111.64753"
       id="text371"><tspan
         sodipodi:role="line"
         id="tspan369"
         x="187.59943"
         y="111.64753"
         style="stroke-width:0.264583">Adéquation</tspan><tspan
         sodipodi:role="line"
         x="187.59943"
         y="124.87666"
         style="stroke-width:0.264583"
         id="tspan373">Produit / Marché</tspan></text>
    <g
       transform="translate(49.466791,0.57246135)"
       id="g558"
       style="stroke:none">
      <rect
         y="92.295357"
         x="318.28888"
         height="44.450741"
         width="136.07619"
         id="rect393-7"
         style="opacity:0.999;fill:#8fbcbb;stroke:none;stroke-width:0.793008" />
      <text
         id="text377"
         y="111.03775"
         x="358.2616"
         style="font-style:normal;font-weight:normal;font-size:10.5833px;line-height:1.25;font-family:sans-serif;letter-spacing:0px;word-spacing:0px;fill:#000000;fill-opacity:1;stroke:none;stroke-width:0.264583"
         xml:space="preserve"><tspan
           style="stroke-width:0.264583;stroke:none"
           y="111.03775"
           x="358.2616"
           id="tspan375"
           sodipodi:role="line">Montée en</tspan><tspan
           id="tspan379"
           style="stroke-width:0.264583;stroke:none"
           y="124.26688"
           x="358.2616"
           sodipodi:role="line">puissance</tspan></text>
    </g>
    <text
       xml:space="preserve"
       style="font-style:normal;font-weight:normal;font-size:10.5833px;line-height:1.25;font-family:sans-serif;letter-spacing:0px;word-spacing:0px;fill:#eceff4;fill-opacity:1;stroke:none;stroke-width:0.264583;"
       x="371.3446"
       y="219.19171"
       id="text391"><tspan
         sodipodi:role="line"
         id="tspan389"
         x="371.3446"
         y="219.19171"
         style="fill:#eceff4;stroke-width:0.264583;">Croissance : optimiser</tspan></text>
    <path
       style="fill:#eceff4;stroke-width:0.0290397"
       d="m 149.29376,114.52072 c 0,0.98735 -0.37751,1.94566 -1.07447,2.64261 l -18.9048,18.9048 c -0.69694,0.66791 -1.65526,1.07447 -2.6426,1.07447 -0.98735,0 -1.91661,-0.40656 -2.61357,-1.07447 l -2.17797,-2.17797 c -0.69696,-0.69696 -1.10351,-1.65526 -1.10351,-2.64261 0,-0.98734 0.40655,-1.94565 1.10351,-2.64261 l 8.50861,-8.50861 h -20.4439 c -2.09086,0 -3.39764,-1.74238 -3.39764,-3.71707 v -3.71707 c 0,-1.9747 1.30678,-3.71707 3.39764,-3.71707 h 20.4439 l -8.50861,-8.53766 c -0.69696,-0.667907 -1.10351,-1.626219 -1.10351,-2.613561 0,-0.987351 0.40655,-1.945663 1.10351,-2.61357 l 2.17797,-2.177972 c 0.69696,-0.696955 1.62622,-1.103506 2.61357,-1.103506 0.98734,0 1.94566,0.406551 2.6426,1.103506 l 18.9048,18.904803 c 0.69696,0.66791 1.07447,1.62622 1.07447,2.61356 z"
       id="path504" />
    <path
       id="path504-3"
       d="m 354.54255,114.52072 c 0,0.98735 -0.37751,1.94566 -1.07447,2.64261 l -18.9048,18.9048 c -0.69694,0.66791 -1.65526,1.07447 -2.6426,1.07447 -0.98735,0 -1.91661,-0.40656 -2.61357,-1.07447 l -2.17797,-2.17797 c -0.69696,-0.69696 -1.10351,-1.65526 -1.10351,-2.64261 0,-0.98734 0.40655,-1.94565 1.10351,-2.64261 l 8.50861,-8.50861 h -20.4439 c -2.09086,0 -3.39764,-1.74238 -3.39764,-3.71707 v -3.71707 c 0,-1.9747 1.30678,-3.71707 3.39764,-3.71707 h 20.4439 l -8.50861,-8.53765 c -0.69696,-0.667915 -1.10351,-1.626235 -1.10351,-2.613575 0,-0.98735 0.40655,-1.94566 1.10351,-2.613567 l 2.17797,-2.177972 c 0.69696,-0.696955 1.62622,-1.103506 2.61357,-1.103506 0.98734,0 1.94566,0.406551 2.6426,1.103506 l 18.9048,18.904804 c 0.69696,0.66791 1.07447,1.62622 1.07447,2.61356 z"
       style="fill:#eceff4;stroke-width:0.0290396" />
    <g
       transform="translate(-22.970382,48.154167)"
       id="g569"
       style="fill:#eceff4">
      <text
         id="text383"
         y="171.24933"
         x="13.494819"
         style="font-style:normal;font-weight:normal;font-size:10.5833px;line-height:1.25;font-family:sans-serif;letter-spacing:0px;word-spacing:0px;fill:#eceff4;fill-opacity:1;stroke:none;stroke-width:0.264583"
         xml:space="preserve"><tspan
           style="fill:#eceff4;stroke-width:0.264583"
           y="171.24933"
           x="13.494819"
           id="tspan381"
           sodipodi:role="line">validation des hypothèses</tspan></text>
      <text
         id="text387"
         y="171.24933"
         x="187.58118"
         style="font-style:normal;font-weight:normal;font-size:10.5833px;line-height:1.25;font-family:sans-serif;letter-spacing:0px;word-spacing:0px;fill:#eceff4;fill-opacity:1;stroke:none;stroke-width:0.264583"
         xml:space="preserve"><tspan
           style="fill:#eceff4;stroke-width:0.264583"
           y="171.24933"
           x="187.58118"
           id="tspan385"
           sodipodi:role="line">pivoter ou persévérer</tspan></text>
      <path
         style="fill:#eceff4;stroke-width:0.0141675"
         d="m 180.51123,168.11775 c 0,0.4817 -0.18418,0.94923 -0.5242,1.28925 l -9.22307,9.22307 c -0.34002,0.32585 -0.80755,0.5242 -1.28925,0.5242 -0.4817,0 -0.93505,-0.19835 -1.27508,-0.5242 l -1.06256,-1.06257 c -0.34003,-0.34002 -0.53837,-0.80755 -0.53837,-1.28924 0,-0.4817 0.19834,-0.94923 0.53837,-1.28925 l 4.15109,-4.15109 h -9.97396 c -1.02006,0 -1.6576,-0.85006 -1.6576,-1.81345 v -1.81344 c 0,-0.9634 0.63754,-1.81345 1.6576,-1.81345 h 9.97396 l -4.15109,-4.16526 c -0.34003,-0.32585 -0.53837,-0.79338 -0.53837,-1.27508 0,-0.48169 0.19834,-0.94923 0.53837,-1.27508 l 1.06256,-1.06257 c 0.34003,-0.34002 0.79338,-0.53836 1.27508,-0.53836 0.4817,0 0.94923,0.19834 1.28925,0.53836 l 9.22307,9.22308 c 0.34002,0.32585 0.5242,0.79338 0.5242,1.27508 z"
         id="path504-5" />
    </g>
    <rect
       y="136.75606"
       x="-42.731945"
       height="45.482773"
       width="67.597748"
       id="rect589"
       style="opacity:0.999;fill:#eceff4;stroke:#2e3440;stroke-width:0.813672" />
    <rect
       y="136.74902"
       x="24.504646"
       height="45.455456"
       width="68.826698"
       id="rect591"
       style="opacity:0.999;fill:#bf616a;stroke:#2e3440;stroke-width:0.848193" />
    <text
       id="text601"
       y="157.03419"
       x="-35.074455"
       style="font-style:normal;font-variant:normal;font-weight:normal;font-stretch:normal;font-size:7.05556px;line-height:1.25;font-family:sans-serif;-inkscape-font-specification:'sans-serif, Normal';font-variant-ligatures:normal;font-variant-caps:normal;font-variant-numeric:normal;font-variant-east-asian:normal;letter-spacing:0px;word-spacing:0px;fill:#000000;fill-opacity:1;stroke:none;stroke-width:0.264583"
       xml:space="preserve"><tspan
         style="font-style:normal;font-variant:normal;font-weight:normal;font-stretch:normal;font-size:7.05556px;font-family:sans-serif;-inkscape-font-specification:'sans-serif, Normal';font-variant-ligatures:normal;font-variant-caps:normal;font-variant-numeric:normal;font-variant-east-asian:normal;stroke-width:0.264583"
         y="157.03419"
         x="-35.074455"
         id="tspan599"
         sodipodi:role="line">Comprendre le</tspan><tspan
         id="tspan603"
         style="font-style:normal;font-variant:normal;font-weight:normal;font-stretch:normal;font-size:7.05556px;font-family:sans-serif;-inkscape-font-specification:'sans-serif, Normal';font-variant-ligatures:normal;font-variant-caps:normal;font-variant-numeric:normal;font-variant-east-asian:normal;stroke-width:0.264583"
         y="165.85364"
         x="-35.074455"
         sodipodi:role="line">problème</tspan></text>
    <text
       xml:space="preserve"
       style="font-style:normal;font-variant:normal;font-weight:normal;font-stretch:normal;font-size:7.05556px;line-height:1.25;font-family:sans-serif;-inkscape-font-specification:'sans-serif, Normal';font-variant-ligatures:normal;font-variant-caps:normal;font-variant-numeric:normal;font-variant-east-asian:normal;letter-spacing:0px;word-spacing:0px;fill:#000000;fill-opacity:1;stroke:none;stroke-width:0.264583"
       x="27.712427"
       y="162.22983"
       id="text601-8"><tspan
         sodipodi:role="line"
         x="27.712427"
         y="162.22983"
         style="font-style:normal;font-variant:normal;font-weight:normal;font-stretch:normal;font-size:7.05556px;font-family:sans-serif;-inkscape-font-specification:'sans-serif, Normal';font-variant-ligatures:normal;font-variant-caps:normal;font-variant-numeric:normal;font-variant-east-asian:normal;stroke-width:0.264583"
         id="tspan603-0">Définir la solution</tspan></text>
    <rect
       style="opacity:0.999;fill:#e5e9f0;stroke:#2e3440;stroke-width:0.813673"
       id="rect589-6"
       width="67.597748"
       height="45.482773"
       x="162.51981"
       y="136.75313" />
    <rect
       style="opacity:0.999;fill:#e5e9f0;stroke:#2e3440;stroke-width:0.848193"
       id="rect591-3"
       width="68.826698"
       height="45.45546"
       x="229.75639"
       y="136.74609" />
    <text
       xml:space="preserve"
       style="font-style:normal;font-variant:normal;font-weight:normal;font-stretch:normal;font-size:7.05556px;line-height:1.25;font-family:sans-serif;-inkscape-font-specification:'sans-serif, Normal';font-variant-ligatures:normal;font-variant-caps:normal;font-variant-numeric:normal;font-variant-east-asian:normal;letter-spacing:0px;word-spacing:0px;fill:#000000;fill-opacity:1;stroke:none;stroke-width:0.264583"
       x="168.38583"
       y="157.03127"
       id="text601-85"><tspan
         sodipodi:role="line"
         x="168.38583"
         y="157.03127"
         style="font-style:normal;font-variant:normal;font-weight:normal;font-stretch:normal;font-size:7.05556px;font-family:sans-serif;-inkscape-font-specification:'sans-serif, Normal';font-variant-ligatures:normal;font-variant-caps:normal;font-variant-numeric:normal;font-variant-east-asian:normal;stroke-width:0.264583"
         id="tspan603-1">Valider</tspan><tspan
         id="tspan663"
         sodipodi:role="line"
         x="168.38583"
         y="165.85071"
         style="font-style:normal;font-variant:normal;font-weight:normal;font-stretch:normal;font-size:7.05556px;font-family:sans-serif;-inkscape-font-specification:'sans-serif, Normal';font-variant-ligatures:normal;font-variant-caps:normal;font-variant-numeric:normal;font-variant-east-asian:normal;stroke-width:0.264583">qualitativement</tspan></text>
    <text
       id="text601-8-1"
       y="157.01057"
       x="233.59795"
       style="font-style:normal;font-variant:normal;font-weight:normal;font-stretch:normal;font-size:7.05556px;line-height:1.25;font-family:sans-serif;-inkscape-font-specification:'sans-serif, Normal';font-variant-ligatures:normal;font-variant-caps:normal;font-variant-numeric:normal;font-variant-east-asian:normal;letter-spacing:0px;word-spacing:0px;fill:#000000;fill-opacity:1;stroke:none;stroke-width:0.264583"
       xml:space="preserve"><tspan
         id="tspan603-0-5"
         style="font-style:normal;font-variant:normal;font-weight:normal;font-stretch:normal;font-size:7.05556px;font-family:sans-serif;-inkscape-font-specification:'sans-serif, Normal';font-variant-ligatures:normal;font-variant-caps:normal;font-variant-numeric:normal;font-variant-east-asian:normal;stroke-width:0.264583"
         y="157.01057"
         x="233.59795"
         sodipodi:role="line">Valider</tspan><tspan
         id="tspan665"
         style="font-style:normal;font-variant:normal;font-weight:normal;font-stretch:normal;font-size:7.05556px;font-family:sans-serif;-inkscape-font-specification:'sans-serif, Normal';font-variant-ligatures:normal;font-variant-caps:normal;font-variant-numeric:normal;font-variant-east-asian:normal;stroke-width:0.264583"
         y="165.83002"
         x="233.59795"
         sodipodi:role="line">quantitativement</tspan></text>
  </g>
</svg>
