<?xml version="1.0" encoding="UTF-8" standalone="no"?>
<svg
   xmlns:dc="http://purl.org/dc/elements/1.1/"
   xmlns:cc="http://creativecommons.org/ns#"
   xmlns:rdf="http://www.w3.org/1999/02/22-rdf-syntax-ns#"
   xmlns:svg="http://www.w3.org/2000/svg"
   xmlns="http://www.w3.org/2000/svg"
   xmlns:sodipodi="http://sodipodi.sourceforge.net/DTD/sodipodi-0.dtd"
   xmlns:inkscape="http://www.inkscape.org/namespaces/inkscape"
   version="1.1"
   id="svg3079"
   xml:space="preserve"
   width="704"
   height="704"
   viewBox="0 0 704.00001 703.99998"
   sodipodi:docname="aspirations.svg"
   inkscape:version="1.0.1 (3bc2e813f5, 2020-09-07)">
  <metadata
   id="metadata3085">
    <rdf:RDF>
      <cc:Work
   rdf:about="">
        <dc:format>image/svg+xml</dc:format>
        <dc:type
   rdf:resource="http://purl.org/dc/dcmitype/StillImage" />
        <dc:title></dc:title>
      </cc:Work>
    </rdf:RDF>
  </metadata>
  <defs
   id="defs3083">
    <clipPath
   clipPathUnits="userSpaceOnUse"
   id="clipPath3097">
      <path
   d="M 0,841.89 H 1190.55 V 0 H 0 Z"
   id="path3095"
   inkscape:connector-curvature="0" />
    </clipPath>
    <clipPath
   clipPathUnits="userSpaceOnUse"
   id="clipPath3421">
      <path
   d="M 0,841.89 H 1190.55 V 0 H 0 Z"
   id="path3419"
   inkscape:connector-curvature="0" />
    </clipPath>
    <clipPath
   clipPathUnits="userSpaceOnUse"
   id="clipPath3459">
      <path
   d="M 0,841.89 H 1190.55 V 0 H 0 Z"
   id="path3457"
   inkscape:connector-curvature="0" />
    </clipPath>
  
      
      
    
      
      
      
      
      
      
    </defs>
  <sodipodi:namedview
   inkscape:guide-bbox="true"
   showguides="true"
   pagecolor="#ffffff"
   bordercolor="#666666"
   inkscape:document-rotation="0"
   borderopacity="1"
   objecttolerance="10"
   gridtolerance="10"
   guidetolerance="10"
   inkscape:pageopacity="0"
   inkscape:pageshadow="2"
   inkscape:window-width="1920"
   inkscape:window-height="1016"
   id="namedview3081"
   showgrid="false"
   inkscape:zoom="0.49497475"
   inkscape:cx="-3.1963287"
   inkscape:cy="583.43653"
   inkscape:window-x="0"
   inkscape:window-y="27"
   inkscape:window-maximized="1"
   inkscape:current-layer="g3087"
   fit-margin-top="0"
   fit-margin-left="0"
   fit-margin-right="0"
   fit-margin-bottom="0" />
  <g
   id="g3087"
   inkscape:groupmode="layer"
   inkscape:label="poster-value-proposition-design"
   transform="matrix(1.3333333,0,0,-1.3333333,-835.37878,865.72038)">
    
    <path
   inkscape:connector-curvature="0"
   id="path3103"
   style="opacity:1;fill:none;stroke:#231f20;stroke-width:4.564;stroke-linecap:butt;stroke-linejoin:miter;stroke-miterlimit:4;stroke-dasharray:none;stroke-opacity:1;stop-opacity:1"
   d="M 38.282,123.572 H 561.718 V 647.008 H 38.282 Z" />
    
    <g
   style="opacity:1;stop-opacity:1"
   transform="translate(890.5341,123.5723)"
   id="g3109">
      <path
   inkscape:connector-curvature="0"
   id="path3111"
   style="fill:none;stroke:#231f20;stroke-width:4.564;stroke-linecap:butt;stroke-linejoin:miter;stroke-miterlimit:4;stroke-dasharray:none;stroke-opacity:1"
   d="M 0,0 C 144.312,0 261.718,117.406 261.718,261.718 261.718,406.029 144.312,523.436 0,523.436 -144.312,523.436 -261.718,406.029 -261.718,261.718 -261.718,117.406 -144.312,0 0,0 Z" />
    </g>
    <g
   style="opacity:1;stop-opacity:1"
   transform="translate(37,648.2902)"
   id="g3113">
      <path
   inkscape:connector-curvature="0"
   id="path3115"
   style="fill:none;stroke:#231f20;stroke-width:2.017;stroke-linecap:butt;stroke-linejoin:miter;stroke-miterlimit:4;stroke-dasharray:none;stroke-opacity:1"
   d="M 0,0 263,-261.963" />
    </g>
    <g
   style="opacity:1;stop-opacity:1"
   transform="translate(37,122.2902)"
   id="g3117">
      <path
   inkscape:connector-curvature="0"
   id="path3119"
   style="fill:none;stroke:#231f20;stroke-width:2.017;stroke-linecap:butt;stroke-linejoin:miter;stroke-miterlimit:4;stroke-dasharray:none;stroke-opacity:1"
   d="M 0,0 263,264.028" />
    </g>
    <g
   style="opacity:1;stop-opacity:1"
   transform="translate(1097.5273,165.442)"
   id="g3121" />
    <g
   style="opacity:1;stop-opacity:1"
   transform="translate(1097.5273,165.442)"
   id="g3123" />
    <g
   style="opacity:1;stop-opacity:1"
   transform="translate(890.5341,386.3271)"
   id="g3125">
      <path
   inkscape:connector-curvature="0"
   id="path3127"
   style="fill:none;stroke:#231f20;stroke-width:2.017;stroke-linecap:butt;stroke-linejoin:miter;stroke-miterlimit:4;stroke-dasharray:none;stroke-opacity:1"
   d="M 0,0 H -289.259" />
    </g>
    <g
   style="opacity:1;stop-opacity:1"
   transform="translate(589.2585,386.3271)"
   id="g3129">
      <path
   inkscape:connector-curvature="0"
   id="path3131"
   style="fill:none;stroke:#231f20;stroke-width:2.017;stroke-linecap:butt;stroke-linejoin:miter;stroke-miterlimit:4;stroke-dasharray:none;stroke-opacity:1"
   d="M 0,0 H -289.259" />
    </g>
    <g
   style="opacity:1;stop-opacity:1"
   transform="translate(584.5195,391.5946)"
   id="g3133">
      <path
   inkscape:connector-curvature="0"
   id="path3135"
   style="fill:#231f20;fill-opacity:1;fill-rule:nonzero;stroke:none"
   d="m 0,0 v -10.552 l 7.93,5.276 z" />
    </g>
    <g
   style="opacity:1;stop-opacity:1"
   transform="translate(606.0317,391.5946)"
   id="g3137">
      <path
   inkscape:connector-curvature="0"
   id="path3139"
   style="fill:#231f20;fill-opacity:1;fill-rule:nonzero;stroke:none"
   d="m 0,0 v -10.552 l -7.93,5.276 z" />
    </g>
    <g
   style="opacity:1;stop-opacity:1"
   transform="translate(300.0718,421.8129)"
   id="g3141" />
    
    
    
    
    
    
    
    
    
    
    
    
    
    
    
    
    
    
    
    
    
    
    
    
    
    
    
    
    
    
    
    
    
    
    
    
    <g
   id="g1141"
   transform="matrix(7.4678883,0,0,7.4678883,-5200.844,-1537.2911)"
   style="fill:#eceff4"><g
     style="opacity:1;fill:#eceff4;stop-opacity:1"
     transform="translate(814.2759,244.9073)"
     id="g3281">
      <path
   inkscape:connector-curvature="0"
   id="path3283"
   style="fill:#eceff4;fill-opacity:1;fill-rule:nonzero;stroke:none"
   d="M 0,0 C 1.602,0 2.901,1.299 2.901,2.901 2.901,4.504 1.603,5.803 0,5.803 -1.603,5.803 -2.901,4.504 -2.901,2.901 -2.901,1.299 -1.603,0 0,0 m -12.945,0 c 1.603,0 2.902,1.299 2.902,2.901 0,1.603 -1.299,2.902 -2.902,2.902 -1.602,0 -2.901,-1.299 -2.901,-2.902 0,-1.602 1.299,-2.901 2.901,-2.901 m 6.472,-5.803 c -8.7,0 -10.043,-8.481 -10.043,-8.481 h 3.794 c 0,0 0.893,4.91 6.249,4.91 5.357,0 6.249,-4.91 6.249,-4.91 H 3.57 c 0,0 -1.342,8.481 -10.043,8.481" />
    </g></g>
    <g
   id="g1125"
   transform="matrix(5.9020265,0,0,5.9020265,-3935.9357,-2480.7891)"
   style="fill:#eceff4"><g
     style="opacity:1;fill:#eceff4;stop-opacity:1"
     transform="translate(801.4493,511.1405)"
     id="g3285">
      <path
   inkscape:connector-curvature="0"
   id="path3287"
   style="fill:#eceff4;fill-opacity:1;fill-rule:nonzero;stroke:none"
   d="M 0,0 C 1.573,0 2.848,1.275 2.848,2.848 2.848,4.422 1.573,5.697 0,5.697 -1.573,5.697 -2.848,4.422 -2.848,2.848 -2.848,1.275 -1.572,0 0,0 m 12.708,0 c 1.573,0 2.848,1.275 2.848,2.848 0,1.574 -1.275,2.849 -2.848,2.849 C 11.135,5.697 9.859,4.422 9.859,2.848 9.859,1.275 11.135,0 12.708,0 m 2.629,-6.135 c 0,0 -1.534,-6.573 -8.983,-6.573 -7.449,0 -8.983,6.573 -8.983,6.573 h -3.725 c 0,0 2.301,-10.079 12.708,-10.079 10.297,0 12.707,10.079 12.707,10.079 z" />
    </g></g>
    <path
   style="fill:#bf616a;stroke:#2e3440;stroke-width:0.753728"
   id="path1205"
   transform="scale(1,-1)"
   sodipodi:type="arc"
   sodipodi:cx="890.38269"
   sodipodi:cy="-384.28357"
   sodipodi:rx="259.08011"
   sodipodi:ry="260.11942"
   sodipodi:start="5.5006946"
   sodipodi:end="0.77892151"
   sodipodi:arc-type="slice"
   d="m 1074.1119,-567.68022 a 259.08011,260.11942 0 0 1 0.6507,366.13374 L 890.38269,-384.28357 Z" /><g
   id="g1137"
   transform="matrix(3.6142663,0,0,3.6142663,-2760.5918,-901.49529)"
   style="fill:#eceff4"><g
     style="opacity:1;fill:#eceff4;stop-opacity:1"
     id="g3698">
      <g
   id="g3289"
   transform="translate(1037.5228,366.8432)"
   style="opacity:1;fill:#eceff4;stop-opacity:1">
        <path
   d="m 0,0 -3.751,3.752 1.918,1.919 1.722,-1.722 5.641,6.31 2.022,-1.808 z"
   style="fill:#eceff4;fill-opacity:1;fill-rule:nonzero;stroke:none"
   id="path3291"
   inkscape:connector-curvature="0" />
      </g>
      <g
   id="g3293"
   transform="translate(1037.5228,353.952)"
   style="opacity:1;fill:#eceff4;stop-opacity:1">
        <path
   d="m 0,0 -3.751,3.752 1.918,1.918 1.722,-1.721 5.64,6.31 2.024,-1.807 z"
   style="fill:#eceff4;fill-opacity:1;fill-rule:nonzero;stroke:none"
   id="path3295"
   inkscape:connector-curvature="0" />
      </g>
      <g
   id="g3297"
   transform="translate(1039.1674,339.9001)"
   style="opacity:1;fill:#eceff4;stop-opacity:1">
        <path
   d="m 0,0 c -2.805,0 -5.089,2.283 -5.089,5.089 0,2.805 2.284,5.088 5.089,5.088 2.805,0 5.089,-2.283 5.089,-5.088 C 5.089,2.283 2.805,0 0,0 m 0,7.463 c -1.309,0 -2.375,-1.065 -2.375,-2.374 0,-1.31 1.066,-2.375 2.375,-2.375 1.309,0 2.375,1.065 2.375,2.375 0,1.309 -1.066,2.374 -2.375,2.374"
   style="fill:#eceff4;fill-opacity:1;fill-rule:nonzero;stroke:none"
   id="path3299"
   inkscape:connector-curvature="0" />
      </g>
      <path
   d="m 1075.274,368.736 h -25.329 v 4.07 h 25.329 z"
   style="opacity:1;fill:#eceff4;fill-opacity:1;fill-rule:nonzero;stroke:none;stop-opacity:1"
   id="path3301"
   inkscape:connector-curvature="0" />
      <path
   d="m 1075.274,355.843 h -25.329 v 4.071 h 25.329 z"
   style="opacity:1;fill:#eceff4;fill-opacity:1;fill-rule:nonzero;stroke:none;stop-opacity:1"
   id="path3303"
   inkscape:connector-curvature="0" />
      <path
   d="m 1075.274,342.952 h -25.329 v 4.071 h 25.329 z"
   style="opacity:1;fill:#eceff4;fill-opacity:1;fill-rule:nonzero;stroke:none;stop-opacity:1"
   id="path3305"
   inkscape:connector-curvature="0" />
    </g></g>
    
    
    
    
    
    
    
    
    
    
    
    
    
    
    <g
   id="g1095"
   transform="matrix(3.3839956,0,0,3.3839956,-873.26064,-1153.2277)"><g
     style="opacity:1;fill:#eceff4;stop-opacity:1"
     transform="translate(372.9773,482.011)"
     id="g3337">
      <path
   inkscape:connector-curvature="0"
   id="path3339"
   style="fill:#eceff4;fill-opacity:1;fill-rule:nonzero;stroke:none"
   d="m 0,0 -3.261,3.261 14.138,14.137 6.559,-6.559 6.816,6.817 3.261,-3.261 -10.077,-10.078 -6.559,6.559 z" />
    </g><g
     style="opacity:1;fill:#eceff4;stop-opacity:1"
     transform="translate(404.1351,472.8902)"
     id="g3345">
      <path
   inkscape:connector-curvature="0"
   id="path3347"
   style="fill:#eceff4;fill-opacity:1;fill-rule:nonzero;stroke:none"
   d="m 0,0 h -43.048 v 44.073 h 3.074 V 3.075 H 0 Z" />
    </g><path
     inkscape:connector-curvature="0"
     id="path3349"
     style="opacity:1;fill:#eceff4;fill-opacity:1;fill-rule:nonzero;stroke:none;stop-opacity:1"
     d="m 366.691,508.764 h -3.523 v 3.075 h 3.523 z" /><path
     inkscape:connector-curvature="0"
     id="path3351"
     style="opacity:1;fill:#eceff4;fill-opacity:1;fill-rule:nonzero;stroke:none;stop-opacity:1"
     d="m 366.691,499.539 h -3.523 v 3.075 h 3.523 z" /><g
     style="fill:#eceff4"
     id="g4866">
      <g
   id="g3341"
   transform="translate(402.0814,492.1501)"
   style="opacity:1;fill:#eceff4;stop-opacity:1">
        <path
   d="M 0,0 3.332,12.439 -9.107,9.107 Z"
   style="fill:#eceff4;fill-opacity:1;fill-rule:nonzero;stroke:none"
   id="path3343"
   inkscape:connector-curvature="0" />
      </g>
      <path
   d="m 366.691,490.315 h -3.523 v 3.075 h 3.523 z"
   style="opacity:1;fill:#eceff4;fill-opacity:1;fill-rule:nonzero;stroke:none;stop-opacity:1"
   id="path3353"
   inkscape:connector-curvature="0" />
    </g><path
     inkscape:connector-curvature="0"
     id="path3355"
     style="opacity:1;fill:#eceff4;fill-opacity:1;fill-rule:nonzero;stroke:none;stop-opacity:1"
     d="m 366.691,481.09 h -3.523 v 3.075 h 3.523 z" /></g>
    <g
   id="g1102"
   transform="matrix(3.3823207,0,0,3.3823207,-872.58144,-526.91842)"><g
     style="opacity:1;fill:#eceff4;stop-opacity:1"
     id="g3687">
      <g
   id="g3357"
   transform="translate(394.2461,208.4527)"
   style="opacity:1;fill:#eceff4;stop-opacity:1">
        <path
   d="M 0,0 C -2.992,0 -5.798,1.158 -7.901,3.261 L -29.919,25.28 c -2.103,2.102 -3.262,4.908 -3.262,7.9 0,2.992 1.159,5.798 3.262,7.901 2.101,2.102 4.907,3.26 7.899,3.26 2.992,0 5.797,-1.158 7.9,-3.26 L 7.901,19.061 c 4.355,-4.356 4.355,-11.445 0,-15.8 C 5.797,1.158 2.992,0 0,0 m -22.02,41.627 c -2.267,0 -4.39,-0.876 -5.981,-2.465 -1.59,-1.59 -2.466,-3.715 -2.466,-5.982 0,-2.267 0.876,-4.391 2.466,-5.981 L -5.982,5.179 C -4.392,3.589 -2.267,2.714 0,2.714 c 2.267,0 4.392,0.875 5.982,2.465 3.297,3.298 3.297,8.665 0,11.963 l -22.02,22.02 c -1.591,1.589 -3.715,2.465 -5.982,2.465"
   style="fill:#eceff4;fill-opacity:1;fill-rule:nonzero;stroke:none"
   id="path3359"
   inkscape:connector-curvature="0" />
      </g>
      <g
   id="g3361"
   transform="translate(378.5262,221.4512)"
   style="opacity:1;fill:#eceff4;stop-opacity:1">
        <path
   d="m 0,0 -13.241,13.241 c -3.817,3.817 -3.817,10.064 0,13.881 3.818,3.818 10.065,3.818 13.882,0 l 13.241,-13.24 z"
   style="fill:#eceff4;fill-opacity:1;fill-rule:nonzero;stroke:none"
   id="path3363"
   inkscape:connector-curvature="0" />
      </g>
    </g></g>
    <g
   id="g1121"
   transform="matrix(2.1122715,0,0,2.1122715,-128.42409,-372.00682)"><g
     style="fill:#eceff4"
     id="g4884">
      <path
   d="m 102.643,346.806 h -5.157 v 30.297 h 5.157 z"
   style="opacity:1;fill:#eceff4;fill-opacity:1;fill-rule:nonzero;stroke:none;stop-opacity:1"
   id="path3365"
   inkscape:connector-curvature="0" />
      <path
   d="m 125.849,346.806 h -5.157 v 30.297 h 5.157 z"
   style="opacity:1;fill:#eceff4;fill-opacity:1;fill-rule:nonzero;stroke:none;stop-opacity:1"
   id="path3367"
   inkscape:connector-curvature="0" />
      <path
   d="m 107.477,346.806 h -2.256 v 30.297 h 2.256 z"
   style="opacity:1;fill:#eceff4;fill-opacity:1;fill-rule:nonzero;stroke:none;stop-opacity:1"
   id="path3369"
   inkscape:connector-curvature="0" />
      <path
   d="m 113.601,346.806 h -5.157 v 30.297 h 5.157 z"
   style="opacity:1;fill:#eceff4;fill-opacity:1;fill-rule:nonzero;stroke:none;stop-opacity:1"
   id="path3371"
   inkscape:connector-curvature="0" />
      <path
   d="m 118.758,346.806 h -2.578 v 30.297 h 2.578 z"
   style="opacity:1;fill:#eceff4;fill-opacity:1;fill-rule:nonzero;stroke:none;stop-opacity:1"
   id="path3373"
   inkscape:connector-curvature="0" />
      <path
   d="m 131.65,346.806 h -2.578 v 30.297 h 2.578 z"
   style="opacity:1;fill:#eceff4;fill-opacity:1;fill-rule:nonzero;stroke:none;stop-opacity:1"
   id="path3375"
   inkscape:connector-curvature="0" />
      <g
   id="g3377"
   transform="translate(152.8359,363.5444)"
   style="opacity:1;fill:#eceff4;stop-opacity:1">
        <path
   d="M 0,0 C 0,1.792 -1.453,3.244 -3.245,3.244 -5.036,3.244 -6.489,1.792 -6.489,0 Z"
   style="fill:#eceff4;fill-opacity:1;fill-rule:nonzero;stroke:none"
   id="path3379"
   inkscape:connector-curvature="0" />
      </g>
      <g
   id="g3381"
   transform="translate(142.6083,362.7838)"
   style="opacity:1;fill:#eceff4;stop-opacity:1">
        <path
   d="M 0,0 V 14.319 H -5.157 V -3.367 C -3.651,-1.97 -1.917,-0.816 0,0"
   style="fill:#eceff4;fill-opacity:1;fill-rule:nonzero;stroke:none"
   id="path3383"
   inkscape:connector-curvature="0" />
      </g>
      <g
   id="g3385"
   transform="translate(165.9216,340.36)"
   style="opacity:1;fill:#eceff4;stop-opacity:1">
        <path
   d="m 0,0 h -32.66 c -1.424,0 -2.579,1.155 -2.579,2.578 0,1.424 1.155,2.579 2.579,2.579 H 0 C 1.424,5.157 2.578,4.002 2.578,2.578 2.578,1.155 1.424,0 0,0"
   style="fill:#eceff4;fill-opacity:1;fill-rule:nonzero;stroke:none"
   id="path3387"
   inkscape:connector-curvature="0" />
      </g>
      <g
   id="g3389"
   transform="translate(136.1621,358.0944)"
   style="opacity:1;fill:#eceff4;stop-opacity:1">
        <path
   d="M 0,0 V 19.008 H -2.578 V -3.843 C -1.885,-2.449 -1.018,-1.159 0,0"
   style="fill:#eceff4;fill-opacity:1;fill-rule:nonzero;stroke:none"
   id="path3391"
   inkscape:connector-curvature="0" />
      </g>
      <g
   id="g3393"
   transform="translate(149.5916,361.6264)"
   style="opacity:1;fill:#eceff4;stop-opacity:1">
        <path
   d="M 0,0 C -8.007,0 -14.599,-6.18 -15.256,-14.02 H 15.256 C 14.599,-6.18 8.007,0 0,0"
   style="fill:#eceff4;fill-opacity:1;fill-rule:nonzero;stroke:none"
   id="path3395"
   inkscape:connector-curvature="0" />
      </g>
    </g></g>
    
    
    
    
    <g
   id="g3427"
   transform="translate(890.5342,386.3271)">
        <path
   d="M 0,0 184.026,184.018"
   style="fill:none;stroke:#231f20;stroke-width:2.017;stroke-linecap:butt;stroke-linejoin:miter;stroke-miterlimit:4;stroke-dasharray:none;stroke-opacity:1"
   id="path3429"
   inkscape:connector-curvature="0" />
      </g><g
   id="g3431"
   transform="translate(890.5341,386.6225)">
        <path
   d="M 0,0 184.027,-184.027"
   style="fill:none;stroke:#231f20;stroke-width:2.017;stroke-linecap:butt;stroke-linejoin:miter;stroke-miterlimit:4;stroke-dasharray:none;stroke-opacity:1"
   id="path3433"
   inkscape:connector-curvature="0" />
      </g>
    
    
    
  </g>
</svg>
