<?xml version="1.0" encoding="UTF-8" standalone="no"?>
<svg
   width="297mm"
   height="210mm"
   viewBox="0 0 297 210"
   version="1.1"
   id="svg8"
   inkscape:version="1.2.2 (b0a8486541, 2022-12-01)"
   sodipodi:docname="education.svg"
   xmlns:inkscape="http://www.inkscape.org/namespaces/inkscape"
   xmlns:sodipodi="http://sodipodi.sourceforge.net/DTD/sodipodi-0.dtd"
   xmlns="http://www.w3.org/2000/svg"
   xmlns:svg="http://www.w3.org/2000/svg"
   xmlns:rdf="http://www.w3.org/1999/02/22-rdf-syntax-ns#"
   xmlns:cc="http://creativecommons.org/ns#"
   xmlns:dc="http://purl.org/dc/elements/1.1/">
  <defs
     id="defs2">
    <rect
       x="32.896137"
       y="231.11564"
       width="150.25032"
       height="21.368099"
       id="rect5210" />
    <rect
       x="9.1240066"
       y="198.08924"
       width="209.48703"
       height="8.8596064"
       id="rect4989" />
    <rect
       x="12.082016"
       y="187.73089"
       width="206.88329"
       height="16.077906"
       id="rect4983" />
    <rect
       x="15.856161"
       y="176.45993"
       width="171.37187"
       height="17.315844"
       id="rect4977" />
    <rect
       x="22.56789"
       y="157.79275"
       width="153.66661"
       height="37.743174"
       id="rect4971" />
    <rect
       x="33.979525"
       y="130.7603"
       width="167.53934"
       height="58.879668"
       id="rect4965" />
    <rect
       x="36.1447"
       y="138.49193"
       width="226.88811"
       height="32.0569"
       id="rect4751" />
    <rect
       x="35.428408"
       y="107.5132"
       width="166.73609"
       height="18.932537"
       id="rect4745" />
    <rect
       x="33.258591"
       y="75.881542"
       width="174.29292"
       height="21.002139"
       id="rect4739" />
    <rect
       x="19.366904"
       y="29.625836"
       width="258.18648"
       height="51.39582"
       id="rect4712" />
    <rect
       x="40.712574"
       y="495.30075"
       width="115.41316"
       height="17.401705"
       id="rect2657" />
    <rect
       x="8.8313293"
       y="27.998915"
       width="190.31702"
       height="48.158627"
       id="rect2207" />
    <rect
       x="8.8313293"
       y="27.998915"
       width="85.813248"
       height="83.878227"
       id="rect2207-5" />
    <rect
       x="8.8313293"
       y="27.998915"
       width="190.31702"
       height="48.158627"
       id="rect2224" />
    <rect
       x="8.8313293"
       y="27.998915"
       width="97.091652"
       height="75.218666"
       id="rect2207-8" />
    <rect
       x="8.8313293"
       y="27.998915"
       width="190.31702"
       height="48.158627"
       id="rect2312" />
    <rect
       x="8.8313293"
       y="27.998915"
       width="190.31702"
       height="48.158627"
       id="rect2207-8-3" />
    <rect
       x="8.8313293"
       y="27.998915"
       width="190.31702"
       height="48.158627"
       id="rect2400" />
    <rect
       x="8.8313293"
       y="27.998915"
       width="190.31702"
       height="48.158627"
       id="rect2207-8-8" />
    <rect
       x="8.8313293"
       y="27.998915"
       width="190.31702"
       height="48.158627"
       id="rect2400-9" />
    <rect
       x="8.8313293"
       y="27.998915"
       width="178.64267"
       height="18.151253"
       id="rect2207-8-8-4" />
    <rect
       x="8.8313293"
       y="27.998915"
       width="190.31702"
       height="48.158627"
       id="rect2552" />
    <rect
       x="8.8313293"
       y="27.998915"
       width="178.56918"
       height="48.727043"
       id="rect2207-8-8-3" />
    <rect
       x="8.8313293"
       y="27.998915"
       width="190.31702"
       height="48.158627"
       id="rect2552-3" />
    <rect
       x="40.712574"
       y="495.30075"
       width="115.41316"
       height="17.672302"
       id="rect2657-8" />
    <rect
       x="40.712574"
       y="495.30075"
       width="107.27708"
       height="17.707369"
       id="rect2670" />
    <rect
       x="40.712574"
       y="495.30075"
       width="115.41316"
       height="17.707369"
       id="rect2657-8-9" />
    <rect
       x="40.712574"
       y="495.30075"
       width="107.27708"
       height="17.707369"
       id="rect2714" />
    <rect
       x="40.712574"
       y="495.30075"
       width="115.41316"
       height="17.895838"
       id="rect2657-8-9-7" />
    <rect
       x="40.712574"
       y="495.30075"
       width="107.27708"
       height="17.707369"
       id="rect2757" />
    <rect
       x="40.712574"
       y="495.30075"
       width="107.27708"
       height="17.707369"
       id="rect2657-8-9-7-4" />
    <rect
       x="40.712574"
       y="495.30075"
       width="107.27708"
       height="17.707369"
       id="rect2800" />
    <rect
       x="40.712574"
       y="495.30075"
       width="107.27708"
       height="17.707369"
       id="rect2657-8-9-0" />
    <rect
       x="40.712574"
       y="495.30075"
       width="107.27708"
       height="17.707369"
       id="rect2867" />
    <rect
       x="40.712574"
       y="495.30075"
       width="107.27708"
       height="17.707369"
       id="rect2657-8-9-0-0" />
    <rect
       x="40.712574"
       y="495.30075"
       width="107.27708"
       height="17.707369"
       id="rect2910" />
    <rect
       x="40.712574"
       y="495.30075"
       width="107.27708"
       height="17.707369"
       id="rect2657-8-9-0-2" />
    <rect
       x="40.712574"
       y="495.30075"
       width="107.27708"
       height="17.707369"
       id="rect2910-5" />
    <rect
       x="40.712574"
       y="495.30075"
       width="107.27708"
       height="17.707369"
       id="rect2657-8-9-0-05" />
    <rect
       x="40.712574"
       y="495.30075"
       width="107.27708"
       height="17.707369"
       id="rect2910-9" />
    <rect
       x="40.712574"
       y="495.30075"
       width="107.27708"
       height="17.707369"
       id="rect2657-8-9-0-9" />
    <rect
       x="40.712574"
       y="495.30075"
       width="107.27708"
       height="17.707369"
       id="rect2910-2" />
    <rect
       x="40.712574"
       y="495.30075"
       width="107.27708"
       height="17.707369"
       id="rect2657-8-9-0-4" />
    <rect
       x="40.712574"
       y="495.30075"
       width="107.27708"
       height="17.707369"
       id="rect2910-7" />
    <rect
       x="40.712574"
       y="495.30075"
       width="107.27708"
       height="17.707369"
       id="rect2657-8-9-0-5" />
    <rect
       x="40.712574"
       y="495.30075"
       width="107.27708"
       height="17.707369"
       id="rect2910-4" />
    <rect
       x="9.1240063"
       y="198.08923"
       width="167.68151"
       height="18.025395"
       id="rect4989-8" />
    <rect
       x="9.1240063"
       y="198.08923"
       width="209.48703"
       height="8.8596067"
       id="rect5145" />
    <rect
       x="9.1240063"
       y="198.08923"
       width="167.13515"
       height="16.107238"
       id="rect4989-9" />
    <rect
       x="9.1240063"
       y="198.08923"
       width="209.48703"
       height="8.8596067"
       id="rect5181" />
    <rect
       x="35.42841"
       y="107.5132"
       width="166.73608"
       height="18.932537"
       id="rect4745-2" />
    <rect
       x="35.42841"
       y="107.5132"
       width="166.73608"
       height="18.932537"
       id="rect5399" />
    <rect
       x="9.1240063"
       y="198.08923"
       width="168.19483"
       height="17.463813"
       id="rect4989-9-5" />
    <rect
       x="9.1240063"
       y="198.08923"
       width="209.48703"
       height="8.8596067"
       id="rect5449" />
  </defs>
  <sodipodi:namedview
     id="base"
     pagecolor="#ffffff"
     bordercolor="#666666"
     borderopacity="1.0"
     inkscape:pageopacity="0.0"
     inkscape:pageshadow="2"
     inkscape:zoom="0.90509668"
     inkscape:cx="556.29416"
     inkscape:cy="370.12621"
     inkscape:document-units="mm"
     inkscape:current-layer="layer1"
     inkscape:document-rotation="0"
     showgrid="false"
     inkscape:window-width="1920"
     inkscape:window-height="1011"
     inkscape:window-x="0"
     inkscape:window-y="0"
     inkscape:window-maximized="1"
     showguides="true"
     inkscape:guide-bbox="true"
     inkscape:showpageshadow="2"
     inkscape:pagecheckerboard="0"
     inkscape:deskcolor="#d1d1d1">
    <sodipodi:guide
       position="207.5515,151.53479"
       orientation="1,0"
       id="guide5134"
       inkscape:locked="false" />
  </sodipodi:namedview>
  <metadata
     id="metadata5">
    <rdf:RDF>
      <cc:Work
         rdf:about="">
        <dc:format>image/svg+xml</dc:format>
        <dc:type
           rdf:resource="http://purl.org/dc/dcmitype/StillImage" />
        <dc:title />
      </cc:Work>
    </rdf:RDF>
  </metadata>
  <g
     inkscape:label="Calque 1"
     inkscape:groupmode="layer"
     id="layer1">
    <g
       id="g158"
       transform="matrix(0.1424101,0,0,0.1424101,217.94367,53.095994)" />
    <g
       id="g160"
       transform="matrix(0.1424101,0,0,0.1424101,217.94367,53.095994)" />
    <g
       id="g162"
       transform="matrix(0.1424101,0,0,0.1424101,217.94367,53.095994)" />
    <g
       id="g164"
       transform="matrix(0.1424101,0,0,0.1424101,217.94367,53.095994)" />
    <g
       id="g166"
       transform="matrix(0.1424101,0,0,0.1424101,217.94367,53.095994)" />
    <g
       id="g168"
       transform="matrix(0.1424101,0,0,0.1424101,217.94367,53.095994)" />
    <g
       id="g170"
       transform="matrix(0.1424101,0,0,0.1424101,217.94367,53.095994)" />
    <text
       xml:space="preserve"
       style="font-style:normal;font-variant:normal;font-weight:bold;font-stretch:normal;font-size:8.46667px;line-height:1.25;font-family:Khand;-inkscape-font-specification:'Khand, Bold';font-variant-ligatures:normal;font-variant-caps:normal;font-variant-numeric:normal;font-variant-east-asian:normal;letter-spacing:0px;word-spacing:0px;stroke-width:0.264583"
       x="121.05953"
       y="15.129248"
       id="text4684"><tspan
         sodipodi:role="line"
         id="tspan4682"
         x="121.05953"
         y="15.129248"
         style="font-style:normal;font-variant:normal;font-weight:bold;font-stretch:normal;font-size:8.46667px;font-family:Khand;-inkscape-font-specification:'Khand, Bold';font-variant-ligatures:normal;font-variant-caps:normal;font-variant-numeric:normal;font-variant-east-asian:normal;stroke-width:0.264583">Service Éducation</tspan></text>
    <text
       xml:space="preserve"
       id="text4710"
       style="font-style:normal;font-variant:normal;font-weight:normal;font-stretch:normal;font-size:6.35px;line-height:1.25;font-family:Poppins;-inkscape-font-specification:'Poppins, Normal';font-variant-ligatures:normal;font-variant-caps:normal;font-variant-numeric:normal;font-variant-east-asian:normal;letter-spacing:0px;word-spacing:0px;white-space:pre;shape-inside:url(#rect4712);display:inline"
       transform="translate(1.8088028,-4.4857545)"><tspan
         x="19.367188"
         y="35.18125"
         id="tspan3831"><tspan
           style="shape-inside:url(#rect4712)"
           id="tspan3829">En charge des écoles, de la médiathèque et des infrastructures sportives de la </tspan></tspan><tspan
         x="19.367188"
         y="43.11875"
         id="tspan3835"><tspan
           style="shape-inside:url(#rect4712)"
           id="tspan3833">ville vous vous assurez de leur bon fonctionnement et de leur entretien. Vous </tspan></tspan><tspan
         x="19.367188"
         y="51.05625"
         id="tspan3839"><tspan
           style="shape-inside:url(#rect4712)"
           id="tspan3837">avez aussi la responsabilité des événements sportifs et culturels.</tspan></tspan></text>
    <text
       xml:space="preserve"
       style="font-style:normal;font-variant:normal;font-weight:bold;font-stretch:normal;font-size:6.35px;line-height:1.25;font-family:Khand;-inkscape-font-specification:'Khand, Bold';font-variant-ligatures:normal;font-variant-caps:normal;font-variant-numeric:normal;font-variant-east-asian:normal;letter-spacing:0px;word-spacing:0px;stroke-width:0.264583"
       x="20.781143"
       y="62.866295"
       id="text4718"><tspan
         sodipodi:role="line"
         id="tspan4716"
         x="20.781143"
         y="62.866295"
         style="font-style:normal;font-variant:normal;font-weight:bold;font-stretch:normal;font-size:6.35px;font-family:Khand;-inkscape-font-specification:'Khand, Bold';font-variant-ligatures:normal;font-variant-caps:normal;font-variant-numeric:normal;font-variant-east-asian:normal;stroke-width:0.264583">Vous êtes objectivés sur :​</tspan></text>
    <text
       xml:space="preserve"
       style="font-size:8.46667px;line-height:1.25;font-family:Cantarell;-inkscape-font-specification:'Cantarell, Normal';letter-spacing:0px;word-spacing:0px;stroke-width:0.264583"
       x="83.806458"
       y="83.749802"
       id="text4722"><tspan
         sodipodi:role="line"
         x="83.806458"
         y="83.749802"
         style="stroke-width:0.264583"
         id="tspan4730" /></text>
    <text
       xml:space="preserve"
       id="text4737"
       style="font-style:normal;font-variant:normal;font-weight:normal;font-stretch:normal;font-size:4.93889px;line-height:1.25;font-family:Poppins;-inkscape-font-specification:'Poppins, Normal';font-variant-ligatures:normal;font-variant-caps:normal;font-variant-numeric:normal;font-variant-east-asian:normal;letter-spacing:0px;word-spacing:0px;white-space:pre;shape-inside:url(#rect4739);display:inline"
       transform="translate(0.02652682,-6.8791685)"><tspan
         x="33.257812"
         y="80.202388"
         id="tspan3841">Réduire le nombres de redoublants</tspan></text>
    <text
       xml:space="preserve"
       id="text4743"
       style="font-style:normal;font-variant:normal;font-weight:normal;font-stretch:normal;font-size:4.93889px;line-height:1.25;font-family:Poppins;-inkscape-font-specification:'Poppins, Normal';font-variant-ligatures:normal;font-variant-caps:normal;font-variant-numeric:normal;font-variant-east-asian:normal;letter-spacing:0px;word-spacing:0px;white-space:pre;shape-inside:url(#rect4745);display:inline"
       transform="translate(-1.7141361,-26.967967)"><tspan
         x="35.427734"
         y="111.8352"
         id="tspan3845">Augmenter<tspan
   style="shape-inside:url(#rect4745)"
   id="tspan3843"> le nombre d'événements sportifs.
</tspan></tspan></text>
    <path
       d="m 28.55654,73.939225 c -0.10946,0 -0.21248,-0.04507 -0.289744,-0.119116 l -0.24145,-0.241452 c -0.07726,-0.07726 -0.122337,-0.183504 -0.122337,-0.292961 0,-0.109458 0.04507,-0.215698 0.122337,-0.289743 l 0.943271,-0.946491 h -2.266428 c -0.231794,0 -0.376665,-0.193161 -0.376665,-0.412077 v -0.412079 c 0,-0.218915 0.144871,-0.412077 0.376665,-0.412077 h 2.266428 l -0.943271,-0.946491 c -0.07726,-0.07405 -0.122337,-0.180285 -0.122337,-0.289742 0,-0.109458 0.04507,-0.215698 0.122337,-0.289743 l 0.24145,-0.241451 c 0.07726,-0.07726 0.180284,-0.122336 0.289744,-0.122336 0.109458,0 0.215695,0.04507 0.292962,0.122336 l 2.0958,2.095801 c 0.07726,0.07405 0.119117,0.180285 0.119117,0.289743 0,0.109457 -0.04185,0.215697 -0.119117,0.292961 l -2.0958,2.095802 c -0.07727,0.07405 -0.183504,0.119116 -0.292962,0.119116 z"
       id="path4911"
       style="fill:#bf616a;stroke-width:0.00321935" />
    <path
       d="m 28.55654,85.981228 c -0.109459,0 -0.212479,-0.04507 -0.289743,-0.119116 L 28.025346,85.62066 c -0.07726,-0.07726 -0.122336,-0.183504 -0.122336,-0.292961 0,-0.109458 0.04507,-0.215698 0.122336,-0.289743 l 0.943272,-0.946492 h -2.266429 c -0.231793,0 -0.376665,-0.19316 -0.376665,-0.412076 v -0.412079 c 0,-0.218916 0.144871,-0.412078 0.376665,-0.412078 h 2.266429 l -0.943272,-0.94649 c -0.07726,-0.07405 -0.122336,-0.180285 -0.122336,-0.289743 0,-0.109457 0.04507,-0.215698 0.122336,-0.289743 l 0.241451,-0.24145 c 0.07726,-0.07726 0.180284,-0.122337 0.289743,-0.122337 0.109458,0 0.215696,0.04507 0.292962,0.122337 l 2.095801,2.0958 c 0.07726,0.07405 0.119116,0.180286 0.119116,0.289744 0,0.109457 -0.04185,0.215697 -0.119116,0.292961 l -2.095801,2.095801 c -0.07727,0.07405 -0.183504,0.119116 -0.292962,0.119117 z"
       id="path4911-0"
       style="fill:#bf616a;stroke-width:0.00321935" />
    <rect
       style="fill:none;stroke:#bf616a;stroke-width:1.5;stroke-linecap:round;stroke-linejoin:round"
       id="rect4957"
       width="190.7861"
       height="54.592487"
       x="16.765404"
       y="54.760738" />
    <text
       xml:space="preserve"
       style="font-style:normal;font-variant:normal;font-weight:bold;font-stretch:normal;font-size:6.35px;line-height:1.25;font-family:Khand;-inkscape-font-specification:'Khand, Bold';font-variant-ligatures:normal;font-variant-caps:normal;font-variant-numeric:normal;font-variant-east-asian:normal;letter-spacing:0px;word-spacing:0px;stroke-width:0.264583"
       x="20.590643"
       y="131.57947"
       id="text4961"><tspan
         sodipodi:role="line"
         id="tspan3633"
         x="20.590643"
         y="131.57947">Objectifs tactiques de l'équipe précédente</tspan></text>
    <rect
       style="fill:none;stroke:#5e81ac;stroke-width:1.5;stroke-linecap:round;stroke-linejoin:round"
       id="rect4957-4"
       width="190.90991"
       height="75.878593"
       x="16.641592"
       y="121.21156" />
    <circle
       style="fill:#5e81ac;stroke:none;stroke-width:0.969506;stroke-linecap:round;stroke-linejoin:round"
       id="path3041"
       cx="28.694971"
       cy="166.73631"
       r="1.6418267" />
    <text
       xml:space="preserve"
       id="text4987-2"
       style="font-style:normal;font-variant:normal;font-weight:normal;font-stretch:normal;font-size:4.93889px;line-height:1.25;font-family:Poppins;-inkscape-font-specification:'Poppins, Normal';font-variant-ligatures:normal;font-variant-caps:normal;font-variant-numeric:normal;font-variant-east-asian:normal;letter-spacing:0px;word-spacing:0px;white-space:pre;shape-inside:url(#rect4989-8);display:inline"
       transform="translate(24.337337,-34.261875)"><tspan
         x="9.1230469"
         y="202.41137"
         id="tspan3849"><tspan
           style="shape-inside:url(#rect4989-8)"
           id="tspan3847">Concours du plus gros tas de matière plastique par écoles.</tspan></tspan></text>
    <text
       xml:space="preserve"
       id="text4987-9"
       style="font-style:normal;font-variant:normal;font-weight:normal;font-stretch:normal;font-size:4.93889px;line-height:1.25;font-family:Poppins;-inkscape-font-specification:'Poppins, Normal';font-variant-ligatures:normal;font-variant-caps:normal;font-variant-numeric:normal;font-variant-east-asian:normal;letter-spacing:0px;word-spacing:0px;white-space:pre;shape-inside:url(#rect4989-9);display:inline"
       transform="translate(24.34216,-54.457031)"><tspan
         x="9.1230469"
         y="202.41137"
         id="tspan3853"><tspan
           style="shape-inside:url(#rect4989-9)"
           id="tspan3851">Organiser la course de relais du sac en plastique : on saute dans </tspan></tspan><tspan
         x="9.1230469"
         y="208.58499"
         id="tspan3857"><tspan
           style="shape-inside:url(#rect4989-9)"
           id="tspan3855">des sac en plastique, inscription pour payer les arbres de la ville.</tspan></tspan></text>
    <circle
       style="fill:#5e81ac;stroke:none;stroke-width:0.969506;stroke-linecap:round;stroke-linejoin:round"
       id="path3041-27"
       cx="28.694971"
       cy="149.72685"
       r="1.6418267" />
    <text
       xml:space="preserve"
       id="text4743-1"
       style="font-style:normal;font-variant:normal;font-weight:normal;font-stretch:normal;font-size:4.93889px;line-height:1.25;font-family:Poppins;-inkscape-font-specification:'Poppins, Normal';font-variant-ligatures:normal;font-variant-caps:normal;font-variant-numeric:normal;font-variant-east-asian:normal;letter-spacing:0px;word-spacing:0px;white-space:pre;shape-inside:url(#rect4745-2);display:inline"
       transform="translate(-1.7141361,-14.625718)"><tspan
         x="35.427734"
         y="111.8352"
         id="tspan3861">Augmenter<tspan
   style="shape-inside:url(#rect4745-2)"
   id="tspan3859"> Le nombre d'expositions sur les notables de la ville
</tspan></tspan></text>
    <circle
       style="fill:#5e81ac;stroke:none;stroke-width:0.969506;stroke-linecap:round;stroke-linejoin:round"
       id="path3041-61"
       cx="28.694971"
       cy="183.74579"
       r="1.6418267" />
    <text
       xml:space="preserve"
       id="text4987-9-9"
       style="font-style:normal;font-variant:normal;font-weight:normal;font-stretch:normal;font-size:4.93889px;line-height:1.25;font-family:Poppins;-inkscape-font-specification:'Poppins, Normal';font-variant-ligatures:normal;font-variant-caps:normal;font-variant-numeric:normal;font-variant-east-asian:normal;letter-spacing:0px;word-spacing:0px;white-space:pre;shape-inside:url(#rect4989-9-5);display:inline"
       transform="translate(24.337337,-20.43808)"><tspan
         x="9.1230469"
         y="202.41137"
         id="tspan3863">Organiser des expositions sur l'art d'entretenir les arbres en </tspan><tspan
         x="9.1230469"
         y="208.58499"
         id="tspan3865">plastique.</tspan></text>
    <path
       d="m 28.55654,98.42235 c -0.109459,0 -0.212479,-0.0451 -0.289743,-0.11912 l -0.241451,-0.24145 c -0.07726,-0.0773 -0.122336,-0.1835 -0.122336,-0.29296 0,-0.10946 0.04507,-0.2157 0.122336,-0.28974 l 0.943272,-0.946492 h -2.266429 c -0.231793,0 -0.376665,-0.19316 -0.376665,-0.412076 v -0.412079 c 0,-0.218916 0.144871,-0.412078 0.376665,-0.412078 h 2.266429 l -0.943272,-0.94649 c -0.07726,-0.07405 -0.122336,-0.180285 -0.122336,-0.289743 0,-0.109457 0.04507,-0.215698 0.122336,-0.289743 l 0.241451,-0.24145 c 0.07726,-0.07726 0.180284,-0.122337 0.289743,-0.122337 0.109458,0 0.215696,0.04507 0.292962,0.122337 l 2.095801,2.0958 c 0.07726,0.07405 0.119116,0.180286 0.119116,0.289744 0,0.109457 -0.04185,0.215697 -0.119116,0.292961 l -2.095801,2.095796 c -0.07727,0.074 -0.183504,0.11912 -0.292962,0.11912 z"
       id="path4911-0-3"
       style="fill:#bf616a;stroke-width:0.00321935" />
    <g
       id="g1517"
       transform="matrix(0.91725561,0,0,0.91725561,20.42042,5.3495092)">
      <polygon
         style="fill:#e6be94"
         points="23.781,268 119.782,268 255.781,132 391.784,268 487.781,268 487.781,484 23.781,484 "
         id="polygon2"
         transform="matrix(0.1424101,0,0,0.1424101,217.94367,53.095994)" />
      <rect
         x="247.53378"
         y="108.35111"
         style="fill:#996459;stroke-width:0.14241"
         width="13.67137"
         height="13.67137"
         id="rect6" />
      <path
         style="fill:#81a1c1;stroke-width:0.14241"
         d="M 260.92033,103.79399 H 247.8186 c -0.15736,0 -0.28482,0.12746 -0.28482,0.28482 v 4.2723 h 13.67137 v -4.2723 c 0,-0.15736 -0.12745,-0.28482 -0.28482,-0.28482 z"
         id="path10" />
      <g
         id="g16"
         transform="matrix(0.1424101,0,0,0.1424101,217.94367,53.095994)"
         style="fill:#d08770">
        <path
           style="fill:#d08770"
           d="m 329.617,68 13.039,-19.562 c 1.633,-2.453 1.789,-5.609 0.398,-8.211 C 341.663,37.625 338.953,36 336,36 h -80 c -4.422,0 -8,3.578 -8,8 v 48 c 0,4.422 3.578,8 8,8 h 80 c 2.953,0 5.664,-1.625 7.055,-4.227 1.391,-2.602 1.234,-5.758 -0.398,-8.211 z"
           id="path14" />
      </g>
      <g
         id="g22"
         transform="matrix(0.1424101,0,0,0.1424101,217.94367,53.095994)"
         style="fill:#4c566a">
        <g
           id="g20"
           style="fill:#4c566a">
          <path
             style="fill:#4c566a"
             d="m 256,140 c -4.422,0 -8,-3.578 -8,-8 V 28 c 0,-4.422 3.578,-8 8,-8 4.422,0 8,3.578 8,8 v 104 c 0,4.422 -3.578,8 -8,8 z"
             id="path18" />
        </g>
      </g>
      <path
         style="fill:#d08770;stroke-width:0.14241"
         d="m 259.01346,77.154471 c 0.17574,-0.426091 0.59186,-0.703221 1.05255,-0.703221 h 21.64634 c 0.38935,0 0.75207,0.19909 0.96127,0.527345 l 7.97496,12.532089 c 0.22359,0.35161 0.23697,0.795503 0.0379,1.160357 -0.20022,0.363858 -0.58302,0.590717 -0.99915,0.590717 H 272.5981 c -0.30262,0 -0.59185,-0.120194 -0.80547,-0.333809 L 259.26054,78.39586 c -0.32612,-0.325834 -0.42409,-0.815298 -0.24708,-1.241389 z"
         id="path24" />
      <path
         style="fill:#d08770;stroke-width:0.14241"
         d="m 249.7568,77.154471 c -0.17587,-0.426233 -0.59199,-0.703221 -1.05255,-0.703221 h -21.64633 c -0.38935,0 -0.75207,0.19909 -0.96127,0.527345 l -7.97497,12.532089 c -0.22358,0.35161 -0.23697,0.795503 -0.0379,1.160357 0.20037,0.363858 0.58303,0.59086 0.99915,0.59086 h 17.08921 c 0.30262,0 0.59186,-0.120194 0.80547,-0.333809 L 249.5097,78.396003 c 0.32598,-0.325977 0.42396,-0.815441 0.24708,-1.241532 z"
         id="path28" />
      <g
         id="g34"
         transform="matrix(0.1424101,0,0,0.1424101,217.94367,53.095994)"
         style="fill:#bf616a">
        <path
           style="fill:#bf616a"
           d="m 391.891,275.891 c -2.047,0 -4.094,-0.781 -5.656,-2.344 L 256,143.313 125.766,273.547 c -3.125,3.125 -8.188,3.125 -11.313,0 -3.125,-3.125 -3.125,-8.188 0,-11.313 L 250.344,126.343 c 3.125,-3.125 8.188,-3.125 11.313,0 l 135.891,135.891 c 3.125,3.125 3.125,8.188 0,11.313 -1.564,1.562 -3.61,2.344 -5.657,2.344 z"
           id="path32" />
      </g>
      <circle
         style="fill:#ebcb8b;stroke-width:0.14241"
         cx="254.4008"
         cy="91.261902"
         r="6.8356848"
         id="circle38" />
      <path
         style="fill:#4c566a;stroke-width:0.14241"
         d="m 254.40066,86.704778 c -0.62974,0 -1.13929,0.509543 -1.13929,1.13928 v 2.278562 h -2.27856 c -0.62973,0 -1.13928,0.509543 -1.13928,1.139281 0,0.629737 0.50955,1.139281 1.13928,1.139281 h 3.41785 c 0.62973,0 1.13928,-0.509544 1.13928,-1.139281 v -3.417843 c 0,-0.629737 -0.50955,-1.13928 -1.13928,-1.13928 z"
         id="path42" />
      <g
         id="g48"
         transform="matrix(0.1424101,0,0,0.1424101,217.94367,53.095994)"
         style="fill:#81a1c1">
        <path
           style="fill:#81a1c1"
           d="m 375.781,320 c 0,-11.046 -8.954,-20 -20,-20 -11.046,0 -20,8.954 -20,20 0,1.37 0.141,2.707 0.403,4 h -0.403 v 32 h 40 v -32 h -0.403 c 0.263,-1.293 0.403,-2.63 0.403,-4 z"
           id="path46" />
      </g>
      <g
         id="g52"
         transform="matrix(0.1424101,0,0,0.1424101,217.94367,53.095994)"
         style="fill:#4c566a">
        <path
           style="fill:#4c566a"
           d="m 356,292 c -15.438,0 -28,12.562 -28,28 v 36 c 0,4.422 3.578,8 8,8 h 40 c 4.422,0 8,-3.578 8,-8 v -36 c 0,-15.438 -12.562,-28 -28,-28 z m 0,16 c 6.617,0 12,5.383 12,12 v 4 h -24 v -4 c 0,-6.617 5.383,-12 12,-12 z m -12,40 v -8 h 24 v 8 z"
           id="path50" />
      </g>
      <g
         id="g58"
         transform="matrix(0.1424101,0,0,0.1424101,217.94367,53.095994)"
         style="fill:#81a1c1">
        <rect
           x="136.00101"
           y="396"
           style="fill:#81a1c1"
           width="40"
           height="48"
           id="rect56" />
      </g>
      <g
         id="g62"
         transform="matrix(0.1424101,0,0,0.1424101,217.94367,53.095994)"
         style="fill:#4c566a">
        <path
           style="fill:#4c566a"
           d="m 176,388 h -40 c -4.422,0 -8,3.578 -8,8 v 48 c 0,4.422 3.578,8 8,8 h 40 c 4.422,0 8,-3.578 8,-8 v -48 c 0,-4.422 -3.578,-8 -8,-8 z m -8,16 v 8 h -24 v -8 z m -24,32 v -8 h 24 v 8 z"
           id="path60" />
      </g>
      <g
         id="g68"
         transform="matrix(0.1424101,0,0,0.1424101,217.94367,53.095994)"
         style="fill:#81a1c1">
        <rect
           x="63.782001"
           y="396"
           style="fill:#81a1c1"
           width="40"
           height="48"
           id="rect66" />
      </g>
      <g
         id="g72"
         transform="matrix(0.1424101,0,0,0.1424101,217.94367,53.095994)"
         style="fill:#4c566a">
        <path
           style="fill:#4c566a"
           d="m 103.781,388 h -40 c -4.422,0 -8,3.578 -8,8 v 48 c 0,4.422 3.578,8 8,8 h 40 c 4.422,0 8,-3.578 8,-8 v -48 c 0,-4.422 -3.578,-8 -8,-8 z m -8,16 v 8 h -24 v -8 z m -24,32 v -8 h 24 v 8 z"
           id="path70" />
      </g>
      <g
         id="g78"
         transform="matrix(0.1424101,0,0,0.1424101,217.94367,53.095994)"
         style="fill:#81a1c1">
        <rect
           x="408"
           y="396"
           style="fill:#81a1c1"
           width="40"
           height="48"
           id="rect76" />
      </g>
      <path
         style="fill:#434c5e;stroke-width:0.14241"
         d="m 281.74339,108.35111 h -5.6964 c -0.62974,0 -1.13928,0.50955 -1.13928,1.13928 v 6.83569 c 0,0.62974 0.50954,1.13928 1.13928,1.13928 h 5.6964 c 0.62974,0 1.13929,-0.50954 1.13929,-1.13928 v -6.83569 c 0,-0.62973 -0.50955,-1.13928 -1.13929,-1.13928 z m -1.13928,2.27856 v 1.13929 h -3.41784 v -1.13929 z m -3.41784,4.55713 v -1.13928 h 3.41784 v 1.13928 z"
         id="path80" />
      <g
         id="g88"
         transform="matrix(0.1424101,0,0,0.1424101,217.94367,53.095994)"
         style="fill:#81a1c1">
        <rect
           x="335.78201"
           y="396"
           style="fill:#81a1c1"
           width="40"
           height="48"
           id="rect86" />
      </g>
      <g
         id="g92"
         transform="matrix(0.1424101,0,0,0.1424101,217.94367,53.095994)"
         style="fill:#4c566a">
        <path
           style="fill:#4c566a"
           d="m 375.781,388 h -40 c -4.422,0 -8,3.578 -8,8 v 48 c 0,4.422 3.578,8 8,8 h 40 c 4.422,0 8,-3.578 8,-8 v -48 c 0,-4.422 -3.578,-8 -8,-8 z m -8,16 v 8 h -24 v -8 z m -24,32 v -8 h 24 v 8 z"
           id="path90" />
      </g>
      <path
         style="fill:#81a1c1;stroke-width:0.14241"
         d="m 281.68116,98.667226 c 0,-1.573062 -1.27514,-2.848202 -2.8482,-2.848202 -1.57306,0 -2.8482,1.27514 -2.8482,2.848202 0,0.195102 0.0201,0.385504 0.0574,0.56964 h -0.0574 v 4.557124 h 5.6964 v -4.557124 h -0.0574 c 0.0373,-0.184136 0.0574,-0.374538 0.0574,-0.56964 z"
         id="path96" />
      <path
         style="fill:#4c566a;stroke-width:0.14241"
         d="m 278.864,94.679743 c -2.19852,0 -3.98748,1.788956 -3.98748,3.987483 v 5.126764 c 0,0.62974 0.50955,1.13928 1.13928,1.13928 h 5.69641 c 0.62973,0 1.13928,-0.50954 1.13928,-1.13928 v -5.126764 c 0,-2.198527 -1.78896,-3.987483 -3.98749,-3.987483 z m 0,2.278562 c 0.94233,0 1.70893,0.766593 1.70893,1.708921 v 0.56964 h -3.41785 v -0.56964 c 0,-0.942328 0.7666,-1.708921 1.70892,-1.708921 z m -1.70892,5.696405 v -1.13928 h 3.41785 v 1.13928 z"
         id="path100" />
      <g
         id="g108"
         transform="matrix(0.1424101,0,0,0.1424101,217.94367,53.095994)"
         style="fill:#81a1c1">
        <path
           style="fill:#81a1c1"
           d="m 103.563,320 c 0,-11.046 -8.954,-20 -20,-20 -11.046,0 -20,8.954 -20,20 0,1.37 0.141,2.707 0.403,4 h -0.403 v 32 h 40 v -32 h -0.403 c 0.262,-1.293 0.403,-2.63 0.403,-4 z"
           id="path106" />
      </g>
      <g
         id="g112"
         transform="matrix(0.1424101,0,0,0.1424101,217.94367,53.095994)"
         style="fill:#4c566a">
        <path
           style="fill:#4c566a"
           d="m 83.781,292 c -15.438,0 -28,12.562 -28,28 v 36 c 0,4.422 3.578,8 8,8 h 40 c 4.422,0 8,-3.578 8,-8 v -36 c 0,-15.438 -12.562,-28 -28,-28 z m 0,16 c 6.617,0 12,5.383 12,12 v 4 h -24 v -4 c 0,-6.617 5.383,-12 12,-12 z m -12,40 v -8 h 24 v 8 z"
           id="path110" />
      </g>
      <g
         id="g118"
         transform="matrix(0.1424101,0,0,0.1424101,217.94367,53.095994)"
         style="fill:#81a1c1">
        <path
           style="fill:#81a1c1"
           d="m 175.344,320 c 0,-11.046 -8.954,-20 -20,-20 -11.046,0 -20,8.954 -20,20 0,1.37 0.141,2.707 0.403,4 h -0.403 v 32 h 40 v -32 h -0.403 c 0.262,-1.293 0.403,-2.63 0.403,-4 z"
           id="path116" />
      </g>
      <g
         id="g122"
         transform="matrix(0.1424101,0,0,0.1424101,217.94367,53.095994)"
         style="fill:#4c566a">
        <path
           style="fill:#4c566a"
           d="m 155.563,292 c -15.438,0 -28,12.562 -28,28 v 36 c 0,4.422 3.578,8 8,8 h 40 c 4.422,0 8,-3.578 8,-8 v -36 c 0,-15.438 -12.563,-28 -28,-28 z m 0,16 c 6.617,0 12,5.383 12,12 v 4 h -24 v -4 c 0,-6.617 5.382,-12 12,-12 z m -12,40 v -8 h 24 v 8 z"
           id="path120" />
      </g>
      <path
         style="fill:#4c566a;stroke-width:0.14241"
         d="m 254.40066,99.236866 c -4.39749,0 -7.97497,-3.577484 -7.97497,-7.974965 0,-4.397482 3.57748,-7.974966 7.97497,-7.974966 4.39748,0 7.97496,3.577484 7.97496,7.974966 0,4.397481 -3.57748,7.974965 -7.97496,7.974965 z m 0,-13.671369 c -3.14086,0 -5.69641,2.555264 -5.69641,5.696404 0,3.141139 2.55555,5.696404 5.69641,5.696404 3.14085,0 5.6964,-2.555265 5.6964,-5.696404 0,-3.14114 -2.55555,-5.696404 -5.6964,-5.696404 z"
         id="path126" />
      <path
         style="fill:#4c566a;stroke-width:0.14241"
         d="m 258.95778,102.65471 h -9.11425 c -1.88465,0 -3.41784,1.53319 -3.41784,3.41784 v 15.94993 c 0,0.62974 0.50954,1.13928 1.13928,1.13928 0.62974,0 1.13928,-0.50954 1.13928,-1.13928 v -12.53209 h 4.52594 v 12.53209 h 2.27856 v -12.53209 h 4.58831 v 12.53209 c 0,0.62974 0.50954,1.13928 1.13928,1.13928 0.62974,0 1.13928,-0.50954 1.13928,-1.13928 v -15.94993 c 0,-1.88465 -1.53319,-3.41784 -3.41784,-3.41784 z m 1.13928,4.55712 h -11.39281 v -1.13928 c 0,-0.6286 0.51068,-1.13928 1.13928,-1.13928 h 9.11425 c 0.6286,0 1.13928,0.51068 1.13928,1.13928 z"
         id="path130" />
      <g
         id="g136"
         transform="matrix(0.1424101,0,0,0.1424101,217.94367,53.095994)"
         style="fill:#2e3440">
        <path
           style="fill:#2e3440"
           d="M 504,492 H 8 c -4.422,0 -8,-3.578 -8,-8 0,-4.422 3.578,-8 8,-8 h 496 c 4.422,0 8,3.578 8,8 0,4.422 -3.578,8 -8,8 z"
           id="path134" />
      </g>
    </g>
    <g
       id="g142"
       transform="matrix(0.1424101,0,0,0.1424101,217.94367,53.095994)" />
    <g
       id="g144"
       transform="matrix(0.1424101,0,0,0.1424101,217.94367,53.095994)" />
    <g
       id="g146"
       transform="matrix(0.1424101,0,0,0.1424101,217.94367,53.095994)" />
    <g
       id="g148"
       transform="matrix(0.1424101,0,0,0.1424101,217.94367,53.095994)" />
    <g
       id="g150"
       transform="matrix(0.1424101,0,0,0.1424101,217.94367,53.095994)" />
    <g
       id="g152"
       transform="matrix(0.1424101,0,0,0.1424101,217.94367,53.095994)" />
    <g
       id="g154"
       transform="matrix(0.1424101,0,0,0.1424101,217.94367,53.095994)" />
    <g
       id="g156"
       transform="matrix(0.1424101,0,0,0.1424101,217.94367,53.095994)" />
    <g
       id="g1468"
       transform="matrix(0.93219704,0,0,0.93483876,18.035185,10.919741)">
      <path
         d="m 283.47856,155.0821 c -2.16323,0 -3.91717,-1.75343 -3.91717,-3.91716 v -8.03171 c 0,-0.72142 -0.58464,-1.30656 -1.30655,-1.30656 h -2.73586 c -0.72191,0 -1.30706,0.58514 -1.30706,1.30656 v 4.70169 c 0,3.41969 -2.7103,6.28029 -6.12899,6.3374 -3.49283,0.0587 -6.3424,-2.75539 -6.3424,-6.2347 v -4.80439 c 0,-0.72142 -0.58515,-1.30656 -1.30706,-1.30656 h -2.73585 c -0.72191,0 -1.30705,0.58514 -1.30705,1.30656 v 8.03171 c 0,2.16373 -1.75344,3.91716 -3.91717,3.91716 -0.70288,0 -1.27299,0.57011 -1.27299,1.27349 v 26.06299 c 0,1.80453 1.46286,3.26789 3.26789,3.26789 h 27.01586 c 1.80503,0 3.26789,-1.46336 3.26789,-3.26789 v -26.06299 c 0,-0.70338 -0.57012,-1.27349 -1.27349,-1.27349 z m 0,0"
         fill="#ed5176"
         id="path2"
         style="fill:#bf616a;stroke-width:0.128251" />
      <path
         d="m 283.47856,155.0821 c -2.16323,0 -3.91717,-1.75343 -3.91717,-3.91716 v -8.03171 c 0,-0.72142 -0.58464,-1.30656 -1.30655,-1.30656 h -2.73586 c -0.0471,0 -0.0937,0.003 -0.13927,0.008 0.65628,0.0691 1.16779,0.62421 1.16779,1.29904 v 8.03221 c 0,2.16323 1.75393,3.91666 3.91716,3.91666 0.70338,0 1.27349,0.57012 1.27349,1.2735 v 26.06298 c 0,1.80453 -1.46286,3.26789 -3.26789,3.26789 h 3.0139 c 1.80503,0 3.26789,-1.46336 3.26789,-3.26789 v -26.06298 c 0,-0.70338 -0.57012,-1.2735 -1.27349,-1.2735 z m 0,0"
         fill="#ba365f"
         id="path4"
         style="fill:#933f47;fill-opacity:1;stroke-width:0.128251" />
      <path
         d="m 283.47856,155.0821 c -2.16323,0 -3.91717,-1.75343 -3.91717,-3.91716 v -8.03171 c 0,-0.72142 -0.58464,-1.30656 -1.30655,-1.30656 h -2.73586 c -0.72191,0 -1.30706,0.58514 -1.30706,1.30656 v 4.70169 c 0,3.41969 -2.7103,6.28029 -6.12899,6.3374 -3.49283,0.0587 -6.3424,-2.75539 -6.3424,-6.2347 v -4.80439 c 0,-0.72142 -0.58515,-1.30656 -1.30706,-1.30656 h -2.73585 c -0.72191,0 -1.30705,0.58514 -1.30705,1.30656 v 8.03171 c 0,2.16373 -1.75344,3.91716 -3.91717,3.91716 -0.70288,0 -1.27299,0.57011 -1.27299,1.27349 v 4.57946 l 16.77582,8.04924 16.77582,-8.04874 v -4.57996 c 0,-0.70338 -0.57012,-1.27349 -1.27349,-1.27349 z m 0,0"
         fill="#e9e9ea"
         id="path6"
         style="fill:#eceff4;stroke-width:0.128251" />
      <path
         d="m 283.47856,155.0821 c -2.16323,0 -3.91717,-1.75343 -3.91717,-3.91716 v -8.03171 c 0,-0.72142 -0.58464,-1.30656 -1.30655,-1.30656 h -2.73586 c -0.012,0 -0.0236,0 -0.0351,5.1e-4 -3.6e-4,0 -8.4e-4,0 -0.002,0 -0.0341,8.4e-4 -0.0681,0.003 -0.10221,0.007 0.65629,0.0696 1.16779,0.62472 1.16779,1.29954 v 8.03171 c 0,2.16374 1.75393,3.91716 3.91716,3.91716 0.70338,0 1.27349,0.57011 1.27349,1.27349 v 6.02579 l 3.0139,-1.44632 v -4.57947 c 0,-0.70337 -0.57012,-1.27349 -1.27349,-1.27349 z m 0,0"
         fill="#c5c4cc"
         id="path8"
         style="fill:#d8dee9;stroke-width:0.128251" />
      <path
         d="m 235.26122,196.28371 h -2.86109 c -0.56661,0 -1.02601,-0.4594 -1.02601,-1.02601 v -48.53245 c 0,-0.5666 0.4594,-1.026 1.02601,-1.026 h 2.86109 c 0.56661,0 1.02602,0.4594 1.02602,1.026 v 48.53245 c 0,0.56661 -0.45941,1.02601 -1.02602,1.02601 z m 0,0"
         fill="#e9e9ea"
         id="path10-1"
         style="fill:#d8dee9;stroke-width:0.128251" />
      <path
         d="m 242.98834,161.72109 h -18.31532 c -2.02246,0 -3.66168,-1.63921 -3.66168,-3.66167 0,-2.02245 1.63922,-3.66166 3.66168,-3.66166 h 18.31532 c 2.02246,0 3.66167,1.63921 3.66167,3.66166 0,2.02246 -1.63921,3.66167 -3.66167,3.66167 z m 0,0"
         fill="#575b7a"
         id="path14-9"
         style="fill:#4c566a;stroke-width:0.128251" />
      <path
         d="m 238.20549,149.57232 h -8.74962 c -1.55354,0 -2.81351,1.25947 -2.81351,2.81301 v 2.01243 h 14.37613 v -2.01243 c 0,-1.55354 -1.25947,-2.81301 -2.813,-2.81301 z m 0,0"
         fill="#6a7193"
         id="path16"
         style="fill:#4c566a;stroke-width:0.128251" />
      <path
         d="m 242.98834,180.26186 h -18.31532 c -2.02246,0 -3.66168,1.63921 -3.66168,3.66166 0,2.02196 1.63922,3.66117 3.66168,3.66117 h 18.31532 c 2.02246,0 3.66167,-1.63921 3.66167,-3.66117 0,-2.02245 -1.63921,-3.66166 -3.66167,-3.66166 z m 0,0"
         fill="#575b7a"
         id="path18-4"
         style="fill:#434c5e;stroke-width:0.128251" />
      <path
         d="m 242.98834,154.39776 h -3.07802 c 2.02246,0 3.66166,1.63971 3.66166,3.66166 0,2.02246 -1.6392,3.66167 -3.66166,3.66167 h 3.07802 c 2.02246,0 3.66167,-1.63921 3.66167,-3.66167 0,-2.02195 -1.63921,-3.66166 -3.66167,-3.66166 z m 0,0"
         fill="#252d4c"
         id="path20"
         style="fill:#434c5e;stroke-width:0.128251" />
      <path
         d="m 242.98834,180.26186 h -3.07802 c 2.02246,0 3.66166,1.63921 3.66166,3.66166 0,2.02196 -1.6392,3.66117 -3.66166,3.66117 h 3.07802 c 2.02246,0 3.66167,-1.63921 3.66167,-3.66117 0,-2.02245 -1.63921,-3.66166 -3.66167,-3.66166 z m 0,0"
         fill="#252d4c"
         id="path22"
         style="stroke-width:0.128251" />
      <path
         d="m 238.20549,192.41063 h -8.74962 c -1.55354,0 -2.81351,-1.25946 -2.81351,-2.8135 v -2.01244 h 14.37613 v 2.01244 c 0,1.55404 -1.25947,2.8135 -2.813,2.8135 z m 0,0"
         fill="#6a7193"
         id="path24-7"
         style="fill:#4c566a;stroke-width:0.128251" />
      <path
         d="m 238.20549,149.57232 h -3.07803 c 1.55355,0 2.81301,1.25947 2.81301,2.81301 v 2.01243 h 3.07802 v -2.01243 c 0,-1.55354 -1.25947,-2.81301 -2.813,-2.81301 z m 0,0"
         fill="#575b7a"
         id="path26"
         style="fill:#434c5e;stroke-width:0.128251" />
      <path
         d="m 237.94047,187.58469 v 2.01293 c 0,1.55355 -1.25946,2.81301 -2.81301,2.81301 h 3.07803 c 1.55353,0 2.813,-1.25946 2.813,-2.81301 v -2.01293 z m 0,0"
         fill="#575b7a"
         id="path28-8"
         style="stroke-width:0.128251" />
      <path
         d="m 242.61962,195.05681 h 34.67834 c 1.49744,0 2.71081,-1.21388 2.71081,-2.71131 v -15.95171 c 0,-1.42378 -1.15427,-2.57804 -2.57804,-2.57804 h -0.59768 c -0.74646,0 -1.40976,0.47493 -1.65023,1.18181 -0.94484,2.77694 -3.55295,4.64459 -6.48618,4.64459 -2.88365,0 -5.45868,-1.80553 -6.44161,-4.51683 -0.28505,-0.78604 -1.03151,-1.30957 -1.86765,-1.30957 h -2.33607 c -0.46641,0 -0.92481,0.12725 -1.32509,0.36672 l -17.05437,10.2225 c -1.72838,1.03602 -2.78595,2.90318 -2.78595,4.91812 0,3.16669 2.56702,5.73372 5.73372,5.73372 z m 0,0"
         fill="#8cbafa"
         id="path30"
         style="fill:#81a1c1;stroke-width:0.128251" />
      <path
         d="m 277.43073,173.81575 h -0.59768 c -0.4604,0 -0.88924,0.18086 -1.20635,0.48545 0.64926,0.46791 1.07209,1.23091 1.07209,2.09259 V 192.346 c 0,1.49693 -1.21387,2.71081 -2.7108,2.71081 h 3.30997 c 1.49693,0 2.71081,-1.21388 2.71081,-2.71081 v -15.95221 c 0,-1.42378 -1.15427,-2.57804 -2.57804,-2.57804 z m 0,0"
         fill="#5692d8"
         id="path32-4"
         style="fill:#5e81ac;stroke-width:0.128251" />
      <path
         d="m 255.19773,175.09876 -3.28192,1.96685 12.55356,17.9912 h 4.6546 z m 0,0"
         fill="#f9aa4b"
         id="path34"
         style="fill:#ebcb8b;stroke-width:0.128251" />
      <path
         d="m 255.22829,195.05681 h 4.6541 l -11.20091,-16.05241 -3.28192,1.96735 z m 0,0"
         fill="#f9aa4b"
         id="path36"
         style="fill:#ebcb8b;stroke-width:0.128251" />
      <path
         d="m 236.88941,189.47338 c 0.0801,3.09706 2.61411,5.58343 5.73021,5.58343 h 34.67834 c 1.49744,0 2.71081,-1.21388 2.71081,-2.71131 v -2.87212 z m 0,0"
         fill="#e9e9ea"
         id="path38"
         style="stroke-width:0.128251" />
      <path
         d="m 276.69879,192.346 c 0,1.49593 -1.21237,2.7093 -2.70829,2.71081 h 3.30746 c 1.49744,0 2.71081,-1.21338 2.71081,-2.71081 v -2.87262 h -3.30948 v 2.87262 z m 0,0"
         fill="#c5c4cc"
         id="path40"
         style="stroke-width:0.128251" />
      <path
         d="m 246.88146,183.82133 10.16488,-6.09293 c 0.73143,-0.43785 1.17881,-1.2279 1.17881,-2.08057 v -1.83208 h -0.17384 c -0.46692,0 -0.92531,0.12675 -1.32559,0.36672 l -12.58061,7.54126 c -0.53255,0.31912 -0.66781,1.03101 -0.28957,1.52297 0.7164,0.93182 2.01795,1.17931 3.02592,0.57463 z m 0,0"
         fill="#e9e9ea"
         id="path42-5"
         style="stroke-width:0.128251" />
      <path
         d="m 285.71393,160.91752 v -4.56193 c 0,-1.23241 -1.00296,-2.23537 -2.23537,-2.23537 -0.78955,0 -1.5315,-0.3071 -2.08959,-0.86419 -0.5581,-0.5591 -0.8657,-1.30155 -0.8657,-2.09059 v -8.03272 c 0,-1.25094 -1.01749,-2.26844 -2.26843,-2.26844 h -2.73586 c -1.25095,0 -2.26843,1.018 -2.26843,2.26844 v 4.7017 c 0,2.91671 -2.32605,5.32843 -5.18465,5.37652 -1.42128,0.0221 -2.77192,-0.5135 -3.78791,-1.51296 -1.01649,-0.99995 -1.57609,-2.33557 -1.57609,-3.76085 v -4.80441 c 0,-1.25094 -1.01799,-2.26844 -2.26893,-2.26844 h -2.73535 c -1.25095,0 -2.26894,1.018 -2.26894,2.26844 v 2.89868 c 0,0.53153 0.43084,0.96188 0.96189,0.96188 0.53153,0 0.96187,-0.43035 0.96187,-0.96188 v -2.89868 c 0,-0.18986 0.1548,-0.34467 0.34518,-0.34467 h 2.73535 c 0.19037,0 0.34518,0.15481 0.34518,0.34467 v 4.80441 c 0,1.9453 0.76399,3.76787 2.1507,5.13203 1.38671,1.36417 3.2223,2.0936 5.16911,2.06555 3.90214,-0.0661 7.07634,-3.34104 7.07634,-7.30029 v -4.7017 c 0,-0.18986 0.15481,-0.34467 0.34468,-0.34467 h 2.73586 c 0.18986,0 0.34466,0.15481 0.34466,0.34467 v 8.03272 c 0,1.30205 0.507,2.52744 1.4293,3.45075 0.92231,0.9208 2.14721,1.4278 3.44976,1.4278 0.17183,0 0.3116,0.13977 0.3116,0.3116 v 3.97428 l -15.81443,7.58734 -15.81344,-7.58685 v -3.97477 c 0,-0.1062 0.0496,-0.17835 0.0932,-0.22193 0.0336,-0.0336 0.10621,-0.0897 0.21842,-0.0897 2.69028,0 4.87855,-2.18829 4.87855,-4.87855 v -1.28652 c 0,-0.53104 -0.43034,-0.96188 -0.96187,-0.96188 -0.53105,0 -0.96189,0.43084 -0.96189,0.96188 v 1.28652 c 0,1.62918 -1.32559,2.95478 -2.95479,2.95478 -0.59917,0 -1.16126,0.23296 -1.58059,0.65478 -0.42232,0.42233 -0.65477,0.98392 -0.65477,1.58059 v 4.5469 c -3.7e-4,0.0216 -3.7e-4,0.043 0,0.0646 v 15.98276 l -4.94668,2.9648 c -0.69686,-0.39978 -1.49442,-0.6152 -2.30351,-0.6152 h -5.73923 v -16.6165 h 5.73923 c 2.54949,0 4.62354,-2.07406 4.62354,-4.62355 0,-2.54949 -2.07405,-4.62354 -4.62354,-4.62354 h -1.00747 v -1.05056 c 0,-2.08158 -1.69382,-3.77488 -3.77538,-3.77488 h -0.95638 v -1.88519 c 0,-1.09615 -0.89174,-1.98789 -1.98789,-1.98789 h -2.86109 c -1.09615,0 -1.98789,0.89174 -1.98789,1.98789 v 1.88519 h -0.95637 c -2.08157,0 -3.77539,1.6933 -3.77539,3.77488 v 1.05056 h -1.00746 c -0.42234,0 -0.84065,0.0571 -1.24394,0.16933 -0.5115,0.14278 -0.81109,0.67331 -0.66831,1.18532 0.14278,0.5115 0.67281,0.81008 1.18532,0.6678 0.23496,-0.0656 0.47944,-0.0987 0.72693,-0.0987 h 18.31532 c 1.48891,0 2.69979,1.21087 2.69979,2.69978 0,1.48841 -1.21088,2.69928 -2.69979,2.69928 h -18.31532 c -1.48892,0 -2.69979,-1.21087 -2.69979,-2.69928 0,-0.1528 0.013,-0.30661 0.0381,-0.45589 0.0887,-0.52403 -0.26401,-1.02049 -0.78754,-1.10917 -0.52352,-0.0892 -1.0205,0.26402 -1.10917,0.78804 -0.043,0.2555 -0.0651,0.51701 -0.0651,0.77702 0,2.54949 2.07406,4.62355 4.62355,4.62355 h 5.73922 v 16.6165 h -5.73922 c -2.54949,0 -4.62355,2.07406 -4.62355,4.62354 0,1.23342 0.48044,2.39469 1.35465,3.27041 0.87421,0.8727 2.03548,1.35314 3.2689,1.35314 h 1.00797 v 1.05006 c 0,2.08207 1.69331,3.77588 3.77438,3.77588 h 0.95687 v 1.88519 c 0,1.09615 0.89175,1.98789 1.98789,1.98789 h 2.8611 c 1.09614,0 1.98789,-0.89174 1.98789,-1.98789 v -1.88519 h 0.0381 c 0.1989,0.26102 0.41782,0.509 0.6568,0.74196 1.29202,1.26197 2.9678,1.90422 4.67564,1.90422 h 34.67834 c 2.02496,0 3.67269,-1.64772 3.67269,-3.67319 v -5.69714 h 0.51351 c 2.33255,0 4.22977,-1.89772 4.22977,-4.22978 v -21.468 c 0,-0.011 0,-0.0221 0,-0.0331 z M 232.336,146.72525 c 0,-0.0351 0.0286,-0.0641 0.0641,-0.0641 h 2.8611 c 0.0356,0 0.0641,0.029 0.0641,0.0641 v 1.88519 h -2.98935 z m -4.73175,6.71063 v -1.05055 c 0,-1.021 0.83062,-1.85112 1.85162,-1.85112 h 1.89821 0.02 0.0195 4.87353 0.0201 0.02 1.89822 c 1.02099,0 1.85161,0.83012 1.85161,1.85112 v 1.05055 z m 32.78313,21.34175 c 0.42984,0 0.81659,0.27153 0.96339,0.67532 1.11668,3.08103 4.06895,5.15108 7.34536,5.15108 3.34655,0 6.31937,-2.12866 7.39697,-5.29686 0.10772,-0.31662 0.4053,-0.52954 0.73995,-0.52954 h 0.59768 c 0.89124,0 1.61616,0.72492 1.61616,1.61616 v 12.11771 h -13.31706 l -3.15517,-4.52085 c -0.30359,-0.43535 -0.90377,-0.54206 -1.33912,-0.23796 -0.43536,0.3036 -0.54206,0.90326 -0.23847,1.33912 l 2.38667,3.41969 h -2.30802 l -5.94161,-8.51516 1.62767,-0.97591 2.03449,2.91621 c 0.18736,0.26802 0.48595,0.4118 0.79004,0.4118 0.18988,0 0.38175,-0.0561 0.54908,-0.17334 0.43585,-0.30409 0.54256,-0.90377 0.23897,-1.33912 l -2.04751,-2.93474 c 0.54407,-0.6132 0.86019,-1.41577 0.86019,-2.25341 v -0.8702 z m -3.89913,13.73387 -4.58897,-6.57637 1.58059,-0.94735 5.24977,7.52372 z m -4.6546,0 -3.2163,-4.60901 1.62769,-0.97541 3.89713,5.58492 h -2.30852 z m -8.90843,-4.93565 c 0.0491,0.0892 0.1052,0.17534 0.16783,0.257 0.64075,0.83363 1.61165,1.28 2.60009,1.28 0.42132,0 0.84615,-0.0811 1.24994,-0.24848 l 2.54497,3.64713 h -11.57013 c 0.23646,-1.35215 1.05307,-2.56551 2.2484,-3.28142 z m 14.33805,-8.59281 v 0.6653 c 0,0.50548 -0.26653,0.98092 -0.69636,1.24593 -0.017,0.0101 -0.0341,0.0201 -0.0506,0.0311 l -3.22932,1.93529 c -0.0165,0.009 -0.0331,0.0196 -0.0496,0.03 l -3.20076,1.91825 c -0.006,0.003 -0.0125,0.008 -0.0185,0.0115 l -3.63111,2.17626 c -0.58965,0.35368 -1.34964,0.2089 -1.76895,-0.33616 -0.005,-0.007 -0.0206,-0.027 -0.014,-0.0606 0.006,-0.0295 0.0231,-0.043 0.032,-0.0491 l 1.10166,-0.6603 c 0.0125,-0.007 0.0256,-0.015 0.0381,-0.0231 l 11.44439,-6.85992 c 0.0145,-0.008 0.0285,-0.0165 0.043,-0.0246 z M 232.336,162.68298 h 2.98935 v 16.6165 H 232.336 Z m -4.73125,26.91415 v -1.05056 h 5.43413 c 0.53104,0 0.96188,-0.43034 0.96188,-0.96188 0,-0.53104 -0.43084,-0.96188 -0.96188,-0.96188 h -8.36586 c -0.72042,0 -1.39875,-0.28055 -1.90874,-0.78955 -0.51,-0.5115 -0.79105,-1.18982 -0.79105,-1.91024 0,-1.4884 1.21087,-2.69978 2.69979,-2.69978 h 18.31532 c 0.0391,0 0.0776,8.4e-4 0.11623,0.003 l -3.92719,2.3541 c -2.00692,1.20286 -3.25336,3.40316 -3.25336,5.74325 0,0.63924 0.0902,1.25795 0.25801,1.8436 0.002,0.008 0.004,0.015 0.007,0.0226 0.002,0.005 0.003,0.0101 0.004,0.015 0.0236,0.0822 0.0491,0.16332 0.0762,0.24448 h -6.81378 c -1.0205,0 -1.85062,-0.83063 -1.85062,-1.85163 z m 7.7206,5.66057 c 0,0.0351 -0.029,0.0641 -0.0641,0.0641 h -2.8611 c -0.0351,0 -0.0641,-0.029 -0.0641,-0.0641 v -1.88519 h 2.98934 z m 43.72154,-2.9122 c 0,0.96489 -0.78454,1.74943 -1.74943,1.74943 -22.1874,0 -34.70289,8.4e-4 -34.80508,-0.002 -2.1923,-0.0576 -4.02088,-1.60113 -4.51384,-3.65816 h 13.32958 c 0.008,3.6e-4 0.0165,3.6e-4 0.025,3.6e-4 0.008,0 0.017,0 0.0256,-3.6e-4 h 4.6035 c 0.008,3.6e-4 0.0165,3.6e-4 0.0251,3.6e-4 0.008,0 0.017,0 0.0256,-3.6e-4 h 4.53687 c 0.008,3.6e-4 0.017,3.6e-4 0.0251,3.6e-4 0.008,0 0.017,0 0.0256,-3.6e-4 h 4.6035 c 0.008,3.6e-4 0.0165,3.6e-4 0.0251,3.6e-4 0.008,0 0.017,0 0.0256,-3.6e-4 h 13.79248 z m 2.43727,-7.62091 h -0.51351 v -8.3308 c 0,-1.95181 -1.58811,-3.53992 -3.53992,-3.53992 h -0.59768 c -1.15876,0 -2.18778,0.73694 -2.56151,1.83359 -0.81209,2.38817 -3.05297,3.99231 -5.57541,3.99231 -2.47033,0 -4.69518,-1.56005 -5.53733,-3.8821 -0.42132,-1.16277 -1.535,-1.9438 -2.77192,-1.9438 -2.14419,0.0551 -2.9613,-0.21041 -4.15563,0.50399 l -4.06946,2.43877 v -13.33259 l 15.39762,7.38745 c 0.13176,0.0631 0.27404,0.0947 0.41632,0.0947 0.14227,0 0.28455,-0.0316 0.4158,-0.0947 l 15.39813,-7.38794 v 19.95503 c 3.7e-4,1.27149 -1.03402,2.30601 -2.3055,2.30601 z m 0,0"
         id="path44"
         style="stroke-width:0.128251" />
      <path
         d="m 266.97277,157.81194 h -0.64627 c -0.53154,0 -0.96188,0.43034 -0.96188,0.96188 0,0.53104 0.43034,0.96189 0.96188,0.96189 h 0.2034 v 3.32701 h -0.11724 c -0.53153,0 -0.96187,0.43034 -0.96187,0.96187 0,0.53154 0.43034,0.96189 0.96187,0.96189 h 2.15823 c 0.53154,0 0.96188,-0.43035 0.96188,-0.96189 0,-0.53153 -0.43034,-0.96187 -0.96188,-0.96187 h -0.11723 v -3.76988 c 0,-0.8166 -0.6643,-1.4809 -1.48089,-1.4809 z m 0,0"
         id="path46-0"
         style="stroke-width:0.128251" />
    </g>
  </g>
</svg>
