<?xml version="1.0" encoding="UTF-8" standalone="no"?>
<svg
   width="297mm"
   height="210mm"
   viewBox="0 0 297 210"
   version="1.1"
   id="svg8"
   inkscape:version="1.2.2 (b0a8486541, 2022-12-01)"
   sodipodi:docname="communication.svg"
   xmlns:inkscape="http://www.inkscape.org/namespaces/inkscape"
   xmlns:sodipodi="http://sodipodi.sourceforge.net/DTD/sodipodi-0.dtd"
   xmlns="http://www.w3.org/2000/svg"
   xmlns:svg="http://www.w3.org/2000/svg"
   xmlns:rdf="http://www.w3.org/1999/02/22-rdf-syntax-ns#"
   xmlns:cc="http://creativecommons.org/ns#"
   xmlns:dc="http://purl.org/dc/elements/1.1/">
  <defs
     id="defs2">
    <rect
       x="32.896137"
       y="231.11564"
       width="150.25032"
       height="21.368099"
       id="rect5210" />
    <rect
       x="9.1240066"
       y="198.08924"
       width="209.48703"
       height="8.8596064"
       id="rect4989" />
    <rect
       x="12.082016"
       y="187.73089"
       width="206.88329"
       height="16.077906"
       id="rect4983" />
    <rect
       x="15.856161"
       y="176.45993"
       width="171.37187"
       height="17.315844"
       id="rect4977" />
    <rect
       x="22.56789"
       y="157.79275"
       width="153.66661"
       height="37.743174"
       id="rect4971" />
    <rect
       x="33.979525"
       y="130.7603"
       width="167.53934"
       height="58.879668"
       id="rect4965" />
    <rect
       x="36.1447"
       y="138.49193"
       width="226.88811"
       height="32.0569"
       id="rect4751" />
    <rect
       x="35.428408"
       y="107.5132"
       width="166.73609"
       height="18.932537"
       id="rect4745" />
    <rect
       x="33.258591"
       y="75.881542"
       width="174.29292"
       height="21.002139"
       id="rect4739" />
    <rect
       x="19.366904"
       y="29.625836"
       width="258.18648"
       height="51.39582"
       id="rect4712" />
    <rect
       x="40.712574"
       y="495.30075"
       width="115.41316"
       height="17.401705"
       id="rect2657" />
    <rect
       x="8.8313293"
       y="27.998915"
       width="190.31702"
       height="48.158627"
       id="rect2207" />
    <rect
       x="8.8313293"
       y="27.998915"
       width="85.813248"
       height="83.878227"
       id="rect2207-5" />
    <rect
       x="8.8313293"
       y="27.998915"
       width="190.31702"
       height="48.158627"
       id="rect2224" />
    <rect
       x="8.8313293"
       y="27.998915"
       width="97.091652"
       height="75.218666"
       id="rect2207-8" />
    <rect
       x="8.8313293"
       y="27.998915"
       width="190.31702"
       height="48.158627"
       id="rect2312" />
    <rect
       x="8.8313293"
       y="27.998915"
       width="190.31702"
       height="48.158627"
       id="rect2207-8-3" />
    <rect
       x="8.8313293"
       y="27.998915"
       width="190.31702"
       height="48.158627"
       id="rect2400" />
    <rect
       x="8.8313293"
       y="27.998915"
       width="190.31702"
       height="48.158627"
       id="rect2207-8-8" />
    <rect
       x="8.8313293"
       y="27.998915"
       width="190.31702"
       height="48.158627"
       id="rect2400-9" />
    <rect
       x="8.8313293"
       y="27.998915"
       width="178.64267"
       height="18.151253"
       id="rect2207-8-8-4" />
    <rect
       x="8.8313293"
       y="27.998915"
       width="190.31702"
       height="48.158627"
       id="rect2552" />
    <rect
       x="8.8313293"
       y="27.998915"
       width="178.56918"
       height="48.727043"
       id="rect2207-8-8-3" />
    <rect
       x="8.8313293"
       y="27.998915"
       width="190.31702"
       height="48.158627"
       id="rect2552-3" />
    <rect
       x="40.712574"
       y="495.30075"
       width="115.41316"
       height="17.672302"
       id="rect2657-8" />
    <rect
       x="40.712574"
       y="495.30075"
       width="107.27708"
       height="17.707369"
       id="rect2670" />
    <rect
       x="40.712574"
       y="495.30075"
       width="115.41316"
       height="17.707369"
       id="rect2657-8-9" />
    <rect
       x="40.712574"
       y="495.30075"
       width="107.27708"
       height="17.707369"
       id="rect2714" />
    <rect
       x="40.712574"
       y="495.30075"
       width="115.41316"
       height="17.895838"
       id="rect2657-8-9-7" />
    <rect
       x="40.712574"
       y="495.30075"
       width="107.27708"
       height="17.707369"
       id="rect2757" />
    <rect
       x="40.712574"
       y="495.30075"
       width="107.27708"
       height="17.707369"
       id="rect2657-8-9-7-4" />
    <rect
       x="40.712574"
       y="495.30075"
       width="107.27708"
       height="17.707369"
       id="rect2800" />
    <rect
       x="40.712574"
       y="495.30075"
       width="107.27708"
       height="17.707369"
       id="rect2657-8-9-0" />
    <rect
       x="40.712574"
       y="495.30075"
       width="107.27708"
       height="17.707369"
       id="rect2867" />
    <rect
       x="40.712574"
       y="495.30075"
       width="107.27708"
       height="17.707369"
       id="rect2657-8-9-0-0" />
    <rect
       x="40.712574"
       y="495.30075"
       width="107.27708"
       height="17.707369"
       id="rect2910" />
    <rect
       x="40.712574"
       y="495.30075"
       width="107.27708"
       height="17.707369"
       id="rect2657-8-9-0-2" />
    <rect
       x="40.712574"
       y="495.30075"
       width="107.27708"
       height="17.707369"
       id="rect2910-5" />
    <rect
       x="40.712574"
       y="495.30075"
       width="107.27708"
       height="17.707369"
       id="rect2657-8-9-0-05" />
    <rect
       x="40.712574"
       y="495.30075"
       width="107.27708"
       height="17.707369"
       id="rect2910-9" />
    <rect
       x="40.712574"
       y="495.30075"
       width="107.27708"
       height="17.707369"
       id="rect2657-8-9-0-9" />
    <rect
       x="40.712574"
       y="495.30075"
       width="107.27708"
       height="17.707369"
       id="rect2910-2" />
    <rect
       x="40.712574"
       y="495.30075"
       width="107.27708"
       height="17.707369"
       id="rect2657-8-9-0-4" />
    <rect
       x="40.712574"
       y="495.30075"
       width="107.27708"
       height="17.707369"
       id="rect2910-7" />
    <rect
       x="40.712574"
       y="495.30075"
       width="107.27708"
       height="17.707369"
       id="rect2657-8-9-0-5" />
    <rect
       x="40.712574"
       y="495.30075"
       width="107.27708"
       height="17.707369"
       id="rect2910-4" />
    <rect
       x="9.1240063"
       y="198.08923"
       width="167.68151"
       height="22.905772"
       id="rect4989-8" />
    <rect
       x="9.1240063"
       y="198.08923"
       width="209.48703"
       height="8.8596067"
       id="rect5145" />
    <rect
       x="9.1240063"
       y="198.08923"
       width="167.13515"
       height="16.107238"
       id="rect4989-9" />
    <rect
       x="9.1240063"
       y="198.08923"
       width="209.48703"
       height="8.8596067"
       id="rect5181" />
    <rect
       x="35.42841"
       y="107.5132"
       width="166.73608"
       height="18.932537"
       id="rect4745-2" />
    <rect
       x="35.42841"
       y="107.5132"
       width="166.73608"
       height="18.932537"
       id="rect5399" />
    <rect
       x="9.1240063"
       y="198.08923"
       width="167.87569"
       height="15.514696"
       id="rect4989-9-5" />
    <rect
       x="9.1240063"
       y="198.08923"
       width="209.48703"
       height="8.8596067"
       id="rect5449" />
  </defs>
  <sodipodi:namedview
     id="base"
     pagecolor="#ffffff"
     bordercolor="#666666"
     borderopacity="1.0"
     inkscape:pageopacity="0.0"
     inkscape:pageshadow="2"
     inkscape:zoom="0.90509668"
     inkscape:cx="559.60873"
     inkscape:cy="423.15921"
     inkscape:document-units="mm"
     inkscape:current-layer="layer1"
     inkscape:document-rotation="0"
     showgrid="false"
     inkscape:window-width="1920"
     inkscape:window-height="1011"
     inkscape:window-x="0"
     inkscape:window-y="0"
     inkscape:window-maximized="1"
     showguides="true"
     inkscape:guide-bbox="true"
     inkscape:showpageshadow="2"
     inkscape:pagecheckerboard="0"
     inkscape:deskcolor="#d1d1d1">
    <sodipodi:guide
       position="207.5515,151.53479"
       orientation="1,0"
       id="guide5134"
       inkscape:locked="false" />
  </sodipodi:namedview>
  <metadata
     id="metadata5">
    <rdf:RDF>
      <cc:Work
         rdf:about="">
        <dc:format>image/svg+xml</dc:format>
        <dc:type
           rdf:resource="http://purl.org/dc/dcmitype/StillImage" />
        <dc:title />
      </cc:Work>
    </rdf:RDF>
  </metadata>
  <g
     inkscape:label="Calque 1"
     inkscape:groupmode="layer"
     id="layer1">
    <text
       xml:space="preserve"
       style="font-size:8.46667px;line-height:1.25;font-family:Cantarell;-inkscape-font-specification:'Cantarell, Normal';letter-spacing:0px;word-spacing:0px;stroke-width:0.264583"
       x="112.32616"
       y="15.129248"
       id="text4684"><tspan
         sodipodi:role="line"
         id="tspan4682"
         x="112.32616"
         y="15.129248"
         style="font-style:normal;font-variant:normal;font-weight:bold;font-stretch:normal;font-size:8.46667px;font-family:Khand;-inkscape-font-specification:'Khand, Bold';font-variant-ligatures:normal;font-variant-caps:normal;font-variant-numeric:normal;font-variant-east-asian:normal;stroke-width:0.264583">Service Communication</tspan></text>
    <text
       xml:space="preserve"
       id="text4710"
       style="font-style:normal;font-variant:normal;font-weight:normal;font-stretch:normal;font-size:5.14048px;line-height:1.25;font-family:Poppins;-inkscape-font-specification:'Poppins, Normal';font-variant-ligatures:normal;font-variant-caps:normal;font-variant-numeric:normal;font-variant-east-asian:normal;letter-spacing:0px;word-spacing:0px;white-space:pre;shape-inside:url(#rect4712);display:inline"
       transform="translate(1.8088028,-4.4857545)"><tspan
         x="19.367188"
         y="34.12292"
         id="tspan2783">Vous gérez l'intégralité de la communication de la mairie, vous vous occupez de la présence de la </tspan><tspan
         x="19.367188"
         y="40.548518"
         id="tspan2785">mairie sur les réseaux sociaux et de publier le journal tous les mois.</tspan></text>
    <text
       xml:space="preserve"
       style="font-style:normal;font-variant:normal;font-weight:bold;font-stretch:normal;font-size:6.35px;line-height:1.25;font-family:Khand;-inkscape-font-specification:'Khand, Bold';font-variant-ligatures:normal;font-variant-caps:normal;font-variant-numeric:normal;font-variant-east-asian:normal;letter-spacing:0px;word-spacing:0px;stroke-width:0.264583"
       x="20.781143"
       y="62.866295"
       id="text4718"><tspan
         sodipodi:role="line"
         id="tspan4716"
         x="20.781143"
         y="62.866295"
         style="font-style:normal;font-variant:normal;font-weight:bold;font-stretch:normal;font-size:6.35px;font-family:Khand;-inkscape-font-specification:'Khand, Bold';font-variant-ligatures:normal;font-variant-caps:normal;font-variant-numeric:normal;font-variant-east-asian:normal;stroke-width:0.264583">Vous êtes objectivé sur :​</tspan></text>
    <text
       xml:space="preserve"
       style="font-size:8.46667px;line-height:1.25;font-family:Cantarell;-inkscape-font-specification:'Cantarell, Normal';letter-spacing:0px;word-spacing:0px;stroke-width:0.264583"
       x="83.806458"
       y="83.749802"
       id="text4722"><tspan
         sodipodi:role="line"
         x="83.806458"
         y="83.749802"
         style="stroke-width:0.264583"
         id="tspan4730" /></text>
    <text
       xml:space="preserve"
       id="text4737"
       style="font-style:normal;font-variant:normal;font-weight:normal;font-stretch:normal;font-size:5.14048px;line-height:1.25;font-family:Poppins;-inkscape-font-specification:'Poppins, Normal';font-variant-ligatures:normal;font-variant-caps:normal;font-variant-numeric:normal;font-variant-east-asian:normal;letter-spacing:0px;word-spacing:0px;white-space:pre;shape-inside:url(#rect4739);display:inline"
       transform="translate(0,-6.8791668)"><tspan
         x="33.257812"
         y="80.378779"
         id="tspan2787">Maintenir la publication du journal local</tspan></text>
    <text
       xml:space="preserve"
       id="text4743"
       style="font-style:normal;font-variant:normal;font-weight:normal;font-stretch:normal;font-size:5.14048px;line-height:1.25;font-family:Poppins;-inkscape-font-specification:'Poppins, Normal';font-variant-ligatures:normal;font-variant-caps:normal;font-variant-numeric:normal;font-variant-east-asian:normal;letter-spacing:0px;word-spacing:0px;white-space:pre;shape-inside:url(#rect4745);display:inline"
       transform="translate(-1.7093125,-29.455203)"><tspan
         x="35.427734"
         y="112.01159"
         id="tspan2789">Augmenter Le nombre de messages et de vidéos positives sur le </tspan><tspan
         x="35.427734"
         y="118.43719"
         id="tspan2791">maire que vous colportez.
</tspan></text>
    <path
       d="m 28.55654,74.516797 c -0.10946,0 -0.21248,-0.04507 -0.289744,-0.119116 l -0.24145,-0.241452 c -0.07726,-0.07726 -0.122337,-0.183504 -0.122337,-0.292961 0,-0.109458 0.04507,-0.215698 0.122337,-0.289743 l 0.943271,-0.946491 h -2.266428 c -0.231794,0 -0.376665,-0.193161 -0.376665,-0.412077 v -0.412079 c 0,-0.218915 0.144871,-0.412077 0.376665,-0.412077 h 2.266428 L 28.025346,70.44431 c -0.07726,-0.07405 -0.122337,-0.180285 -0.122337,-0.289742 0,-0.109458 0.04507,-0.215698 0.122337,-0.289743 l 0.24145,-0.241451 c 0.07726,-0.07726 0.180284,-0.122336 0.289744,-0.122336 0.109458,0 0.215695,0.04507 0.292962,0.122336 l 2.0958,2.095801 c 0.07726,0.07405 0.119117,0.180285 0.119117,0.289743 0,0.109457 -0.04185,0.215697 -0.119117,0.292961 l -2.0958,2.095802 c -0.07727,0.07405 -0.183504,0.119116 -0.292962,0.119116 z"
       id="path4911"
       style="fill:#bf616a;stroke-width:0.00321935" />
    <path
       d="m 28.55654,86.561506 c -0.109459,0 -0.212479,-0.04507 -0.289743,-0.119116 l -0.241451,-0.241452 c -0.07726,-0.07726 -0.122336,-0.183504 -0.122336,-0.292961 0,-0.109458 0.04507,-0.215698 0.122336,-0.289743 l 0.943272,-0.946492 h -2.266429 c -0.231793,0 -0.376665,-0.19316 -0.376665,-0.412076 v -0.412079 c 0,-0.218916 0.144871,-0.412078 0.376665,-0.412078 h 2.266429 l -0.943272,-0.94649 c -0.07726,-0.07405 -0.122336,-0.180285 -0.122336,-0.289743 0,-0.109457 0.04507,-0.215698 0.122336,-0.289743 l 0.241451,-0.24145 c 0.07726,-0.07726 0.180284,-0.122337 0.289743,-0.122337 0.109458,0 0.215696,0.04507 0.292962,0.122337 l 2.095801,2.0958 c 0.07726,0.07405 0.119116,0.180286 0.119116,0.289744 0,0.109457 -0.04185,0.215697 -0.119116,0.292961 l -2.095801,2.095801 c -0.07727,0.07405 -0.183504,0.119116 -0.292962,0.119117 z"
       id="path4911-0"
       style="fill:#bf616a;stroke-width:0.00321935" />
    <rect
       style="fill:none;stroke:#bf616a;stroke-width:1.5;stroke-linecap:round;stroke-linejoin:round"
       id="rect4957"
       width="190.7861"
       height="54.592487"
       x="16.765404"
       y="54.760738" />
    <text
       xml:space="preserve"
       style="font-style:normal;font-variant:normal;font-weight:bold;font-stretch:normal;font-size:6.35px;line-height:1.25;font-family:Khand;-inkscape-font-specification:'Khand, Bold';font-variant-ligatures:normal;font-variant-caps:normal;font-variant-numeric:normal;font-variant-east-asian:normal;letter-spacing:0px;word-spacing:0px;stroke-width:0.264583"
       x="23.591185"
       y="131.57947"
       id="text4961"><tspan
         sodipodi:role="line"
         id="tspan4959"
         x="23.591185"
         y="131.57947"
         style="font-style:normal;font-variant:normal;font-weight:bold;font-stretch:normal;font-size:6.35px;font-family:Khand;-inkscape-font-specification:'Khand, Bold';font-variant-ligatures:normal;font-variant-caps:normal;font-variant-numeric:normal;font-variant-east-asian:normal;stroke-width:0.264583">Objectifs tactiques de l'équipe précédente</tspan></text>
    <rect
       style="fill:none;stroke:#5e81ac;stroke-width:1.5;stroke-linecap:round;stroke-linejoin:round"
       id="rect4957-4"
       width="190.90991"
       height="75.878593"
       x="16.641592"
       y="121.21156" />
    <circle
       style="fill:#5e81ac;stroke:none;stroke-width:0.969506;stroke-linecap:round;stroke-linejoin:round"
       id="path3041"
       cx="28.694971"
       cy="169.07347"
       r="1.6418267" />
    <text
       xml:space="preserve"
       id="text4987-2"
       style="font-style:normal;font-variant:normal;font-weight:normal;font-stretch:normal;font-size:5.14048px;line-height:1.25;font-family:Poppins;-inkscape-font-specification:'Poppins, Normal';font-variant-ligatures:normal;font-variant-caps:normal;font-variant-numeric:normal;font-variant-east-asian:normal;letter-spacing:0px;word-spacing:0px;white-space:pre;shape-inside:url(#rect4989-8);display:inline"
       transform="translate(24.346984,-35.349443)"><tspan
         x="9.1230469"
         y="202.58776"
         id="tspan2793">Création d'une masquotte d'arbre en plastique et déguiser tous </tspan><tspan
         x="9.1230469"
         y="209.01336"
         id="tspan2795">les enfants de la ville pour la réalisation de films publicitaires.</tspan></text>
    <text
       xml:space="preserve"
       id="text4987-9"
       style="font-style:normal;font-variant:normal;font-weight:normal;font-stretch:normal;font-size:5.14048px;line-height:1.25;font-family:Poppins;-inkscape-font-specification:'Poppins, Normal';font-variant-ligatures:normal;font-variant-caps:normal;font-variant-numeric:normal;font-variant-east-asian:normal;letter-spacing:0px;word-spacing:0px;white-space:pre;shape-inside:url(#rect4989-9);display:inline"
       transform="translate(24.34216,-54.457031)"><tspan
         x="9.1230469"
         y="202.58776"
         id="tspan2797">Organiser un concours du plus grand nombre de photos </tspan><tspan
         x="9.1230469"
         y="209.01336"
         id="tspan2799">d'arbres remplacés</tspan></text>
    <circle
       style="fill:#5e81ac;stroke:none;stroke-width:0.969506;stroke-linecap:round;stroke-linejoin:round"
       id="path3041-27"
       cx="28.694971"
       cy="149.72684"
       r="1.6418267" />
    <circle
       style="fill:#5e81ac;stroke:none;stroke-width:0.969506;stroke-linecap:round;stroke-linejoin:round"
       id="path3041-61"
       cx="28.694971"
       cy="185.3333"
       r="1.6418267" />
    <path
       fill="none"
       stroke="#373449"
       stroke-linecap="round"
       stroke-linejoin="round"
       d="m 277.04779,99.969319 h 4.51838 v 36.147261 c 0,1.25159 -1.0076,2.25919 -2.25919,2.25919 h -49.70217 c -1.25159,0 -2.25919,-1.0076 -2.25919,-2.25919 V 99.969319 h 6.77757"
       id="path2"
       style="font-weight:700;font-size:7.167px;font-family:'Bebas Neue Bold';letter-spacing:0;word-spacing:0;stroke-width:2.25919" />
    <path
       fill="#2bbda8"
       stroke="#373449"
       stroke-linecap="round"
       stroke-linejoin="round"
       d="m 274.7886,104.4877 h 2.25919 v 29.36946 H 231.864 V 104.4877 h 2.25919"
       id="path4"
       style="font-weight:700;font-size:7.167px;font-family:'Bebas Neue Bold';letter-spacing:0;word-spacing:0;stroke-width:2.25919;fill:#8fbcbb" />
    <path
       fill="#ff5a67"
       stroke="#373449"
       stroke-linecap="round"
       stroke-linejoin="round"
       d="m 257.52972,98.017605 c -2.14126,2.136745 -5.17663,2.490985 -8.51899,2.636705 -0.60077,0 -0.89453,0 -1.45447,0 h -3.32449 c -1.22784,0 -2.21633,0.5614 -2.21633,1.78679 v 5.52914 c 0,1.22538 0.98849,1.68197 2.21633,1.68197 h 3.32449 c 0.53242,0 0.724,0 1.3852,0 2.28639,0.0384 6.45392,0.61156 8.58826,2.7413 z"
       id="path6"
       style="font-weight:700;font-size:7.167px;font-family:'Bebas Neue Bold';letter-spacing:0;word-spacing:0;stroke-width:2.25919;fill:#bf616a" />
    <path
       fill="#ff5a67"
       stroke="#373449"
       stroke-linecap="round"
       stroke-linejoin="round"
       d="m 257.49179,101.29027 a 3.9235488,3.9152829 0 0 1 3.92356,3.91517 3.9235488,3.9152829 0 0 1 -3.92356,3.9154 v -3.9154 z"
       id="path8"
       style="font-weight:700;font-size:7.167px;font-family:'Bebas Neue Bold';letter-spacing:0;word-spacing:0;stroke-width:2.25919;fill:#bf616a" />
    <path
       fill="none"
       stroke="#373449"
       stroke-linecap="round"
       stroke-linejoin="round"
       d="m 264.95945,101.88827 3.32449,-2.211742 m -2.21631,5.529142 h 4.08636 m -5.19454,3.31739 3.32449,2.21175 m -19.76233,-10.02109 v 8.70692 m -27.95356,29.02539 h 67.77569 c 0,2.14465 -0.33983,3.4238 -2.25919,4.51838 h -63.25731 c -2.46112,-1.0634 -2.25675,-2.60575 -2.25919,-4.51838 z"
       id="path10"
       style="font-weight:700;font-size:7.167px;font-family:'Bebas Neue Bold';letter-spacing:0;word-spacing:0;stroke-width:2.25919" />
    <circle
       cx="255.1862"
       cy="106.53505"
       r="18.990747"
       fill="none"
       stroke="#373449"
       stroke-dasharray="2.25919, 2.25919"
       stroke-linejoin="round"
       id="circle12"
       style="font-weight:700;font-size:7.167px;font-family:'Bebas Neue Bold';letter-spacing:0;word-spacing:0;stroke-width:2.25919" />
    <path
       fill="none"
       stroke="#373449"
       stroke-linecap="round"
       stroke-linejoin="round"
       d="m 245.39291,109.64995 v 6.09055"
       id="path14"
       style="font-weight:700;font-size:7.167px;font-family:'Bebas Neue Bold';letter-spacing:0;word-spacing:0;stroke-width:2.25919" />
    <text
       xml:space="preserve"
       id="text4743-1"
       style="font-style:normal;font-variant:normal;font-weight:normal;font-stretch:normal;font-size:5.14048px;line-height:1.25;font-family:Poppins;-inkscape-font-specification:'Poppins, Normal';font-variant-ligatures:normal;font-variant-caps:normal;font-variant-numeric:normal;font-variant-east-asian:normal;letter-spacing:0px;word-spacing:0px;white-space:pre;shape-inside:url(#rect4745-2);display:inline"
       transform="translate(-1.7093125,-14.625711)"><tspan
         x="35.427734"
         y="112.01159"
         id="tspan2803">Augmenter<tspan
   style="shape-inside:url(#rect4745-2)"
   id="tspan2801"> La présence des différents services de la mairie sur </tspan></tspan><tspan
         x="35.427734"
         y="118.43719"
         id="tspan2807"><tspan
           style="shape-inside:url(#rect4745-2)"
           id="tspan2805">internet
</tspan></tspan></text>
    <text
       xml:space="preserve"
       id="text4987-9-9"
       style="font-style:normal;font-variant:normal;font-weight:normal;font-stretch:normal;font-size:5.14048px;line-height:1.25;font-family:Poppins;-inkscape-font-specification:'Poppins, Normal';font-variant-ligatures:normal;font-variant-caps:normal;font-variant-numeric:normal;font-variant-east-asian:normal;letter-spacing:0px;word-spacing:0px;white-space:pre;shape-inside:url(#rect4989-9-5);display:inline"
       transform="translate(24.34216,-15.763769)"><tspan
         x="9.1230469"
         y="202.58776"
         id="tspan2809">Organiser un challenge : filme toi en train de remplacer un arbre</tspan></text>
    <path
       d="m 28.55654,100.9123 c -0.109459,0 -0.212479,-0.0451 -0.289743,-0.11912 l -0.241451,-0.24145 c -0.07726,-0.0773 -0.122336,-0.1835 -0.122336,-0.29296 0,-0.10946 0.04507,-0.2157 0.122336,-0.28974 l 0.943272,-0.946492 h -2.266429 c -0.231793,0 -0.376665,-0.19316 -0.376665,-0.412076 v -0.412079 c 0,-0.218916 0.144871,-0.412078 0.376665,-0.412078 h 2.266429 l -0.943272,-0.94649 c -0.07726,-0.07405 -0.122336,-0.180285 -0.122336,-0.289743 0,-0.109457 0.04507,-0.215698 0.122336,-0.289743 l 0.241451,-0.24145 c 0.07726,-0.07726 0.180284,-0.122337 0.289743,-0.122337 0.109458,0 0.215696,0.04507 0.292962,0.122337 l 2.095801,2.0958 c 0.07726,0.07405 0.119116,0.180286 0.119116,0.289744 0,0.109457 -0.04185,0.215697 -0.119116,0.292961 l -2.095801,2.095796 c -0.07727,0.074 -0.183504,0.11912 -0.292962,0.11912 z"
       id="path4911-0-3"
       style="fill:#bf616a;stroke-width:0.00321935" />
  </g>
</svg>
