{
    "reagentID": 0,
    "name": "Meditate",
    "howToRead" : null,
    "whyItMatters" : null,
    "tipsToImprove" : null,
    "benefitsOfBeingOptimal": [
        {
            "informationTypeID": 2,
            "informationType": "Benefits of being optimal",
            "information": "Improved attention",
            "sources": [
                {
                    "source": null,
                    "sourceTitle": null,
                    "sourceAuthor": null
                }
            ],
            "insertDate": null,
            "reagentContentID": 0
        },
        {
            "informationTypeID": 2,
            "informationType": "Benefits of being optimal",
            "information": "Decreased stress",
            "sources": [
                {
                    "source": null,
                    "sourceTitle": null,
                    "sourceAuthor": null
                }
            ],
            "insertDate": null,
            "reagentContentID": 0
        },
        {
            "informationTypeID": 2,
            "informationType": "Benefits of being optimal",
            "information": "Increase happiness",
            "sources": [
                {
                    "source": null,
                    "sourceTitle": null,
                    "sourceAuthor": null
                }
            ],
            "insertDate": null,
            "reagentContentID": 0
        }
    ],
    "risksOfHavingLowLevels": null,
    "risksOfHavingHighLevels": null,
    "possibleInteractionsWithCommonMedications": null,
    "whatCanAffectBioAvailability": null,
    "thingsThatCanImproveYourLevels": null,
    "thingsThatCanLowerYourLevels": null,
    "whatItDoes": null,
    "helpsWith": [
        {
            "informationTypeID": 10,
            "informationType": "Helps with",
            "information": "Brain",
            "sources": [],
            "insertDate": null,
            "reagentContentID": 0
        },
        {
            "informationTypeID": 10,
            "informationType": "Helps with",
            "information": "Energy",
            "sources": [],
            "insertDate": null,
            "reagentContentID": 0
        }
    ],
    "highValueFoods": null
}
