{
  "reagents": [
    {
      "reagent_id": 1,
      "reagent_name": "ph",
      "display_name": "pH",
      "query_string": null,
      "is_beta": false,
      "is_inverted": false,
      "unit": "ph",
      "min_value": 4.5,
      "max_value": 9.0,
      "lower_bound": 6.25,
      "upper_bound": 7.75,
      "consumption_unit": "pH",
      "details_suggestions": {
        "low": "food_supplement",
        "good": null,
        "high": "food_supplement"
      },
      "buckets": [
        {
          "low": 4.5,
          "high": 6.25,
          "reported_value": 5.5,
          "score": 30.0,
          "evaluation": "low",
          "hint": {
            "title": "You're a bit acidic",
            "description": "Not to worry. You can improve your ph by changing your nutrient intake, whether that’s with food and/or supplements. Be patient because it can take 1-2 weeks to see your levels improve. Click below to see your personalized plan. You got this!"
          }
        },
        {
          "low": 6.25,
          "high": 6.75,
          "reported_value": 6.5,
          "score": 100.0,
          "evaluation": "good",
          "hint": {
            "title": "Your pH level is balanced",
            "description": "Good job! You’re keeping your body’s acid-base status well balanced.  Keep up the good work! Check out the Science section below to see some of the potential benefits you may experience by having a balanced pH."
          }
        },
        {
          "low": 6.75,
          "high": 7.25,
          "reported_value": 7,
          "score": 100.0,
          "evaluation": "good",
          "hint": {
            "title": "Your pH level is balanced",
            "description": "Good job! You’re keeping your body’s acid-base status well balanced.  Keep up the good work! Check out the Science section below to see some of the potential benefits you may experience by having a balanced pH."
          }
        },
        {
          "low": 7.25,
          "high": 7.75,
          "reported_value": 7.5,
          "score": 100.0,
          "evaluation": "good",
          "hint": {
            "title": "Your pH level is balanced",
            "description": "Good job! You’re keeping your body’s acid-base status well balanced.  Keep up the good work! Check out the Science section below to see some of the potential benefits you may experience by having a balanced pH."
          }
        },
        {
          "low": 7.75,
          "high": 9.0,
          "reported_value": 8.0,
          "score": 30.0,
          "evaluation": "high",
          "hint": {
            "title": "Your urine pH is too basic",
            "description": "Not to worry. You can improve your ph by changing your nutrient intake, whether that’s with food and/or supplements. Be patient because it can take 1-2 weeks to see your levels improve. Click below to see your personalized plan. You got this!"
          }
        }
      ]
    },
    {
      "reagent_id": 2,
      "reagent_name": "specific_gravity",
      "display_name": "Hydration",
      "query_string": null,
      "is_beta": false,
      "is_inverted": true,
      "unit": "",
      "min_value": 0.999,
      "max_value": 1.034,
      "lower_bound": 1.003,
      "upper_bound": 1.018,
      "consumption_unit": "sp gr",
      "details_suggestions": {
        "low": "hydration",
        "good": null,
        "high": null
      },
      "buckets": [
        {
          "low": 0.999,
          "high": 1.003,
          "reported_value": 1,
          "score": 80,
          "evaluation": "high",
          "hint": {
            "title": "You’re over-hydrated",
            "description": "Oops, you overshot your goal. Your urine is very diluted with water. Try consuming more electrolytes. The best way to do this is by eating more balanced meals that include plenty of fresh fruits and vegetables. Check out your Vessel food recommendations for personalized food recommendations."
          },
          "recommendations": {
            "lifestyle": [
              {
                "name": "water",
                "quantity": 0
              }
            ]
          }
        },
        {
          "low": 1.003,
          "high": 1.008,
          "reported_value": 1.005,
          "score": 90,
          "evaluation": "good",
          "hint": {
            "title": "Your body is well hydrated",
            "description": "Good job! You’re getting enough water to help your body function at its best.  Keep up the good work! Check out the Science section below to see some of the potential benefits you may experience from being well hydrated."
          },
          "recommendations": {
            "lifestyle": [
              {
                "name": "water",
                "quantity": 0
              }
            ]
          }
        },
        {
          "low": 1.008,
          "high": 1.014,
          "reported_value": 1.013,
          "score": 100,
          "evaluation": "good",
          "hint": {
            "title": "Your body is well hydrated",
            "description": "Good job! You’re getting enough water to help your body function at its best.  Keep up the good work! Check out the Science section below to see some of the potential benefits you may experience from being well hydrated."
          },
          "recommendations": {
            "lifestyle": [
              {
                "name": "water",
                "quantity": 0
              }
            ]
          }
        },
        {
          "low": 1.014,
          "high": 1.028,
          "reported_value": 1.022,
          "score": 40,
          "evaluation": "low",
          "hint": {
            "title": "You’re dehydrated",
            "description": "Not to worry. You can improve your hydration level by changing your daily water intake. You should start to see results in 1-2 days so you may want to re-test to make sure you’re hitting your target. Click below to see your personalized plan. You got this!"
          },
          "recommendations": {
            "lifestyle": [
              {
                "name": "water",
                "quantity": 25.6
              }
            ]
          }
        },
        {
          "low": 1.028,
          "high": 1.034,
          "reported_value": 1.03,
          "score": 10,
          "evaluation": "low",
          "hint": {
            "title": "You’re dehydrated",
            "description": "Not to worry. You can improve your hydration level by changing your daily water intake. You should start to see results in 1-2 days so you may want to re-test to make sure you’re hitting your target. Click below to see your personalized plan. You got this!"
          },
          "recommendations": {
            "lifestyle": [
              {
                "name": "water",
                "quantity": 51.2
              }
            ]
          }
        }
      ]
    },
    {
      "reagent_id": 3,
      "reagent_name": "ketones",
      "display_name": "Ketones",
      "query_string": null,
      "is_beta": false,
      "is_inverted": false,
      "unit": "mmol/L",
      "min_value": 0,
      "max_value": 10.0,
      "lower_bound": 2.0,
      "upper_bound": 7.0,
      "consumption_unit": null,
      "details_suggestions": {
        "low": "food",
        "good": null,
        "high": "food"
      },
      "buckets": [
        {
          "low": 0,
          "high": 0.75,
          "reported_value": 0,
          "evaluation": "low",
          "hint": {
            "title": "Your Ketone levels are low.",
            "description": "Not to worry. This is totally normal in people not trying to do a ketogenic diet. If you are, you might want to re-visit the calculations of your target fat, protein, and carbs each day. We’re here to help. Click below to see your personalized plan. You got this!"
          }
        },
        {
          "low": 0.75,
          "high": 2.0,
          "reported_value": 1.0,
          "evaluation": "low",
          "hint": {
            "title": "Your Ketone levels are low.",
            "description": "Not to worry. This is totally normal in people not trying to do a ketogenic diet. If you are, you might want to re-visit the calculations of your target fat, protein, and carbs each day. We’re here to help. Click below to see your personalized plan. You got this!"
          }
        },
        {
          "low": 2.0,
          "high": 7.0,
          "reported_value": 4.5,
          "evaluation": "moderate",
          "hint": {
            "title": "Your Ketone levels are great!",
            "description": "Good job! The diet is working and your body is switching to ketone bodies as its primary fuel source. If you’re not on a ketogenic diet please check in with your doctor as this could be a sign of an underlying disease. Check out the Science section below to see some of the potential benefits you may experience from being in a good range for Ketones."
          }
        },
        {
          "low": 7.0,
          "high": 10.0,
          "reported_value": 8.5,
          "evaluation": "high",
          "hint": {
            "title": "Your Ketone levels are too high",
            "description": "Oops, you overshot the goal. Your ketone levels are a bit higher than the target for most people on a ketogenic diet. You can relax your dietary restrictions a bit and increase the variety in your diet. If you want more variety in your food plan, click below to find out more."
          }
        }
      ]
    },
    {
      "reagent_id": 4,
      "reagent_name": "vitamin_c",
      "display_name": "Vitamin C",
      "query_string": "vitaminb9",
      "is_beta": false,
      "is_inverted": false,
      "unit": "mg/L",
      "healthy_nutrient_level": 520,
      "recommended_daily_allowance": 90.0,
      "has_food_recommendations": true,
      "min_value": 0,
      "max_value": 1000.0,
      "lower_bound": 240.0,
      "upper_bound": 800.0,
      "consumption_unit": "mg",
      "details_suggestions": {
        "low": "food_supplement",
        "good": null,
        "high": null
      },
      "buckets": [
        {
          "low": 0,
          "high": 92.0,
          "reported_value": 50.0,
          "score": 20.0,
          "evaluation": "low",
          "hint": {
            "title": "You’re low in Vitamin C",
            "description": "Not to worry. You can improve your levels by changing your nutrient intake, whether that’s with food and/or supplements. Be patient because it can take 1-3 weeks to see your levels improve. Click below to see your personalized plan. You got this!"
          },
          "recommendations": {
            "food": {
              "rda_multiplier": 4
            },
            "supplement": {
              "rda_multiplier": 6
            }
          }
        },
        {
          "low": 92.0,
          "high": 240.0,
          "reported_value": 150,
          "score": 60.0,
          "evaluation": "low",
          "hint": {
            "title": "You’re low in Vitamin C",
            "description": "Not to worry. You can improve your levels by changing your nutrient intake, whether that’s with food and/or supplements. Be patient because it can take 1-3 weeks to see your levels improve. Click below to see your personalized plan. You got this!"
          },
          "recommendations": {
            "food": {
              "rda_multiplier": 2
            },
            "supplement": {
              "rda_multiplier": 4
            }
          }
        },
        {
          "low": 240.0,
          "high": 450.0,
          "reported_value": 400.0,
          "score": 100.0,
          "evaluation": "good",
          "hint": {
            "title": "Your Vitamin C level is great!",
            "description": "Good job! You’ve filled up your Vitamin C tank, and a slight excess is spilling out into your urine. This is just what you want. Check out the Science section below to see some of the potential benefits you may experience from being in a good range of Vitamin C."
          },
          "recommendations": {
            "food": {
              "rda_multiplier": 0
            },
            "supplement": {
              "rda_multiplier": 1
            }
          }
        },
        {
          "low": 450.0,
          "high": 600.0,
          "reported_value": 700.0,
          "score": 100.0,
          "evaluation": "good",
          "hint": {
            "title": "Your Vitamin C level is great!",
            "description": "Good job! You’ve filled up your Vitamin C tank, and a slight excess is spilling out into your urine. This is just what you want. Check out the Science section below to see some of the potential benefits you may experience from being in a good range of Vitamin C."
          },
          "recommendations": {
            "food": {
              "rda_multiplier": 0
            },
            "supplement": {
              "rda_multiplier": 0
            }
          }
        },
        {
          "low": 600.0,
          "high": 1000.0,
          "reported_value": 1000.0,
          "score": 100.0,
          "evaluation": "good",
          "hint": {
            "title": "Your Vitamin C level is great!",
            "description": "Good job! You’ve filled up your Vitamin C tank, and a slight excess is spilling out into your urine. This is just what you want. Check out the Science section below to see some of the potential benefits you may experience from being in a good range of Vitamin C."
          },
          "recommendations": {
            "food": {
              "rda_multiplier": 0
            },
            "supplement": {
              "rda_multiplier": 0
            }
          }
        }
      ]
    },
    {
      "reagent_id": 5,
      "reagent_name": "magnesium",
      "display_name": "Magnesium",
      "query_string": "magnesiumglycinate",
      "is_beta": false,
      "is_inverted": false,
      "unit": "mg/L",
      "healthy_nutrient_level": 400,
      "recommended_daily_allowance": 400.0,
      "has_food_recommendations": true,
      "min_value": 0,
      "max_value": 805.0,
      "lower_bound": 100.0,
      "upper_bound": 600.0,
      "consumption_unit": "mg",
      "details_suggestions": {
        "low": "food_supplement",
        "good": null,
        "high": null
      },
      "buckets": [
        {
          "low": 0,
          "high": 100.0,
          "reported_value": 50.0,
          "score": 20.0,
          "evaluation": "low",
          "hint": {
            "title": "You’re low in Magnesium",
            "description": "Not to worry. You can improve your levels by changing your nutrient intake, whether that’s with food and/or supplements. Be patient because it can take 1-2 weeks to see your levels improve. Click below to see your personalized plan. You got this!"
          },
          "recommendations": {
            "food": {
              "rda_multiplier": 2
            },
            "supplement": {
              "rda_multiplier": 2
            }
          }
        },
        {
          "low": 100.0,
          "high": 200.0,
          "reported_value": 150.0,
          "score": 50.0,
          "evaluation": "good",
          "hint": {
            "title": "Your Magnesium level is great!",
            "description": "Good job! You’ve filled up your magnesium tank, and a slight excess is spilling out into your urine. This is just what you want.  Keep up the good work! Check out the Science section below to see some of the potential benefits you may experience from being in a good range for Magnesium."
          },
          "recommendations": {
            "food": {
              "rda_multiplier": 1.2
            },
            "supplement": {
              "rda_multiplier": 1.6
            }
          }
        },
        {
          "low": 200.0,
          "high": 400.0,
          "reported_value": 300.0,
          "score": 90.0,
          "evaluation": "good",
          "hint": {
            "title": "Your Magnesium level is great!",
            "description": "Good job! You’ve filled up your magnesium tank, and a slight excess is spilling out into your urine. This is just what you want.  Keep up the good work! Check out the Science section below to see some of the potential benefits you may experience from being in a good range for Magnesium."
          },
          "recommendations": {
            "food": {
              "rda_multiplier": 0.6
            },
            "supplement": {
              "rda_multiplier": 0.6
            }
          }
        },
        {
          "low": 400.0,
          "high": 600.0,
          "reported_value": 500.0,
          "score": 100.0,
          "evaluation": "good",
          "hint": {
            "title": "Your Magnesium level is great!",
            "description": "Good job! You’ve filled up your magnesium tank, and a slight excess is spilling out into your urine. This is just what you want.  Keep up the good work! Check out the Science section below to see some of the potential benefits you may experience from being in a good range for Magnesium."
          },
          "recommendations": {
            "food": {
              "rda_multiplier": 0
            },
            "supplement": {
              "rda_multiplier": 0
            }
          }
        },
        {
          "low": 600.0,
          "high": 805.0,
          "reported_value": 800.0,
          "score": 90.0,
          "evaluation": "high",
          "hint": {
            "title": "Your Magnesium level is too high",
            "description": "Oops, you overshot the goal. Your magnesium level is much higher than what your body wants right now, and a high concentration of magnesium is being dumped out into your urine. If you’re taking magnesium supplements consider stopping them or reducing the dose unless you’re on them under the supervision of your doctor. You may also want to cut down on spinach, tuna, almonds, and brown rice."
          },
          "recommendations": {
            "food": {
              "rda_multiplier": 0
            },
            "supplement": {
              "rda_multiplier": 0
            }
          }
        }
      ]
    },
    {
      "reagent_id": 6,
      "reagent_name": "b9",
      "display_name": "B9 (Folate)",
      "query_string": null,
      "is_beta": true,
      "is_inverted": false,
      "unit": "ug/L",
      "healthy_nutrient_level": 40,
      "recommended_daily_allowance": 400.0,
      "has_food_recommendations": true,
      "min_value": 0,
      "max_value": 85.0,
      "lower_bound": 20.0,
      "upper_bound": 60.0,
      "consumption_unit": "mcg",
      "details_suggestions": {
        "low": "food_supplement",
        "good": null,
        "high": null
      },
      "buckets": [
        {
          "low": 0,
          "high": 20.0,
          "reported_value": 10.0,
          "score": 50.0,
          "evaluation": "low",
          "hint": {
            "title": "You’re low in Folate",
            "description": "Not to worry. You can improve your levels by changing your nutrient intake, whether that’s with food and/or supplements. Be patient because it can take 1-2 weeks to see your levels improve. Click below to see your personalized plan. You got this!"
          },
          "recommendations": {
            "food": {
              "rda_multiplier": 2
            },
            "supplement": {
              "rda_multiplier": 2
            }
          }
        },
        {
          "low": 20.0,
          "high": 60.0,
          "reported_value": 40.0,
          "score": 100.0,
          "evaluation": "good",
          "hint": {
            "title": "Your Folate level is great!",
            "description": "Good job! You’ve filled up your body’s folate tank, and a slight excess is spilling out into your urine. This is just what you want.  Keep up the good work!  Check out the Science section below to see some of the potential benefits you may experience from being in a good range for Folate."
          },
          "recommendations": {
            "food": {
              "rda_multiplier": 0
            },
            "supplement": {
              "rda_multiplier": 0
            }
          }
        },
        {
          "low": 60.0,
          "high": 85.0,
          "reported_value": 80.0,
          "score": 80.0,
          "evaluation": "high",
          "hint": {
            "title": "Your Folate level is too high",
            "description": "Oops, you overshot the goal. Your folate level is much higher than what your body wants right now, and a high concentration of folic acid  is being dumped out into your urine. If you’re taking folate supplements consider stopping them or reducing the dose. You may also want to cut down on edamame, lentils, and asparagus."
          },
          "recommendations": {
            "food": {
              "rda_multiplier": 0
            },
            "supplement": {
              "rda_multiplier": 0
            }
          }
        }
      ]
    },
    {
      "reagent_id": 8,
      "reagent_name": "cortisol",
      "display_name": "Cortisol",
      "query_string": null,
      "is_beta": false,
      "is_inverted": false,
      "unit": "ug/L",
      "min_value": 0,
      "max_value": 405.0,
      "lower_bound": 50.0,
      "upper_bound": 150.0,
      "consumption_unit": "mcg",
      "details_suggestions": {
        "low": "stress",
        "good": null,
        "high": "stress"
      },
      "buckets": [
        {
          "low": 0,
          "high": 50.0,
          "reported_value": 25.0,
          "score": 80.0,
          "evaluation": "low",
          "hint": {
            "title": "Your Cortisol level is low.",
            "description": "This might be a sign that your body has experienced a high amount of stress for a long period of time, and your adrenal glands may have difficulty creating enough cortisol.  Take a look at your personalized lifestyle recommendations to find out some ways to get your cortisol back in the normal range.  Be patient because it can take several months to see your levels improve. Click below to see your personalized plan. You got this!"
          },
          "recommendations": {
            "lifestyle": [
              {
                "name": "meditate",
                "quantity": 2
              },
              {
                "name": "cardio",
                "quantity": 3
              },
              {
                "name": "yoga",
                "quantity": 2
              },
              {
                "name": "breath",
                "quantity": 6
              },
              {
                "name": "night",
                "quantity": 1
              },
              {
                "name": "friend",
                "quantity": 2
              }
            ]
          }
        },
        {
          "low": 50.0,
          "high": 150.0,
          "reported_value": 100.0,
          "score": 100.0,
          "evaluation": "good",
          "hint": {
            "title": "Your Cortisol level is great!",
            "description": "Good job! Your cortisol levels are in the sweet spot. This is just what you want.  Keep up the good work! Check out the Science section below to see some of the potential benefits you may experience from being in a good range for Cortisol."
          },
          "recommendations": {
            "lifestyle": [
              {
                "name": "meditate",
                "quantity": 0
              },
              {
                "name": "cardio",
                "quantity": 2
              },
              {
                "name": "yoga",
                "quantity": 0
              },
              {
                "name": "breath",
                "quantity": 0
              },
              {
                "name": "night",
                "quantity": 0
              },
              {
                "name": "friend",
                "quantity": 0
              }
            ]
          }
        },
        {
          "low": 150.0,
          "high": 300.0,
          "reported_value": 225.0,
          "score": 50.0,
          "evaluation": "high",
          "hint": {
            "title": "Your Cortisol levels are high",
            "description": "This is usually a sign that your body has mounted a stress response to protect you. This can (and should) happen if you’re sick, have an an injury that is healing, or just did a strenuous workout. However levels should normalize shortly after, so keep checking. Levels are often high due to acute stress, so be sure to check out the lifestyle recommendations below to reduce stress and increase your natural relaxation response."
          },
          "recommendations": {
            "lifestyle": [
              {
                "name": "meditate",
                "quantity": 2
              },
              {
                "name": "cardio",
                "quantity": 3
              },
              {
                "name": "yoga",
                "quantity": 1
              },
              {
                "name": "breath",
                "quantity": 5
              },
              {
                "name": "night",
                "quantity": 1
              },
              {
                "name": "friend",
                "quantity": 2
              }
            ]
          }
        }
      ]
    },
    {
      "reagent_id": 11,
      "reagent_name": "b7",
      "display_name": "B7 (Biotin)",
      "query_string": "biotinvitaminb7",
      "is_beta": false,
      "is_inverted": false,
      "unit": "ug/L",
      "recommended_daily_allowance": 30.0,
      "healthy_nutrient_level": 75,
      "has_food_recommendations": true,
      "min_value": 0,
      "max_value": 50.0,
      "lower_bound": 10.0,
      "upper_bound": 30.0,
      "consumption_unit": "mcg",
      "details_suggestions": {
        "low": "food_supplement",
        "good": null,
        "high": null
      },
      "buckets": [
        {
          "low": 0,
          "high": 10.0,
          "reported_value": 5.0,
          "score": 50.0,
          "evaluation": "low",
          "hint": {
            "title": "You’re low in Biotin",
            "description": "Not to worry. You can improve your levels by changing your nutrient intake, whether that’s with food and/or supplements. Be patient because it can take 1-4 weeks to see your levels improve. Click below to see your personalized plan. You got this!"
          },
          "recommendations": {
            "food": {
              "rda_multiplier": 3
            },
            "supplement": {
              "rda_multiplier": 11
            }
          }
        },
        {
          "low": 10.0,
          "high": 50.0,
          "reported_value": 20.0,
          "score": 100.0,
          "evaluation": "good",
          "hint": {
            "title": "Your Biotin level is great!",
            "description": "Good job! You’ve filled up your body’s Biotin tank, and a slight excess is spilling out into your urine. This is just what you want.  Keep up the good work! Check out the Science section below to see some of the potential benefits you may experience from being in a good range for Biotin."
          },
          "recommendations": {
            "food": {
              "rda_multiplier": 1
            },
            "supplement": {
              "rda_multiplier": 2
            }
          }
        }
      ]
    },
    {
      "reagent_id": 18,
      "reagent_name": "calcium",
      "display_name": "Calcium",
      "query_string": null,
      "is_beta": false,
      "is_inverted": false,
      "unit": "mg/L",
      "recommended_daily_allowance": null,
      "healthy_nutrient_level": null,
      "has_food_recommendations": false,
      "min_value": 0,
      "max_value": 180,
      "lower_bound": 50,
      "upper_bound": 100,
      "consumption_unit": "mg",
      "details_suggestions": {
        "low": null,
        "good": null,
        "high": null
      },
      "buckets": [
        {
          "low": 0,
          "high": 30.0,
          "reported_value": 15.0,
          "score": 50.0,
          "evaluation": "low",
          "hint": {
            "title": "You’re low in Calcium",
            "description": "Not to worry. You can improve your levels by changing your nutrient intake, whether that’s with food and/or supplements. The TOTAL from Food and Supplements Combined for calcium intake should be no greater than 1000mg.Be patient because it can take 1-2 weeks to see your levels improve. Click below to see your personalized plan. You got this! (Note that levels may also be low if you’re on a blood pressure medication called a thiazide diuretic. If you are, unfortunately, you can’t rely on this test to get an accurate calcium level.)"
          },
          "recommendations": {
            "food": {
              "rda_multiplier": 1
            },
            "supplement": {
              "rda_multiplier": 1
            }
          }
        },
        {
          "low": 30.0,
          "high": 110.0,
          "reported_value": 70.0,
          "score": 100.0,
          "evaluation": "good",
          "hint": {
            "title": "Your Calcium level is great!",
            "description": "Good job! You’ve filled up your body’s calcium tank and a slight excess is spilling out into your urine. This is just what you want.  Keep up the good work! Check out the Science section below to see some of the potential benefits you may experience from being in a good range for Calcium."
          },
          "recommendations": {
            "food": {
              "rda_multiplier": 1
            },
            "supplement": {
              "rda_multiplier": 1
            }
          }
        },
        {
          "low": 110.0,
          "high": 160.0,
          "reported_value": 135.0,
          "score": 80.0,
          "evaluation": "high",
          "hint": {
            "title": "Your Calcium level is too high",
            "description": "Oops, you overshot the goal. Your calcium level is higher than what your body wants right now, and a high concentration of calcium is being dumped out into your urine. If you’re taking calcium supplements, consider stopping them or reducing the dose. You may also want to cut down on Kiwifruit, bell peppers, and citrus. (Note, levels may be artificially high if you’re on a medication called a loop diuretic such as Lasix/furosemide. If so, you unfortunately can't rely on our test to assess your Calcium levels.)"
          },
          "recommendations": {
            "food": {
              "rda_multiplier": 1
            },
            "supplement": {
              "rda_multiplier": 1
            }
          }
        }
      ]
    },
    {
      "reagent_id": 20,
      "reagent_name": "sodium",
      "display_name": "Sodium",
      "query_string": null,
      "is_beta": false,
      "is_inverted": false,
      "unit": "mEq/L",
      "recommended_daily_allowance": null,
      "healthy_nutrient_level": null,
      "has_food_recommendations": false,
      "min_value": 0,
      "max_value": 180,
      "lower_bound": 50,
      "upper_bound": 120,
      "consumption_unit": "mg",
      "details_suggestions": {
        "good": null,
        "high": null
      },
      "buckets": [
        {
          "low": 0,
          "high": 30.0,
          "reported_value": 15.0,
          "score": 50.0,
          "evaluation": "good",
          "hint": {
            "title": "Your Sodium results are good",
            "description": "Good job! Your body is excreting healthy amounts of sodium in your urine. This is just what you want. Keep up the good work! Check out the Science section below to see some of the potential benefits you may experience from being in a good range for sodium."
          },
          "recommendations": {
            "food": {
              "rda_multiplier": 1
            },
            "supplement": {
              "rda_multiplier": 1
            }
          }
        },
        {
          "low": 110.0,
          "high": 160.0,
          "reported_value": 135.0,
          "score": 80.0,
          "evaluation": "high",
          "hint": {
            "title": "Your Sodium results are too high",
            "description": "Oops, you overshot the goal. Your sodium level is higher than what your body wants right now, and a high concentration of sodium is being dumped out into your urine. If you’re consuming high amounts of processed and packaged foods this can result in high sodium content in the urine. You can lower your sodium excretion by consuming lower sodium foods such as whole grains, vegetables, fruits, legumes, and unsalted nuts."
          },
          "recommendations": {
            "food": {
              "rda_multiplier": 1
            },
            "supplement": {
              "rda_multiplier": 1
            }
          }
        }
      ]
    }
  ]
}