<svg width="100" height="100" viewBox="0 0 100 100" fill="none" xmlns="http://www.w3.org/2000/svg">
<g clip-path="url(#clip0_517_10000)">
<path d="M45.02 0L20.0332 14.3425V14.36V48.7996L29.4198 54.1945V19.7374L45.02 10.7722V0Z" fill="black"/>
<path d="M54.9887 0V27.4393H45.0204V17.2022L35.625 22.5883V57.7472L45.0204 63.1596V35.7904H54.9887V45.9662L64.3752 40.5713V5.39488L54.9887 0Z" fill="black"/>
<path d="M54.9883 63.1683L79.9751 48.8258V48.8083V14.3688L70.5885 8.97388V43.4309L54.9883 52.3873V63.1683Z" fill="black"/>
<path d="M9.76556 93.6517V86.3357H3.29632V93.6604H0V76.3179H3.29632V83.4584H9.76556V76.3179H13.0619V93.6692L9.76556 93.6517Z" fill="black"/>
<path d="M25.1274 93.6516H22.4833L22.2453 92.7744C21.1344 93.5014 19.8377 93.8971 18.5083 93.9147C16.1815 93.9147 15.1855 92.327 15.1855 90.1339C15.1855 87.5549 16.3137 86.5637 18.9049 86.5637H21.9633V85.2391C21.9633 83.8355 21.5666 83.3355 19.5307 83.3355C18.3453 83.3501 17.1643 83.4823 16.0052 83.7303L15.6086 81.3092C17.0441 80.9149 18.5263 80.7142 20.0154 80.7126C24.0169 80.7126 25.1979 82.1162 25.1979 85.3005L25.1274 93.6516ZM21.9368 88.862H19.5748C18.5259 88.862 18.2439 89.1515 18.2439 90.1164C18.2439 91.0813 18.5347 91.3971 19.5307 91.3971C20.3748 91.3854 21.2023 91.1621 21.9368 90.748V88.862Z" fill="black"/>
<path d="M31.3063 93.915C29.809 93.8928 28.3236 93.6474 26.8994 93.1869L27.3401 90.7658C28.5759 91.1165 29.8537 91.2994 31.1388 91.3097C32.549 91.3097 32.7605 90.9939 32.7605 90.0289C32.7605 89.2482 32.6019 88.8535 30.5395 88.3622C27.4282 87.6078 27.0581 86.8271 27.0581 84.3796C27.0581 81.9322 28.2038 80.7041 31.8263 80.7041C33.114 80.7034 34.3975 80.8506 35.6514 81.1427L35.3341 83.6691C34.1705 83.4539 32.9917 83.3308 31.8086 83.3007C30.4249 83.3007 30.1869 83.6165 30.1869 84.3972C30.1869 85.4148 30.2662 85.4937 31.9496 85.9323C35.4751 86.8709 35.8541 87.3359 35.8541 89.9412C35.9158 92.4062 35.149 93.915 31.3063 93.915Z" fill="black"/>
<path d="M45.4165 93.6518V84.7919C45.4165 84.1164 45.1257 83.7743 44.3941 83.7743C43.2259 83.9069 42.0961 84.2707 41.0714 84.8445V93.6167H37.8984V75.7828L41.089 75.3442V81.9321C42.5276 81.1957 44.1089 80.7768 45.725 80.704C47.8491 80.704 48.6071 82.1865 48.6071 84.4585V93.6518H45.4165Z" fill="black"/>
<path d="M50.9609 79.1687V75.4932H54.1515V79.1687H50.9609ZM50.9609 93.6515V80.967H54.1515V93.6515H50.9609Z" fill="black"/>
<path d="M56.4072 81.0724C56.4072 77.8968 58.2669 76.0459 62.5768 76.0459C64.1747 76.0442 65.767 76.2357 67.3186 76.6161L66.9836 79.4583C65.5765 79.1941 64.1496 79.0474 62.7178 79.0197C60.4439 79.0197 59.7035 79.8004 59.7035 81.6513V88.3182C59.7035 90.1691 60.4351 90.9498 62.7178 90.9498C64.1496 90.9221 65.5765 90.7754 66.9836 90.5112L67.3538 93.3534C65.8022 93.7338 64.21 93.9253 62.6121 93.9236C58.2669 93.9236 56.4425 92.0727 56.4425 88.8971L56.4072 81.0724Z" fill="black"/>
<path d="M73.8671 93.915C69.4602 93.915 68.3145 91.5202 68.3145 88.9149V85.7042C68.3145 83.0726 69.4955 80.7041 73.8671 80.7041C78.2387 80.7041 79.4197 83.0989 79.4197 85.7042V88.9061C79.4109 91.5202 78.2387 93.915 73.8671 93.915ZM73.8671 83.3884C72.166 83.3884 71.5138 84.1428 71.5138 85.5727V88.985C71.5138 90.4149 72.166 91.1693 73.8671 91.1693C75.5681 91.1693 76.2203 90.4149 76.2203 88.985V85.6077C76.2203 84.213 75.5681 83.4147 73.8671 83.4147V83.3884Z" fill="black"/>
<path d="M87.8992 83.6252C86.7278 84.1548 85.5993 84.7736 84.5236 85.4762V93.6606H81.3242V80.9673H84.0212L84.2327 82.3708C85.2708 81.6714 86.3969 81.111 87.5819 80.7041L87.8992 83.6252Z" fill="black"/>
<path d="M99.9999 89.4763C99.9999 92.2921 98.7396 93.9588 95.787 93.9588C94.6436 93.9461 93.5042 93.8227 92.3849 93.5904V98.8537L89.1943 99.2923V80.9673H91.7327L92.05 82.0375C93.2097 81.1725 94.6198 80.7047 96.069 80.7041C98.6338 80.7041 99.9911 82.2129 99.9911 85.0902L99.9999 89.4763ZM92.3849 90.9061C93.3059 91.107 94.2449 91.2157 95.1876 91.2307C96.3422 91.2307 96.7829 90.6868 96.7829 89.5377V85.0288C96.7829 83.9849 96.3863 83.4147 95.2141 83.4147C94.1562 83.4525 93.1455 83.8593 92.3585 84.5639L92.3849 90.9061Z" fill="black"/>
</g>
<defs>
<clipPath id="clip0_517_10000">
<rect width="100" height="100" fill="white"/>
</clipPath>
</defs>
</svg>