<svg xmlns="http://www.w3.org/2000/svg" preserveAspectRatio="none" viewBox="0 0 360 70.56">
  <path fill="#e2ebc3" d="M0 70.56h217.38a88.29 88.29 0 00-18.29-10.82 255.87 255.87 0 00-28.72-10.59L0 0z"/>
  <path fill="#bad269" d="M360 70.56v-31.9L180.49 54.07c-26.56 2.1-46 6.83-60.14 16.28l-.28.21z"/>
</svg>
