[
  {
    "id": 1,
    "name": {
      "en": "City Pool",
      "nl": "Stadszwembad"
    },
    "city": "Eindhoven"
  },
  {
    "id": 2,
    "name": {
      "en": "National Swimming Pool",
      "nl": "Nationaal Zwembad"
    },
    "city": "Amsterdam"
  }
]
