{
  "core": {
    "index.css": [
      {
        "selector": ".navbar-brand.is-flex-grow-1",
        "property": "background-image",
        "value": "url(https://appsemble.app/api/apps/1101/assets/logo);"
      }
    ]
  },
  "@appsemble": {
    "form": {
      "index.css": [
        {
          "selector": "button.is-primary[type='submit']",
          "property": "border-bottom",
          "value": "3px solid #758613"
        }
      ]
    },
    "button-list": {
      "layout.css": [
        {
          "selector": ".button.is-normal",
          "property": "background-color",
          "value": "#c5c614;"
        },
        {
          "selector": ".button.is-primary",
          "property": "border-bottom",
          "value": "3px solid #758613;"
        }
      ]
    }
  }
}
