{
  "nl": {
    "messageIds": {
      "privacyPolicyMessage": "Deelname is vrijwillig, natuurlijk hebben we graag dat je wel deelneemt.\nJij krijgt een uitnodiging per mail. Bij deelname halen we via het Appsemble systeem jouw naam, afdeling, sector op. Jouw e-mailadres blijven we vasthouden om voor deze enquête jou nog een reminder te kunnen sturen met verzoek deel te nemen. En om jou een seintje te geven dat de resultaten beschikbaar zijn. Daarna wordt jouw e-mailadres verwijderd uit de app. En we anonimiseren jou als deelnemer zodat de antwoorden niet herleidbaar zijn naar jou. Als extra stap om herleidbaarheid te voorkomen worden er pas resultaten getoond als minimaal 5 deelnemers antwoorden hebben ingevuld.\n\nHeb je toch nog vragen of opmerkingen? Stel deze dan aan:\n\nsupport@appsemble.com"
    }
  },
  "en": {
    "messageIds": {
      "privacyPolicyMessage": "Participation is optional, but we would like you to participate.\nYou will receive an invitation by email. By participating we retrieve your name, department and sector from the Appsemble system. We store your e-mail address to send you reminders to send you reminders to participate in this survey, and to give you a signal that the results are ready. After this, your e-mail address gets deleted from the app. We also anonimize you as participant so your answers cannot be traced back to you. As an extra step to prevent tracing answers to participants, we prevent showing results until a minimum of 5 participants have answered the survey.\n\nDo you still have questions or comments? You can contact us at:\n\nsupport@appsemble.com"
    }
  }
}
