[
  {
    "workplaceName": "MER.1A",
    "workplaceCode": "MER.FW.CS.1A",
    "capacity": 7,
    "workplaceType": "Focus",
    "deskType": "Cockpit / Standaard",
    "maintenance": []
  },
  {
    "workplaceName": "MER.1Y",
    "workplaceCode": "MER.FW.CS.1Y",
    "capacity": 7,
    "workplaceType": "Routine",
    "deskType": "Cockpit / Zit-Sta",
    "maintenance": []
  },
  {
    "workplaceName": "MER.1ZZ",
    "workplaceCode": "MER.FW.CS.1ZZ",
    "capacity": 7,
    "workplaceType": "Routine",
    "deskType": "Cockpit / Standaard",
    "maintenance": []
  },
  {
    "workplaceName": "MER.1C",
    "workplaceCode": "MER.FW.CS.1C",
    "capacity": 7,
    "workplaceType": "Focus",
    "deskType": "Cockpit / Standaard",
    "maintenance": []
  },
  {
    "workplaceName": "MER.2A",
    "workplaceCode": "MER.FW.CS.2A",
    "capacity": 5,
    "workplaceType": "Focus",
    "deskType": "Cockpit / Standaard",
    "maintenance": []
  },
  {
    "workplaceName": "MER.2B",
    "workplaceCode": "MER.FW.CS.2B",
    "capacity": 12,
    "workplaceType": "Focus",
    "deskType": "Cockpit / Standaard",
    "maintenance": []
  },
  {
    "workplaceName": "MER.2C",
    "workplaceCode": "MER.FW.CS.2C",
    "capacity": 2,
    "workplaceType": "Focus",
    "deskType": "Cockpit / Standaard",
    "maintenance": []
  },
  {
    "workplaceName": "MER.3A",
    "workplaceCode": "MER.FW.CS.3A",
    "capacity": 15,
    "workplaceType": "Focus",
    "deskType": "Cockpit / Standaard",
    "maintenance": []
  },
  {
    "workplaceName": "MER.3B",
    "workplaceCode": "MER.FW.CS.3B",
    "capacity": 1,
    "workplaceType": "Focus",
    "deskType": "Cockpit / Zit-Sta",
    "maintenance": []
  },
  {
    "workplaceName": "MER.4A",
    "workplaceCode": "MER.FW.CS.4A",
    "capacity": 10,
    "workplaceType": "Focus",
    "deskType": "Cockpit / Standaard",
    "maintenance": []
  },
  {
    "workplaceName": "MER.1C",
    "workplaceCode": "MER.FW.CZ.1C",
    "capacity": 2,
    "workplaceType": "Focus",
    "deskType": "Cockpit / Zit-Sta",
    "maintenance": []
  },
  {
    "workplaceName": "MER.2A",
    "workplaceCode": "MER.FW.CZ.2A",
    "capacity": 2,
    "workplaceType": "Focus",
    "deskType": "Cockpit / Zit-Sta",
    "maintenance": []
  },
  {
    "workplaceName": "MER.2C",
    "workplaceCode": "MER.FW.CZ.2C",
    "capacity": 1,
    "workplaceType": "Focus",
    "deskType": "Cockpit / Zit-Sta",
    "maintenance": []
  },
  {
    "workplaceName": "MER.3A",
    "workplaceCode": "MER.FW.CZ.3A",
    "capacity": 1,
    "workplaceType": "Focus",
    "deskType": "Cockpit / Zit-Sta",
    "maintenance": []
  },
  {
    "workplaceName": "MER.3B",
    "workplaceCode": "MER.FW.CZ.3B",
    "capacity": 3,
    "workplaceType": "Focus",
    "deskType": "Cockpit / Zit-Sta",
    "maintenance": []
  },
  {
    "workplaceName": "MER.4A",
    "workplaceCode": "MER.FW.CZ.4A",
    "capacity": 1,
    "workplaceType": "Focus",
    "deskType": "Cockpit / Zit-Sta",
    "maintenance": []
  },
  {
    "workplaceName": "MER.2B",
    "workplaceCode": "MER.FW.OS.2B",
    "capacity": 16,
    "workplaceType": "Focus",
    "deskType": "Open / Standaard",
    "maintenance": []
  },
  {
    "workplaceName": "MER.3B",
    "workplaceCode": "MER.FW.OS.3B",
    "capacity": 42,
    "workplaceType": "Focus",
    "deskType": "Open / Standaard",
    "maintenance": []
  },
  {
    "workplaceName": "MER.2A",
    "workplaceCode": "MER.RW.OS.2A",
    "capacity": 12,
    "workplaceType": "Routine",
    "deskType": "Open / Standaard",
    "maintenance": []
  },
  {
    "workplaceName": "MER.2C",
    "workplaceCode": "MER.RW.OS.2C",
    "capacity": 24,
    "workplaceType": "Routine",
    "deskType": "Open / Standaard",
    "maintenance": []
  },
  {
    "workplaceName": "MER.3A",
    "workplaceCode": "MER.RW.OS.3A",
    "capacity": 28,
    "workplaceType": "Routine",
    "deskType": "Open / Standaard",
    "maintenance": []
  },
  {
    "workplaceName": "MER.4A",
    "workplaceCode": "MER.RW.OS.4A",
    "capacity": 13,
    "workplaceType": "Routine",
    "deskType": "Open / Standaard",
    "maintenance": []
  },
  {
    "workplaceName": "MER.2A",
    "workplaceCode": "MER.RW.OZ.2A",
    "capacity": 4,
    "workplaceType": "Routine",
    "deskType": "Open / Zit-Sta",
    "maintenance": []
  },
  {
    "workplaceName": "MER.2C",
    "workplaceCode": "MER.RW.OZ.2C",
    "capacity": 4,
    "workplaceType": "Routine",
    "deskType": "Open / Zit-Sta",
    "maintenance": []
  },
  {
    "workplaceName": "MER.3A",
    "workplaceCode": "MER.RW.OZ.3A",
    "capacity": 4,
    "workplaceType": "Routine",
    "deskType": "Open / Zit-Sta",
    "maintenance": []
  },
  {
    "workplaceName": "MER.4A",
    "workplaceCode": "MER.RW.OZ.4A",
    "capacity": 3,
    "workplaceType": "Routine",
    "deskType": "Open / Zit-Sta",
    "maintenance": []
  },
  {
    "workplaceName": "MER.0C",
    "workplaceCode": "MER.SW.OS.0C",
    "capacity": 10,
    "workplaceType": "Samenwerken",
    "deskType": "Open / Standaard",
    "maintenance": []
  },
  {
    "workplaceName": "MER.1C",
    "workplaceCode": "MER.SW.OS.1C",
    "capacity": 14,
    "workplaceType": "Samenwerken",
    "deskType": "Open / Standaard",
    "maintenance": []
  },
  {
    "workplaceName": "MER.0C",
    "workplaceCode": "MER.SW.OZ.0C",
    "capacity": 2,
    "workplaceType": "Samenwerken",
    "deskType": "Open / Zit-Sta",
    "maintenance": []
  },
  {
    "workplaceName": "MER.1C",
    "workplaceCode": "MER.SW.OZ.1C",
    "capacity": 4,
    "workplaceType": "Samenwerken",
    "deskType": "Open / Zit-Sta",
    "maintenance": []
  },
  {
    "workplaceName": "NGL.0A",
    "workplaceCode": "NGL.FW.CS.0A",
    "capacity": 2,
    "workplaceType": "Focus",
    "deskType": "Cockpit / Standaard",
    "maintenance": []
  },
  {
    "workplaceName": "NGL.0B",
    "workplaceCode": "NGL.FW.CS.0B",
    "capacity": 3,
    "workplaceType": "Focus",
    "deskType": "Cockpit / Standaard",
    "maintenance": []
  },
  {
    "workplaceName": "NGL.1A",
    "workplaceCode": "NGL.FW.CS.1A",
    "capacity": 4,
    "workplaceType": "Focus",
    "deskType": "Cockpit / Standaard",
    "maintenance": []
  },
  {
    "workplaceName": "NGL.1B",
    "workplaceCode": "NGL.FW.CS.1B",
    "capacity": 4,
    "workplaceType": "Focus",
    "deskType": "Cockpit / Standaard",
    "maintenance": []
  },
  {
    "workplaceName": "NGL.2A",
    "workplaceCode": "NGL.FW.CS.2A",
    "capacity": 5,
    "workplaceType": "Focus",
    "deskType": "Cockpit / Standaard",
    "maintenance": []
  },
  {
    "workplaceName": "NGL.2B",
    "workplaceCode": "NGL.FW.CS.2B",
    "capacity": 5,
    "workplaceType": "Focus",
    "deskType": "Cockpit / Standaard",
    "maintenance": []
  },
  {
    "workplaceName": "NGL.2C",
    "workplaceCode": "NGL.FW.CS.2C",
    "capacity": 4,
    "workplaceType": "Focus",
    "deskType": "Cockpit / Standaard",
    "maintenance": []
  },
  {
    "workplaceName": "NGL.0B",
    "workplaceCode": "NGL.FW.CZ.0B",
    "capacity": 2,
    "workplaceType": "Focus",
    "deskType": "Cockpit / Zit-Sta",
    "maintenance": []
  },
  {
    "workplaceName": "NGL.1B",
    "workplaceCode": "NGL.FW.CZ.1B",
    "capacity": 2,
    "workplaceType": "Focus",
    "deskType": "Cockpit / Zit-Sta",
    "maintenance": []
  },
  {
    "workplaceName": "NGL.2C",
    "workplaceCode": "NGL.FW.CZ.2C",
    "capacity": 2,
    "workplaceType": "Focus",
    "deskType": "Cockpit / Zit-Sta",
    "maintenance": []
  },
  {
    "workplaceName": "NGL.3C",
    "workplaceCode": "NGL.FW.CZ.3C",
    "capacity": 2,
    "workplaceType": "Focus",
    "deskType": "Cockpit / Zit-Sta",
    "maintenance": []
  },
  {
    "workplaceName": "NGL.1A",
    "workplaceCode": "NGL.FW.OS.1A",
    "capacity": 26,
    "workplaceType": "Focus",
    "deskType": "Open / Standaard",
    "maintenance": []
  },
  {
    "workplaceName": "NGL.2A",
    "workplaceCode": "NGL.FW.OS.2A",
    "capacity": 20,
    "workplaceType": "Focus",
    "deskType": "Open / Standaard",
    "maintenance": []
  },
  {
    "workplaceName": "NGL.3C",
    "workplaceCode": "NGL.FW.OS.3C",
    "capacity": 12,
    "workplaceType": "Focus",
    "deskType": "Open / Standaard",
    "maintenance": []
  },
  {
    "workplaceName": "NGL.1A",
    "workplaceCode": "NGL.FW.OZ.1A",
    "capacity": 6,
    "workplaceType": "Focus",
    "deskType": "Open / Zit-Sta",
    "maintenance": []
  },
  {
    "workplaceName": "NGL.2A",
    "workplaceCode": "NGL.FW.OZ.2A",
    "capacity": 4,
    "workplaceType": "Focus",
    "deskType": "Open / Zit-Sta",
    "maintenance": []
  },
  {
    "workplaceName": "NGL.0A",
    "workplaceCode": "NGL.RW.OS.0A",
    "capacity": 32,
    "workplaceType": "Routine",
    "deskType": "Open / Standaard",
    "maintenance": []
  },
  {
    "workplaceName": "NGL.0B",
    "workplaceCode": "NGL.RW.OS.0B",
    "capacity": 32,
    "workplaceType": "Routine",
    "deskType": "Open / Standaard",
    "maintenance": []
  },
  {
    "workplaceName": "NGL.1A",
    "workplaceCode": "NGL.RW.OS.1A",
    "capacity": 28,
    "workplaceType": "Routine",
    "deskType": "Open / Standaard",
    "maintenance": []
  },
  {
    "workplaceName": "NGL.1B",
    "workplaceCode": "NGL.RW.OS.1B",
    "capacity": 32,
    "workplaceType": "Routine",
    "deskType": "Open / Standaard",
    "maintenance": []
  },
  {
    "workplaceName": "NGL.2A",
    "workplaceCode": "NGL.RW.OS.2A",
    "capacity": 29,
    "workplaceType": "Routine",
    "deskType": "Open / Standaard",
    "maintenance": []
  },
  {
    "workplaceName": "NGL.2B",
    "workplaceCode": "NGL.RW.OS.2B",
    "capacity": 24,
    "workplaceType": "Routine",
    "deskType": "Open / Standaard",
    "maintenance": []
  },
  {
    "workplaceName": "NGL.2C",
    "workplaceCode": "NGL.RW.OS.2C",
    "capacity": 54,
    "workplaceType": "Routine",
    "deskType": "Open / Standaard",
    "maintenance": []
  },
  {
    "workplaceName": "NGL.3C",
    "workplaceCode": "NGL.RW.OS.3C",
    "capacity": 36,
    "workplaceType": "Routine",
    "deskType": "Open / Standaard",
    "maintenance": []
  },
  {
    "workplaceName": "NGL.0A",
    "workplaceCode": "NGL.RW.OZ.0A",
    "capacity": 4,
    "workplaceType": "Routine",
    "deskType": "Open / Zit-Sta",
    "maintenance": []
  },
  {
    "workplaceName": "NGL.1A",
    "workplaceCode": "NGL.RW.OZ.1A",
    "capacity": 2,
    "workplaceType": "Routine",
    "deskType": "Open / Zit-Sta",
    "maintenance": []
  },
  {
    "workplaceName": "NGL.1B",
    "workplaceCode": "NGL.RW.OZ.1B",
    "capacity": 4,
    "workplaceType": "Routine",
    "deskType": "Open / Zit-Sta",
    "maintenance": []
  },
  {
    "workplaceName": "NGL.2A",
    "workplaceCode": "NGL.RW.OZ.2A",
    "capacity": 3,
    "workplaceType": "Routine",
    "deskType": "Open / Zit-Sta",
    "maintenance": []
  },
  {
    "workplaceName": "NGL.2B",
    "workplaceCode": "NGL.RW.OZ.2B",
    "capacity": 8,
    "workplaceType": "Routine",
    "deskType": "Open / Zit-Sta",
    "maintenance": []
  },
  {
    "workplaceName": "NGL.2C",
    "workplaceCode": "NGL.RW.OZ.2C",
    "capacity": 4,
    "workplaceType": "Routine",
    "deskType": "Open / Zit-Sta",
    "maintenance": []
  },
  {
    "workplaceName": "NGL.3C",
    "workplaceCode": "NGL.RW.OZ.3C",
    "capacity": 4,
    "workplaceType": "Routine",
    "deskType": "Open / Zit-Sta",
    "maintenance": []
  },
  {
    "workplaceName": "SHT.10",
    "workplaceCode": "SHT.FW.CS.10",
    "capacity": 2,
    "workplaceType": "Focus",
    "deskType": "Cockpit / Standaard",
    "maintenance": []
  },
  {
    "workplaceName": "SHT.11",
    "workplaceCode": "SHT.FW.CS.11",
    "capacity": 2,
    "workplaceType": "Focus",
    "deskType": "Cockpit / Standaard",
    "maintenance": []
  },
  {
    "workplaceName": "SHT.3",
    "workplaceCode": "SHT.FW.CS.3",
    "capacity": 1,
    "workplaceType": "Focus",
    "deskType": "Cockpit / Standaard",
    "maintenance": []
  },
  {
    "workplaceName": "SHT.4",
    "workplaceCode": "SHT.FW.CS.4",
    "capacity": 4,
    "workplaceType": "Focus",
    "deskType": "Cockpit / Standaard",
    "maintenance": []
  },
  {
    "workplaceName": "SHT.7",
    "workplaceCode": "SHT.FW.CS.7",
    "capacity": 4,
    "workplaceType": "Focus",
    "deskType": "Cockpit / Standaard",
    "maintenance": []
  },
  {
    "workplaceName": "SHT.9",
    "workplaceCode": "SHT.FW.CS.9",
    "capacity": 4,
    "workplaceType": "Focus",
    "deskType": "Cockpit / Standaard",
    "maintenance": []
  },
  {
    "workplaceName": "SHT.10",
    "workplaceCode": "SHT.FW.OS.10",
    "capacity": 29,
    "workplaceType": "Focus",
    "deskType": "Open / Standaard",
    "maintenance": []
  },
  {
    "workplaceName": "SHT.11",
    "workplaceCode": "SHT.FW.OS.11",
    "capacity": 28,
    "workplaceType": "Focus",
    "deskType": "Open / Standaard",
    "maintenance": []
  },
  {
    "workplaceName": "SHT.10",
    "workplaceCode": "SHT.FW.OZ.10",
    "capacity": 4,
    "workplaceType": "Focus",
    "deskType": "Open / Zit-Sta",
    "maintenance": []
  },
  {
    "workplaceName": "SHT.11",
    "workplaceCode": "SHT.FW.OZ.11",
    "capacity": 4,
    "workplaceType": "Focus",
    "deskType": "Open / Zit-Sta",
    "maintenance": []
  },
  {
    "workplaceName": "SHT.4",
    "workplaceCode": "SHT.RW.OS.4",
    "capacity": 25,
    "workplaceType": "Routine",
    "deskType": "Open / Standaard",
    "maintenance": []
  },
  {
    "workplaceName": "SHT.7",
    "workplaceCode": "SHT.RW.OS.7",
    "capacity": 26,
    "workplaceType": "Routine",
    "deskType": "Open / Standaard",
    "maintenance": []
  },
  {
    "workplaceName": "SHT.9",
    "workplaceCode": "SHT.RW.OS.9",
    "capacity": 23,
    "workplaceType": "Routine",
    "deskType": "Open / Standaard",
    "maintenance": []
  },
  {
    "workplaceName": "SHT.4",
    "workplaceCode": "SHT.RW.OZ.4",
    "capacity": 5,
    "workplaceType": "Routine",
    "deskType": "Open / Zit-Sta",
    "maintenance": []
  },
  {
    "workplaceName": "SHT.7",
    "workplaceCode": "SHT.RW.OZ.7",
    "capacity": 4,
    "workplaceType": "Routine",
    "deskType": "Open / Zit-Sta",
    "maintenance": []
  },
  {
    "workplaceName": "SHT.9",
    "workplaceCode": "SHT.RW.OZ.9",
    "capacity": 6,
    "workplaceType": "Routine",
    "deskType": "Open / Zit-Sta",
    "maintenance": []
  },
  {
    "workplaceName": "SHT.3",
    "workplaceCode": "SHT.SW.OS.3",
    "capacity": 4,
    "workplaceType": "Samenwerken",
    "deskType": "Open / Standaard",
    "maintenance": []
  },
  {
    "workplaceName": "SHT.3",
    "workplaceCode": "SHT.SW.OZ.3",
    "capacity": 4,
    "workplaceType": "Samenwerken",
    "deskType": "Open / Zit-Sta",
    "maintenance": []
  }
]
