{
    "window.zoomLevel"                  : -1.1,
    "workbench.colorTheme"              : "Default Light+",
    "workbench.list.openMode"           : "doubleClick",
    "workbench.tree.expandMode"         : "doubleClick",


    "editor.fontSize"                   : 16,
    "editor.lineHeight"                 : 28,
    "editor.letterSpacing"              : -0.918,
    "editor.fontWeight"                 : "400",
    "editor.fontFamily"                 : "'Roboto Mono', 'Courier New', Consolas, Monospace",

    "terminal.integrated.fontSize"      : 14,
    "terminal.integrated.lineHeight"    : 1.318,
    "terminal.integrated.letterSpacing" : 0,
    "terminal.integrated.fontWeight"    : "400",
    "terminal.integrated.fontFamily"    : "'Roboto Mono', 'Courier New', Consolas, Monospace",


    // IMPORTANT: DO NOT CHANGE THESE SETTINGS
    "angular.experimental-ivy"                                        : true,
    "breadcrumbs.enabled"                                             : true,
    "breadcrumbs.filePath"                                            : "on",
    "breadcrumbs.symbolPath"                                          : "on",
    "code-runner.runInTerminal"                                       : true,
    "debug.console.wordWrap"                                          : true,
    "editor.acceptSuggestionOnEnter"                                  : "off",
    "editor.autoIndent"                                               : "advanced",
    "editor.bracketPairColorization.enabled"                          : true,
    "editor.codeActionsOnSave"                                        : { "source.organizeImports" : true },
    "editor.codeLensFontFamily"                                       : "'Roboto Mono', 'Courier New', Consolas, Monospace",
    "editor.codeLensFontSize"                                         : 14,
    "editor.cursorBlinking"                                           : "phase",
    "editor.cursorSmoothCaretAnimation"                               : true,
    "editor.cursorStyle"                                              : "line",
    "editor.detectIndentation"                                        : true,
    "editor.folding"                                                  : true,
    "editor.foldingStrategy"                                          : "indentation",
    "editor.fontLigatures"                                            : false,
    "editor.formatOnPaste"                                            : false,
    "editor.formatOnSave"                                             : false,
    "editor.formatOnSaveMode"                                         : "modifications",
    "editor.formatOnType"                                             : false,
    "editor.guides.bracketPairs"                                      : true,
    "editor.guides.bracketPairsHorizontal"                            : true,
    "editor.guides.highlightActiveBracketPair"                        : true,
    "editor.insertSpaces"                                             : true,
    "editor.minimap.enabled"                                          : false,
    "editor.minimap.maxColumn"                                        : 20,
    "editor.minimap.renderCharacters"                                 : false,
    "editor.quickSuggestions"                                         : { "comments" : true },
    "editor.renderControlCharacters"                                  : true,
    "editor.renderIndentGuides"                                       : true,
    "editor.renderWhitespace"                                         : "all",
    "editor.showFoldingControls"                                      : "always",
    "editor.snippetSuggestions"                                       : "bottom",
    "editor.suggest.insertMode"                                       : "replace",
    "editor.suggest.showStatusBar"                                    : true,
    "editor.suggestSelection"                                         : "first",
    "editor.tabCompletion"                                            : "on",
    "editor.tabSize"                                                  : 4,
    "editor.trimAutoWhitespace"                                       : true,
    "editor.unicodeHighlight.ambiguousCharacters"                     : false,
    "editor.unicodeHighlight.includeComments"                         : true,
    "editor.unicodeHighlight.invisibleCharacters"                     : true,
    "editor.unicodeHighlight.nonBasicASCII"                           : true,
    "editor.wordWrap"                                                 : "on",
    "editor.wordWrapColumn"                                           : 120,
    "editor.wrappingIndent"                                           : "deepIndent",
    "emmet.triggerExpansionOnTab"                                     : true,
    "explorer.confirmDelete"                                          : false,
    "explorer.confirmDragAndDrop"                                     : false,
    "explorer.decorations.badges"                                     : true,
    "explorer.decorations.colors"                                     : true,
    "explorer.openEditors.sortOrder"                                  : "editorOrder",
    "explorer.openEditors.visible"                                    : 1,
    "explorer.sortOrder"                                              : "type",
    "extensions.autoUpdate"                                           : true,
    "files.eol"                                                       : "\n",
    "files.trimFinalNewlines"                                         : true,
    "files.trimTrailingWhitespace"                                    : true,
    "git.autofetch"                                                   : true,
    "git.autorefresh"                                                 : true,
    "git.confirmSync"                                                 : true,
    "git.enableSmartCommit"                                           : true,
    "git.ignoreLimitWarning"                                          : true,
    "git.showProgress"                                                : true,
    "git.showPushSuccessNotification"                                 : true,
    "gitlens.defaultGravatarsStyle"                                   : "wavatar",
    "gitlens.showWhatsNewAfterUpgrades"                               : true,
    "gitlens.views.branches.files.layout"                             : "tree",
    "gitlens.views.commits.files.layout"                              : "tree",
    "gitlens.views.lineHistory.avatars"                               : true,
    "gitlens.views.remotes.files.layout"                              : "tree",
    "gitlens.views.repositories.files.layout"                         : "tree",
    "gitlens.views.showRelativeDateMarkers"                           : true,
    "gitlens.views.tags.files.layout"                                 : "tree",
    "html.format.endWithNewline"                                      : true,
    "html.format.extraLiners"                                         : "body",
    "intelephense.completion.fullyQualifyGlobalConstantsAndFunctions" : true,
    "intelephense.completion.insertUseDeclaration"                    : true,
    "intelephense.completion.triggerParameterHints"                   : true,
    "intelephense.format.braces"                                      : "allman",
    "intelephense.format.enable"                                      : true,
    "intelephense.telemetry.enabled"                                  : false,
    "intelephense.trace.server"                                       : "messages",
    "java.code.generators.methodOpeningBraceOnNewLine"                : true,
    "java.codeGeneration.generateComments"                            : true,
    "java.configuration.updateBuildConfiguration"                     : "interactive",
    "java.errors.incompleteClasspath.severity"                        : "ignore",
    "java.format.settings.profile"                                    : "style",
    "java.format.settings.url"                                        : "C:\\vscode\\java\\java-formatter.xml",
    "java.semanticHighlighting.enabled"                               : true,
    "javascript.format.placeOpenBraceOnNewLineForControlBlocks"       : true,
    "javascript.format.placeOpenBraceOnNewLineForFunctions"           : true,
    "javascript.format.semicolons"                                    : "insert",
    "javascript.preferences.jsxAttributeCompletionStyle"              : "auto",
    "javascript.suggest.classMemberSnippets.enabled"                  : true,
    "javascript.updateImportsOnFileMove.enabled"                      : "always",
    "javascript.validate.enable"                                      : false,
    "markdown.preview.breaks"                                         : true,
    "markdown.preview.fontSize"                                       : 16,
    "markdown.preview.lineHeight"                                     : 1.618,
    "mssql.format.placeSelectStatementReferencesOnNewLine"            : true,
    "npm.exclude"                                                     : "",
    "peacock.affectActivityBar"                                       : false,
    "peacock.affectStatusBar"                                         : true,
    "peacock.affectTitleBar"                                          : false,
    "peacock.elementAdjustments"                                      : { "activityBar" : "lighten" },
    "peacock.surpriseMeOnStartup"                                     : true,
    "php-docblocker.author"                                           : { "name" : "...", "email" : "..." },
    "php-docblocker.qualifyClassNames"                                : true,
    "php-docblocker.returnGap"                                        : true,
    "php.executablePath"                                              : "C:\\xampp\\php\\php.exe",
    "php.format.codeStyle"                                            : "PHP Tools",
    "php.problems.workspaceAnalysis"                                  : false,
    "php.suggest.basic"                                               : false,
    "php.validate.enable"                                             : false,
    "php.validate.executablePath"                                     : "C:\\xampp\\php\\php.exe",
    "python.jediEnabled"                                              : true,
    "python.languageServer"                                           : "Jedi",
    "scm.defaultViewMode"                                             : "tree",
    "scm.diffDecorationsIgnoreTrimWhitespace"                         : "true",
    "screencastMode.keyboardShortcutsFormat"                          : "commandWithGroupAndKeys",
    "telemetry.telemetryLevel"                                        : "all",
    "terminal.integrated.defaultProfile.windows"                      : "MyCMD",
    "terminal.integrated.profiles.windows"                            : { "MyCMD" : { "path" : "C:\\Windows\\System32\\cmd.exe", } },
    "terminal.integrated.rendererType"                                : "auto",
    "typescript.format.placeOpenBraceOnNewLineForControlBlocks"       : true,
    "typescript.format.placeOpenBraceOnNewLineForFunctions"           : true,
    "typescript.format.semicolons"                                    : "insert",
    "typescript.preferences.jsxAttributeCompletionStyle"              : "auto",
    "typescript.suggest.classMemberSnippets.enabled"                  : true,
    "typescript.updateImportsOnFileMove.enabled"                      : "always",
    "versionlens.suggestions.showOnStartup"                           : true,
    "versionlens.suggestions.showPrereleasesOnStartup"                : true,
    "vsicons.dontShowConfigManuallyChangedMessage"                    : true,
    "vsicons.dontShowNewVersionMessage"                               : true,
    "vsicons.projectDetection.autoReload"                             : false,
    "vsicons.projectDetection.disableDetect"                          : false,
    "vsintellicode.modify.editor.suggestSelection"                    : "automaticallyOverrodeDefaultValue",
    "window.title"                                                    : "${dirty}${rootPath}${separator}${activeEditorMedium}",
    "workbench.editor.closeOnFileDelete"                              : true,
    "workbench.editor.decorations.badges"                             : true,
    "workbench.editor.decorations.colors"                             : false,
    "workbench.editor.enablePreview"                                  : false,
    "workbench.editor.enablePreviewFromCodeNavigation"                : true,
    "workbench.editor.enablePreviewFromQuickOpen"                     : false,
    "workbench.editor.highlightModifiedTabs"                          : true,
    "workbench.editor.openPositioning"                                : "last",
    "workbench.editor.openSideBySideDirection"                        : "right",
    "workbench.editor.tabSizing"                                      : "fit",
    "workbench.experimental.layoutControl.type"                       : "both",
    "workbench.iconTheme"                                             : "vscode-icons",
    "workbench.list.horizontalScrolling"                              : true,
    "workbench.list.smoothScrolling"                                  : true,
    "workbench.panel.defaultLocation"                                 : "right",
    "workbench.quickOpen.closeOnFocusLost"                            : false,
    "workbench.sideBar.location"                                      : "left",
    "workbench.tree.indent"                                           : 16,
    "workbench.tree.renderIndentGuides"                               : "always",

     "files.associations" :
    {
        "*.php"       : "php",
        "*.php-cs"    : "php",
        "*.blade.php" : "html"
    },
    "files.exclude":
    {
        "**/.DS_Store"     : true,
        "**/.classpath"    : true,
        "**/.factorypath"  : true,
        "**/.git"          : true,
        "**/.project"      : true,
        "**/.pytest_cache" : true,
        "**/.settings"     : true,
        "**/.vscode"       : true,
        "**/__pycache__"   : true,
        "**/node_modules"  : true,
        "*.sublime-*"      : true,
        "venv"             : true
    },
    "files.watcherExclude" :
    {
        "**/.git/objects/**"       : true,
        "**/.git/subtree-cache/**" : true,
        "**/env/**"                : true,
        "**/node_modules/**"       : true,
        "**/venv/**"               : true,
        "env-*"                    : true
    },
    "search.exclude" :
    {
        "**/bower_components" : true,
        "**/env"              : true,
        "**/node_modules"     : true,
        "**/venv"             : true
    },
    "intelephense.files.exclude" :
    [
        "**/.git/**",
        "**/.svn/**",
        "**/.hg/**",
        "**/CVS/**",
        "**/.DS_Store/**",
        "**/node_modules/**",
        "**/bower_components/**",
        "**/storage",
        "**/storage/**",
        "**/tests/**",
        "**/resources/views/**",
        "**/database/migrations/**",
        "**/storage/framework/views/**",
        "**/vendor/**/{Test,test,Tests,tests}/**/*Test.php",
        "_ide_helper.php",
        "_ide_helper_models"
    ],
    "intelephense.stubs":
    [
        "apache", "redis", "bcmath", "bz2", "calendar", "com_dotnet", "Core",
        "ctype", "curl", "date", "dba", "dom", "enchant", "exif", "fileinfo",
        "filter", "fpm", "ftp", "gd", "hash", "iconv", "imap", "interbase",
        "intl", "json", "ldap", "libxml", "mbstring", "mcrypt", "meta", "mssql",
        "mysqli", "oci8", "odbc", "openssl", "pcntl", "pcre", "PDO", "pdo_ibm",
        "pdo_mysql", "pdo_pgsql", "pdo_sqlite", "pgsql", "Phar", "posix", "pspell",
        "readline", "recode", "Reflection", "regex", "session", "shmop",
        "SimpleXML", "snmp", "soap", "sockets", "sodium", "SPL", "sqlite3",
        "standard", "superglobals", "sybase", "sysvmsg", "sysvsem", "sysvshm",
        "tidy", "tokenizer", "wddx", "xml", "xmlreader", "xmlrpc", "xmlwriter",
        "Zend OPcache", "zip", "zlib"
    ],
    "workbench.editorAssociations" :
    {
        "*.pdf"   : "pdf.preview",
        "*.md"    : "default",
        "*.ipynb" : "jupyter.notebook.ipynb"
    },
    "alignment.chars" :
    {
        ":"   : { "spaceBefore" : 1, "spaceAfter" : 1 },
        "::"  : { "spaceBefore" : 0, "spaceAfter" : 0 },
        "="   : { "spaceBefore" : 1, "spaceAfter" : 1 },
        "===" : { "spaceBefore" : 1, "spaceAfter" : 1 },
        "=="  : { "spaceBefore" : 1, "spaceAfter" : 1 },
        "!="  : { "spaceBefore" : 1, "spaceAfter" : 1 },
        "!==" : { "spaceBefore" : 1, "spaceAfter" : 1 },
        "=>"  : { "spaceBefore" : 1, "spaceAfter" : 1 },
        "+="  : { "spaceBefore" : 1, "spaceAfter" : 1 },
        "-="  : { "spaceBefore" : 1, "spaceAfter" : 1 },
        "*="  : { "spaceBefore" : 1, "spaceAfter" : 1 },
        "/="  : { "spaceBefore" : 1, "spaceAfter" : 1 }
    },
    "macros":
    {
        "delay" : [{ "command" : "$delay", "args" : { "milliseconds" : 50 } }],
        "clear" :
        [
            { "command" : "macros.delay"                      },
            { "command" : "editor.action.indentationToSpaces" },
            { "command" : "macros.delay"                      },
            {
                "command" : "remove-empty-lines.inDocument",
                "args"    : 2
            },
            { "command" : "macros.delay" }
        ],
        "save" :
        [
            { "command" : "macros.delay"                },
            { "command" : "macros.clear"                },
            { "command" : "workbench.action.files.save" },
            { "command" : "macros.delay"                }
        ],
        "ftpSave" :
        [
            { "command" : "macros.delay" },
            { "command" : "macros.save"  },
            { "command" : "macros.delay" },
            { "command" : "ftp.save"     },
            { "command" : "macros.delay" }
        ],
        "joinLines" :
        [
            { "command" : "macros.delay"            },
            { "command" : "macros.clear"            },
            { "command" : "macros.delay"            },
            { "command" : "editor.action.joinLines" },
            { "command" : "macros.delay"            }
        ],
        "formatDocument" :
        [
            { "command" : "macros.delay" },
            { "command" : "macros.clear" },
            {
                "command" : "editor.action.formatDocument",
                "when"    : "editorTextFocus && !editorReadonly"
            },
            { "command" : "macros.delay" }
        ],
        "formatDocumentSelection" :
        [
            { "command" : "macros.delay" },
            { "command" : "macros.clear" },
            {
                "command" : "editor.action.formatSelection",
                "when"    : "editorTextFocus && !editorReadonly && editorHasSelection"
            },
            { "command" : "macros.delay" }
        ],
        "runCode" :
        [
            { "command" : "macros.delay"                   },
            { "command" : "macros.clear"                   },
            { "command" : "workbench.action.files.saveAll" },
            { "command" : "macros.delay"                   },
            { "command" : "code-runner.run"                },
            { "command" : "macros.delay"                   }
        ]
    },
    "workbench.colorCustomizations" :
    {
        "[Default Light+]" :
        {
            "activityBar.activeBackground"                        : "#99999950",
            "activityBar.activeBorder"                            : "#ffca28",
            "activityBar.background"                              : "#eceff1",
            "activityBar.border"                                  : "#999999",
            "activityBar.foreground"                              : "#212121",
            "activityBar.inactiveForeground"                      : "#212121",
            "activityBarBadge.background"                         : "#ffca28",
            "activityBarBadge.foreground"                         : "#212121",
            "badge.background"                                    : "#ffca28",
            "badge.foreground"                                    : "#212121",
            "breadcrumb.background"                               : "#eceff1",
            "breadcrumb.foreground"                               : "#212121a6",
            "breadcrumbPicker.background"                         : "#fafafa",
            "button.background"                                   : "#eceff1",
            "button.foreground"                                   : "#212121",
            "contrastBorder"                                      : "#999999",
            "dropdown.background"                                 : "#ffffff",
            "dropdown.border"                                     : "#999999",
            "dropdown.listBackground"                             : "#ffffff",
            "editor.background"                                   : "#fafafa",
            "editor.findMatchBackground"                          : "#fafafa",
            "editor.findMatchBorder"                              : "#000000",
            "editor.findMatchHighlightBackground"                 : "#cfd8dc51",
            "editor.findMatchHighlightBorder"                     : "#00c853",
            "editor.foreground"                                   : "#212121",
            "editor.hoverHighlightBackground"                     : "#cfd8dcb3",
            "editor.lineHighlightBackground"                      : "#eceff1",
            "editor.selectionBackground"                          : "#cfd8dc85",
            "editor.selectionForeground"                          : "#eceff1",
            "editor.selectionHighlightBackground"                 : "#eceff136",
            "editor.selectionHighlightBorder"                     : "#999999",
            "editor.wordHighlightBackground"                      : "#2b202000",
            "editor.wordHighlightBorder"                          : "#999999",
            "editor.wordHighlightStrongBackground"                : "#ffffff00",
            "editor.wordHighlightStrongBorder"                    : "#999999",
            "editorBracketHighlight.foreground1"                  : "#000000",
            "editorBracketHighlight.unexpectedBracket.foreground" : "#FF5370",
            "editorBracketMatch.background"                       : "#ffffff00",
            "editorBracketMatch.border"                           : "#212121",
            "editorCodeLens.foreground"                           : "#999999",
            "editorCursor.background"                             : "#212121",
            "editorCursor.foreground"                             : "#212121",
            "editorGroup.border"                                  : "#999999",
            "editorGroupHeader.border"                            : "#999999",
            "editorGroupHeader.tabsBackground"                    : "#fafafa",
            "editorGroupHeader.tabsBorder"                        : "#999999",
            "editorGutter.addedBackground"                        : "#64dd17",
            "editorGutter.commentRangeForeground"                 : "#b0bec5",
            "editorGutter.deletedBackground"                      : "#c51162",
            "editorGutter.foldingControlForeground"               : "#b0bec5",
            "editorGutter.modifiedBackground"                     : "#ffab00",
            "editorHoverWidget.background"                        : "#ffffff",
            "editorHoverWidget.border"                            : "#999999",
            "editorIndentGuide.activeBackground"                  : "#212121",
            "editorIndentGuide.background"                        : "#cfd8dc",
            "editorLineNumber.activeForeground"                   : "#000000",
            "editorLineNumber.foreground"                         : "#9da1aae2",
            "editorRuler.foreground"                              : "#9da1aac9",
            "editorSuggestWidget.background"                      : "#ffffff",
            "editorSuggestWidget.border"                          : "#999999",
            "editorSuggestWidget.selectedBackground"              : "#cfd8dc",
            "editorUnnecessaryCode.opacity"                       : "#21212180",
            "editorWhitespace.foreground"                         : "#cfd8dc",
            "editorWidget.background"                             : "#eceff1",
            "editorWidget.border"                                 : "#eceff1",
            "gitDecoration.addedResourceForeground"               : "#0091ea",
            "gitDecoration.conflictingResourceForeground"         : "#d81b60",
            "gitDecoration.deletedResourceForeground"             : "#d81b60",
            "gitDecoration.ignoredResourceForeground"             : "#bdbdbd",
            "gitDecoration.modifiedResourceForeground"            : "#0091ea",
            "gitDecoration.stageDeletedResourceForeground"        : "#d81b60",
            "gitDecoration.stageModifiedResourceForeground"       : "#0091ea",
            "gitDecoration.submoduleResourceForeground"           : "#0091ea",
            "gitlens.trailingLineForegroundColor"                 : "#90a4ae",
            "icon.foreground"                                     : "#212121",
            "input.background"                                    : "#ffffff",
            "input.border"                                        : "#999999",
            "list.activeSelectionBackground"                      : "#e5e9eb",
            "list.activeSelectionForeground"                      : "#212121",
            "list.activeSelectionIconForeground"                  : "#212121",
            "list.errorForeground"                                : "#cc0059",
            "list.focusOutline"                                   : "#999999",
            "list.hoverBackground"                                : "#e5e9eb",
            "list.hoverForeground"                                : "#212121",
            "list.inactiveSelectionBackground"                    : "#e5e9eb",
            "list.inactiveSelectionForeground"                    : "#212121",
            "list.warningForeground"                              : "#ff6f00",
            "menu.background"                                     : "#fafafa",
            "menu.border"                                         : "#999999",
            "menu.foreground"                                     : "#212121",
            "notificationToast.border"                            : "#999999",
            "notifications.border"                                : "#999999",
            "panel.background"                                    : "#fafafa",
            "panel.border"                                        : "#999999",
            "peekView.border"                                     : "#999999",
            "peekViewEditor.background"                           : "#ffffff",
            "peekViewEditor.matchHighlightBackground"             : "#49d0c523",
            "peekViewResult.background"                           : "#fbfbfb",
            "peekViewResult.lineForeground"                       : "#212121",
            "peekViewResult.matchHighlightBackground"             : "#49d0c523",
            "peekViewTitle.background"                            : "#eceff1",
            "peekViewTitleDescription.foreground"                 : "#212121",
            "peekViewTitleLabel.foreground"                       : "#2187b3",
            "pickerGroup.border"                                  : "#999999",
            "progressBar.background"                              : "#212121",
            "quickInput.background"                               : "#fafcff",
            "quickInput.foreground"                               : "#212121",
            "quickInputList.focusBackground"                      : "#cfd8dc",
            "quickInputTitle.background"                          : "#ffffff",
            "sash.hoverBorder"                                    : "#ffc400",
            "scrollbar.shadow"                                    : "#2121219e",
            "sideBar.background"                                  : "#fafafa",
            "sideBar.border"                                      : "#999999",
            "sideBar.foreground"                                  : "#212121bb",
            "sideBarSectionHeader.background"                     : "#eceff1",
            "sideBarSectionHeader.border"                         : "#999999",
            "sideBarSectionHeader.foreground"                     : "#212121",
            "sideBarTitle.foreground"                             : "#212121",
            "statusBar.border"                                    : "#999999",
            "statusBarItem.remoteBackground"                      : "#fafafa",
            "statusBarItem.remoteForeground"                      : "#212121",
            "tab.activeBackground"                                : "#fafafa",
            "tab.activeBorder"                                    : "#999999",
            "tab.activeBorderTop"                                 : "#000000",
            "tab.activeForeground"                                : "#000000",
            "tab.activeModifiedBorder"                            : "#ff1744",
            "tab.border"                                          : "#999999",
            "tab.inactiveBackground"                              : "#eceff1",
            "tab.inactiveForeground"                              : "#212121a6",
            "tab.inactiveModifiedBorder"                          : "#ffc400",
            "tab.lastPinnedBorder"                                : "#999999",
            "tab.unfocusedActiveBorderTop"                        : "#9da1aa00",
            "tab.unfocusedActiveForeground"                       : "#000000",
            "tab.unfocusedActiveModifiedBorder"                   : "#ff1744",
            "tab.unfocusedInactiveModifiedBorder"                 : "#ff1744",
            "terminal.ansiBlack"                                  : "#FAFAFA",
            "terminal.ansiBlue"                                   : "#6182B8",
            "terminal.ansiBrightBlack"                            : "#CCD7DA",
            "terminal.ansiBrightBlue"                             : "#6182B8",
            "terminal.ansiBrightCyan"                             : "#39ADB5",
            "terminal.ansiBrightGreen"                            : "#91B859",
            "terminal.ansiBrightMagenta"                          : "#7C4DFF",
            "terminal.ansiBrightRed"                              : "#FF5370",
            "terminal.ansiBrightWhite"                            : "#FFFFFF",
            "terminal.ansiBrightYellow"                           : "#FFB62C",
            "terminal.ansiCyan"                                   : "#39ADB5",
            "terminal.ansiGreen"                                  : "#91B859",
            "terminal.ansiMagenta"                                : "#7C4DFF",
            "terminal.ansiRed"                                    : "#FF5370",
            "terminal.ansiWhite"                                  : "#80CBC4",
            "terminal.ansiYellow"                                 : "#FFB62C",
            "terminal.background"                                 : "#fafafa",
            "terminal.border"                                     : "#999999",
            "terminal.foreground"                                 : "#212121",
            "terminalCursor.background"                           : "#fbff00",
            "terminalCursor.foreground"                           : "#212121",
            "titleBar.activeBackground"                           : "#eceff1",
            "titleBar.activeForeground"                           : "#212121",
            "titleBar.border"                                     : "#999999",
            "titleBar.inactiveBackground"                         : "#eceff1",
            "titleBar.inactiveForeground"                         : "#212121",
            "tree.indentGuidesStroke"                             : "#cfd8dc",
            "widget.shadow"                                       : "#21212156",
            "window.activeBorder"                                 : "#999999",
            "window.inactiveBorder"                               : "#999999"
        }
    },
    "peacock.favoriteColors":
    [
        { "name" : "Pink"  , "value" : "#c51162" },
        { "name" : "Purple", "value" : "#aa00ff" },
        { "name" : "Indigo", "value" : "#304ffe" },
        { "name" : "Cyan"  , "value" : "#00b8d4" },
        { "name" : "Green" , "value" : "#00c853" },
        { "name" : "Lime"  , "value" : "#aeea00" },
        { "name" : "Amber" , "value" : "#ffab00" },
        { "name" : "Brown" , "value" : "#6d4c41" },
        { "name" : "Grey"  , "value" : "#546e7a" }
    ],
    "editor.rulers":
    [
        { "column" :  70 , "color" : "#4285F433" },
        { "column" :  80 , "color" : "#34A85343" },
        { "column" : 100 , "color" : "#FBBC0533" },
        { "column" : 120 , "color" : "#ea358333" }
    ],
    "codesnap.backgroundColor"       : "transparent",
    "codesnap.boxShadow"             : "rgba(0, 0, 0, 0.14) 0px 3px 6px",
    "codesnap.containerPadding"      : "6px",
    "codesnap.realLineNumbers"       : true,
    "codesnap.roundedCorners"        : true,
    "codesnap.showLineNumbers"       : true,
    "codesnap.showWindowControls"    : false,
    "codesnap.showWindowTitle"       : true,
    "codesnap.target"                : "container",
    "codesnap.transparentBackground" : true,

    "editor.tokenColorCustomizations":
    {
        "[Default Light+]":
        {
            "textMateRules":
            [
                {
                    "scope"    : [ "meta.embedded", "source.groovy.embedded" ],
                    "settings" : { "foreground" : "#000000" }
                },
                {
                    "scope"    : "emphasis",
                    "settings" : { "fontStyle" : "italic" }
                },
                {
                    "scope"    : "strong",
                    "settings" : { "fontStyle" : "bold" }
                },
                {
                    "scope"    : "meta.diff.header",
                    "settings" : { "foreground" : "#000080" }
                },
                {
                    "scope"    : "comment",
                    "settings" : { "foreground" : "#90a4ae", "fontStyle" : "italic" }
                },
                {
                    "scope"    : "constant.language",
                    "settings" : { "foreground" : "#1f1f1f" }
                },
                {
                    "scope" :
                    [
                        "constant.numeric",
                        "variable.other.enummember",
                        "keyword.operator.plus.exponent",
                        "keyword.operator.minus.exponent"
                    ],
                    "settings" : { "foreground" : "#098658" }
                },
                {
                    "scope"    : "constant.regexp",
                    "settings" : { "foreground" : "#811F3F" }
                },
                {
                    "scope"    : "entity.name.tag",
                    "settings" : { "foreground" : "#008079" }
                },
                {
                    "scope"    : "entity.name.selector",
                    "settings" : { "foreground" : "#800000" }
                },
                {
                    "scope"    : "entity.other.attribute-name",
                    "settings" : { "foreground" : "#bf006f" }
                },
                {
                    "scope" :
                    [
                        "entity.other.attribute-name.class.css",
                        "entity.other.attribute-name.class.mixin.css",
                        "entity.other.attribute-name.id.css",
                        "entity.other.attribute-name.parent-selector.css",
                        "entity.other.attribute-name.pseudo-class.css",
                        "entity.other.attribute-name.pseudo-element.css",
                        "source.css.less entity.other.attribute-name.id",
                        "entity.other.attribute-name.scss"
                    ],
                    "settings" : { "foreground" : "#800000" }
                },
                {
                    "scope"    : "invalid",
                    "settings" : { "foreground" : "#CD3131" }
                },
                {
                    "scope"    : "markup.underline",
                    "settings" : { "fontStyle" : "underline" }
                },
                {
                    "scope"    : "markup.bold",
                    "settings" : { "foreground" : "#000080", "fontStyle" : "bold" }
                },
                {
                    "scope"    : "markup.heading",
                    "settings" : { "foreground" : "#800000", "fontStyle" : "bold" }
                },
                {
                    "scope"    : "markup.italic",
                    "settings" : { "fontStyle": "italic" }
                },
                {
                    "scope"    : "markup.inserted",
                    "settings" : { "foreground": "#098658" }
                },
                {
                    "scope"    : "markup.deleted",
                    "settings" : { "foreground" : "#A31515" }
                },
                {
                    "scope"    : "markup.changed",
                    "settings" : { "foreground" : "#0451A5" }
                },
                {
                    "scope":
                    [
                        "punctuation.definition.quote.begin.markdown",
                        "punctuation.definition.list.begin.markdown"
                    ],
                    "settings" : { "foreground" : "#0451A5" }
                },
                {
                    "scope"    : "markup.inline.raw",
                    "settings" : { "foreground" : "#800000" }
                },
                {
                    "scope"    : "punctuation.definition.tag",
                    "settings" : { "foreground" : "#008079", "fontStyle" : "bold" }
                },
                {
                    "scope"    : [ "meta.preprocessor", "entity.name.function.preprocessor" ],
                    "settings" : { "foreground" : "#6400c7" }
                },
                {
                    "scope"    : "meta.preprocessor.string",
                    "settings" : { "foreground" : "#A31515" }
                },
                {
                    "scope"    : "meta.preprocessor.numeric",
                    "settings" : { "foreground" : "#098658" }
                },
                {
                    "scope"    : "meta.structure.dictionary.key.python",
                    "settings" : { "foreground" : "#0451A5" }
                },
                {
                    "scope"    : "storage",
                    "settings" : { "foreground" : "#6400c7" }
                },
                {
                    "scope"    : "storage.type",
                    "settings" : { "foreground" : "#6400c7" }
                },
                {
                    "scope"    : [ "storage.modifier", "keyword.operator.noexcept" ],
                    "settings" : { "foreground" : "#6400c7" }
                },
                {
                    "scope"    : [ "string", "meta.embedded.assembly" ],
                    "settings" : { "foreground" : "#A31515" }
                },
                {
                    "scope" :
                    [
                        "string.comment.buffered.block.pug",
                        "string.quoted.pug",
                        "string.interpolated.pug",
                        "string.unquoted.plain.in.yaml",
                        "string.unquoted.plain.out.yaml",
                        "string.unquoted.block.yaml",
                        "string.quoted.single.yaml",
                        "string.quoted.double.xml",
                        "string.quoted.single.xml",
                        "string.unquoted.cdata.xml",
                        "string.quoted.double.html",
                        "string.quoted.single.html",
                        "string.unquoted.html",
                        "string.quoted.single.handlebars",
                        "string.quoted.double.handlebars"
                    ],
                    "settings" : { "foreground" : "#6400c7" }
                },
                {
                    "scope"    : "string.regexp",
                    "settings" : { "foreground" : "#37474F", "fontStyle" : "bold" }
                },
                {
                    "scope" :
                    [
                        "punctuation.definition.template-expression.begin",
                        "punctuation.definition.template-expression.end",
                        "punctuation.section.embedded"
                    ],
                    "settings" : { "foreground" : "#6400c7" }
                },
                {
                    "scope"    : [ "meta.template.expression" ],
                    "settings" : { "foreground" : "#000000" }
                },
                {
                    "scope" :
                    [
                        "support.constant.property-value",
                        "support.constant.font-name",
                        "support.constant.media-type",
                        "support.constant.media",
                        "constant.other.color.rgb-value",
                        "constant.other.rgb-value",
                        "support.constant.color"
                    ],
                    "settings" : { "foreground" : "#0451A5" }
                },
                {
                    "scope" :
                    [
                        "support.type.vendored.property-name",
                        "support.type.property-name",
                        "variable.css",
                        "variable.scss",
                        "variable.other.less",
                        "source.coffee.embedded"
                    ],
                    "settings" : { "foreground" : "#ad1457" }
                },
                {
                    "scope"    : [ "support.type.property-name.json" ],
                    "settings" : { "foreground" : "#0451A5" }
                },
                {
                    "scope"    : "keyword",
                    "settings" : { "foreground" : "#6400c7" }
                },
                {
                    "scope"    : "keyword.control",
                    "settings" : { "foreground" : "#6400c7" }
                },
                {
                    "scope"    : "keyword.operator",
                    "settings" : { "foreground" : "#37474F", "fontStyle" : "bold" }
                },
                {
                    "scope" :
                    [
                        "keyword.operator.new",
                        "keyword.operator.expression",
                        "keyword.operator.cast",
                        "keyword.operator.sizeof",
                        "keyword.operator.alignof",
                        "keyword.operator.typeid",
                        "keyword.operator.alignas",
                        "keyword.operator.instanceof",
                        "keyword.operator.logical.python",
                        "keyword.operator.wordlike"
                    ],
                    "settings" : { "foreground" : "#6400c7" }
                },
                {
                    "scope"    : "keyword.other.unit",
                    "settings" : { "foreground" : "#098658" }
                },
                {
                    "scope" :
                    [
                        "punctuation.section.embedded.begin.php",
                        "punctuation.section.embedded.end.php"
                    ],
                    "settings" : { "foreground" : "#800000" }
                },
                {
                    "scope"    : "support.function.git-rebase",
                    "settings" : { "foreground" : "#0451A5" }
                },
                {
                    "scope"    : "constant.sha.git-rebase",
                    "settings" : { "foreground" : "#098658" }
                },
                {
                    "scope" :
                    [
                        "storage.modifier.import.java",
                        "variable.language.wildcard.java",
                        "storage.modifier.package.java"
                    ],
                    "settings" : { "foreground" : "#bda100", "fontStyle" : "bold" }
                },
                {
                    "scope"    : "variable.language",
                    "settings" : { "foreground" : "#bda100", "fontStyle" : "bold" }
                },
                {
                    "scope":
                    [
                        "entity.name.function",
                        "support.function",
                        "support.constant.handlebars",
                        "source.powershell variable.other.member",
                        "entity.name.operator.custom-literal"
                    ],
                    "settings" : { "foreground" : "#0277bd" }
                },
                {
                    "scope" :
                    [
                        "meta.return-type",
                        "support.class",
                        "support.type",
                        "entity.name.type",
                        "entity.name.namespace",
                        "entity.other.attribute",
                        "entity.name.scope-resolution",
                        "entity.name.class",
                        "storage.type.numeric.go",
                        "storage.type.byte.go",
                        "storage.type.boolean.go",
                        "storage.type.string.go",
                        "storage.type.uintptr.go",
                        "storage.type.error.go",
                        "storage.type.rune.go",
                        "storage.type.cs",
                        "storage.type.generic.cs",
                        "storage.type.modifier.cs",
                        "storage.type.variable.cs",
                        "storage.type.annotation.java",
                        "storage.type.generic.java",
                        "storage.type.java",
                        "storage.type.object.array.java",
                        "storage.type.primitive.array.java",
                        "storage.type.primitive.java",
                        "storage.type.token.java",
                        "storage.type.groovy",
                        "storage.type.annotation.groovy",
                        "storage.type.parameters.groovy",
                        "storage.type.generic.groovy",
                        "storage.type.object.array.groovy",
                        "storage.type.primitive.array.groovy",
                        "storage.type.primitive.groovy"
                    ],
                    "settings" : { "foreground" : "#00897b" }
                },
                {
                    "scope" :
                    [
                        "meta.type.cast.expr",
                        "meta.type.new.expr",
                        "support.constant.math",
                        "support.constant.dom",
                        "support.constant.json",
                        "entity.other.inherited-class"
                    ],
                    "settings" : { "foreground" : "#00897b" }
                },
                {
                    "scope" :
                    [
                        "keyword.control",
                        "source.cpp keyword.operator.new",
                        "source.cpp keyword.operator.delete",
                        "keyword.other.using",
                        "keyword.other.operator",
                        "entity.name.operator"
                    ],
                    "settings" : { "foreground" : "#37474f", "fontStyle" : "bold" }
                },
                {
                    "scope" :
                    [
                        "variable",
                        "meta.definition.variable.name",
                        "support.variable",
                        "entity.name.variable"
                    ],
                    "settings" : { "foreground" : "#424242" }
                },
                {
                    "scope" :
                    [
                        "variable.other.constant",
                        "variable.other.enummember"
                    ],
                    "settings" : { "foreground": "#0070C1" }
                },
                {
                    "scope"    : [ "meta.object-literal.key" ],
                    "settings" : { "foreground" : "#001080" }
                },
                {
                    "scope":
                    [
                        "support.constant.property-value",
                        "support.constant.font-name",
                        "support.constant.media-type",
                        "support.constant.media",
                        "constant.other.color.rgb-value",
                        "constant.other.rgb-value",
                        "support.constant.color"
                    ],
                    "settings" : { "foreground" : "#0451A5" }
                },
                {
                    "scope":
                    [
                        "punctuation.definition.group.regexp",
                        "punctuation.definition.group.assertion.regexp",
                        "punctuation.definition.character-class.regexp",
                        "punctuation.character.set.begin.regexp",
                        "punctuation.character.set.end.regexp",
                        "keyword.operator.negation.regexp",
                        "support.other.parenthesis.regexp"
                    ],
                    "settings" : { "foreground" : "#D16969" }
                },
                {
                    "scope" :
                    [
                        "constant.character.character-class.regexp",
                        "constant.other.character-class.set.regexp",
                        "constant.other.character-class.regexp",
                        "constant.character.set.regexp"
                    ],
                    "settings" : { "foreground" : "#811F3F" }
                },
                {
                    "scope"    : "keyword.operator.quantifier.regexp",
                    "settings" : { "foreground" : "#000000" }
                },
                {
                    "scope" :
                    [
                        "keyword.operator.or.regexp",
                        "keyword.control.anchor.regexp"
                    ],
                    "settings" : { "foreground" : "#EE0000" }
                },
                {
                    "scope"    : "constant.character",
                    "settings" : { "foreground" : "#6400c7" }
                },
                {
                    "scope"    : "constant.character.escape",
                    "settings" : { "foreground" : "#EE0000" }
                },
                {
                    "scope"    : "entity.name.label",
                    "settings" : { "foreground" : "#000000" }
                },
                {
                    "scope"    : "token.info-token",
                    "settings" : { "foreground" : "#316BCD" }
                },
                {
                    "scope"    : "token.warn-token",
                    "settings" : { "foreground" : "#CD9731" }
                },
                {
                    "scope"    : "token.error-token",
                    "settings" : { "foreground" : "#CD3131" }
                },
                {
                    "scope"    : "token.debug-token",
                    "settings" : { "foreground" : "#800080" }
                }
            ]
        }
    }
}
