[
  {
    "id": 1,
    "role": "guitar"
  },
  {
    "id": 2,
    "role": "bass"
  },
  {
    "id": 3,
    "role": "vocals"
  },
  {
    "id": 4,
    "role": "drums"
  },
  {
    "id": 5,
    "role": "synthesizer"
  },
  {
    "id": 6,
    "role": "percussion"
  },
  {
    "id": 7,
    "role": "keyboard"
  },
  {
    "id": 8,
    "role": "hammond organ"
  }
]