{
  "HOST": "0.0.0.0",
  "PORT": 4040,
  "SECRET_KEY": "\\x86s\\xbc\\xb3\\xa6$\\x9f\\xfd\\x1b\\x8b.\\xb2\\xbb\\x81d.k\\xf8Th\\x8d\\x8c_\\x87",
  "SERVER_API_ROOT": "https://3b529846-7894-42e4-bcec-d9c3f6116766.mock.pstmn.io"
}
