<?xml version="1.0" encoding="utf-8"?>
<!-- Generator: Adobe Illustrator 22.1.0, SVG Export Plug-In . SVG Version: 6.00 Build 0)  -->
<svg version="1.1" xmlns="http://www.w3.org/2000/svg" xmlns:xlink="http://www.w3.org/1999/xlink" x="0px" y="0px"
	 viewBox="0 0 428.1 393.1" enable-background="new 0 0 428.1 393.1" xml:space="preserve">
<g id="Layer_1">
</g>
<g id="Layer_3">
</g>
<g id="Layer_2" opacity="0.72">
</g>
<g id="Layer_4">
</g>
<g id="Layer_5">
	
		<linearGradient id="SVGID_1_" gradientUnits="userSpaceOnUse" x1="686.5034" y1="-1458.1395" x2="-186.4486" y2="-1770.3879" gradientTransform="matrix(1 0 0 -1 -41.5 -1435.7932)">
		<stop  offset="0.2202" style="stop-color:#C2DAF2"/>
		<stop  offset="1" style="stop-color:#FFFFFF;stop-opacity:0"/>
	</linearGradient>
	<path fill="url(#SVGID_1_)" d="M173.2,24.7C108.3,25,75.8,136.6,63.6,193.9c-12.2,57.3,0.5,175,94.8,159.4
		c15.2-2.5,18.8-3,31.4-9.3c22.4-11.2,48.8-19.1,72.7-21.5c9.8-1,22.2-4.2,28.8-5.4c52.6-9.5,106.3-60.4,90-113.8
		c-12.2-40.1-48-56.3-83.8-54c-19.7,1.2-40.6-10.3-44.8-23.1C239.1,84.6,223.3,24.4,173.2,24.7z"/>
	<path fill="#2E446D" d="M173.2,51.9h-1.9v-1.9c0-1.8-1.4-3.2-3.2-3.2c-1.8,0-3.2,1.4-3.2,3.2v1.9h-1.9c-1.8,0-3.2,1.4-3.2,3.2
		c0,1.8,1.4,3.2,3.2,3.2h1.9v1.9c0,1.8,1.4,3.2,3.2,3.2c1.8,0,3.2-1.4,3.2-3.2v-1.9h1.9c1.8,0,3.2-1.4,3.2-3.2
		C176.4,53.3,175,51.9,173.2,51.9z"/>
	<path fill="#329BD6" d="M195,68.6h-1.9v-1.9c0-1.8-1.4-3.2-3.2-3.2c-1.8,0-3.2,1.4-3.2,3.2v1.9h-1.9c-1.8,0-3.2,1.4-3.2,3.2
		s1.4,3.2,3.2,3.2h1.9V77c0,1.8,1.4,3.2,3.2,3.2c1.8,0,3.2-1.4,3.2-3.2v-1.9h1.9c1.8,0,3.2-1.4,3.2-3.2S196.8,68.6,195,68.6z"/>
	<path fill="#2E446D" d="M202.4,321.8h-1.9v-1.9c0-1.8-1.4-3.2-3.2-3.2s-3.2,1.4-3.2,3.2v1.9h-1.9c-1.8,0-3.2,1.4-3.2,3.2
		c0,1.8,1.4,3.2,3.2,3.2h1.9v1.9c0,1.8,1.4,3.2,3.2,3.2s3.2-1.4,3.2-3.2v-1.9h1.9c1.8,0,3.2-1.4,3.2-3.2
		C205.6,323.2,204.2,321.8,202.4,321.8z"/>
	<path fill="#A74148" d="M153.5,319.7c-0.8,0-1.6-0.3-2.3-0.9l-2.9-2.9l-2.9,2.9c-1.3,1.3-3.3,1.3-4.6,0c-1.3-1.3-1.3-3.3,0-4.6
		l5.2-5.2c1.3-1.3,3.3-1.3,4.6,0l5.2,5.2c1.3,1.3,1.3,3.3,0,4.6C155.2,319.3,154.3,319.7,153.5,319.7z"/>
	<path fill="#A74148" d="M307.6,79.6c-0.8,0-1.6-0.3-2.3-0.9l-2.9-2.9l-2.9,2.9c-1.3,1.3-3.3,1.3-4.6,0c-1.3-1.3-1.3-3.3,0-4.6
		l5.2-5.2c1.3-1.3,3.3-1.3,4.6,0l5.2,5.2c1.3,1.3,1.3,3.3,0,4.6C309.2,79.3,308.4,79.6,307.6,79.6z"/>
	<path opacity="0.1" fill="#2E446D" enable-background="new    " d="M367.7,277.3v16.2c0,3.6-2.9,6.4-6.4,6.4H82.8
		c-3.6,0-6.4-2.9-6.4-6.4v-16.2c0-3.6,2.9-6.4,6.4-6.4h87.7c0.9,0,1.8,0.4,2.4,1.1l8.3,9.6h81.6l8.3-9.6c0.6-0.7,1.5-1.1,2.4-1.1
		h87.7C364.8,270.9,367.7,273.7,367.7,277.3z"/>
	<path fill="#6287C5" d="M348.4,268.7H95.7v-161c0-6.1,5-11.1,11.1-11.1h230.5c6.1,0,11.1,5,11.1,11.1L348.4,268.7L348.4,268.7z"/>
	<path fill="#A3BAE0" d="M367.7,259.9v16.2c0,3.6-2.9,6.4-6.4,6.4H82.8c-3.6,0-6.4-2.9-6.4-6.4v-16.2c0-3.6,2.9-6.4,6.4-6.4h87.7
		c0.9,0,1.8,0.4,2.4,1.1l8.3,9.6h81.6l8.3-9.6c0.6-0.7,1.5-1.1,2.4-1.1h87.7C364.8,253.5,367.7,256.3,367.7,259.9z"/>
	<path fill="#2E446D" d="M95.7,141.6c1.8,0,3.2-1.4,3.2-3.2v-30.6c0-4.3,3.5-7.9,7.9-7.9h230.5c4.3,0,7.9,3.5,7.9,7.9v30.6
		c0,1.8,1.4,3.2,3.2,3.2c1.8,0,3.2-1.4,3.2-3.2v-30.6c0-7.9-6.4-14.3-14.3-14.3H106.8c-7.9,0-14.3,6.4-14.3,14.3v30.6
		C92.4,140.1,93.9,141.6,95.7,141.6z"/>
	<path fill="#2E446D" d="M361.2,250.2h-9.6v-92.2c0-1.8-1.4-3.2-3.2-3.2c-1.8,0-3.2,1.4-3.2,3.2v92.2h-71.6c-1.9,0-3.6,0.8-4.9,2.2
		l-7.3,8.5h-78.7l-7.3-8.5c-1.2-1.4-3-2.2-4.9-2.2H98.9v-92.2c0-1.8-1.4-3.2-3.2-3.2c-1.8,0-3.2,1.4-3.2,3.2v92.2h-9.6
		c-5.3,0-9.7,4.3-9.7,9.7v16.2c0,5.3,4.3,9.7,9.7,9.7h278.4c5.3,0,9.7-4.3,9.7-9.7v-16.2C370.9,254.6,366.6,250.2,361.2,250.2z
		 M364.5,276.1c0,1.8-1.4,3.2-3.2,3.2H82.8c-1.8,0-3.2-1.4-3.2-3.2v-16.2c0-1.8,1.4-3.2,3.2-3.2h87.7l8.3,9.6
		c0.6,0.7,1.5,1.1,2.4,1.1h81.6c0.9,0,1.8-0.4,2.4-1.1l8.3-9.6h87.7c1.8,0,3.2,1.4,3.2,3.2V276.1z"/>
	<path fill="#FFFFFF" d="M330.2,238H113.9c-1.8,0-3.2-1.4-3.2-3.2V115.9c0-1.8,1.4-3.2,3.2-3.2h216.3c1.8,0,3.2,1.4,3.2,3.2v118.9
		C333.4,236.6,332,238,330.2,238z"/>
	<path fill="#A74148" d="M218.4,185c-1.3,0-2.5-0.8-3-2.1l-9-23.1h-9.2c-1.8,0-3.2-1.4-3.2-3.2c0-1.8,1.4-3.2,3.2-3.2h11.4
		c1.3,0,2.5,0.8,3,2.1l5.3,13.7l5.7-40.5c0.2-1.6,1.6-2.8,3.2-2.8h85.7c1.8,0,3.2,1.4,3.2,3.2c0,1.8-1.4,3.2-3.2,3.2h-82.9
		l-7.1,49.9c-0.2,1.5-1.4,2.6-2.8,2.8C218.6,185,218.5,185,218.4,185z"/>
	<path fill="#A74148" d="M189.4,206.3c-1.8,0-3.2-1.4-3.2-3.2v-12.5c0-1.8,1.4-3.2,3.2-3.2c1.8,0,3.2,1.4,3.2,3.2v12.5
		C192.6,204.9,191.2,206.3,189.4,206.3z"/>
	<path fill="#A74148" d="M195.6,200.1h-12.5c-1.8,0-3.2-1.4-3.2-3.2s1.4-3.2,3.2-3.2h12.5c1.8,0,3.2,1.4,3.2,3.2
		S197.4,200.1,195.6,200.1z"/>
	<path fill="#A74148" d="M170,200.1h-43.2c-1.8,0-3.2-1.4-3.2-3.2s1.4-3.2,3.2-3.2H170c1.8,0,3.2,1.4,3.2,3.2S171.7,200.1,170,200.1
		z"/>
	<path fill="#2E446D" d="M139.5,151.6h-3.4c-4.2,0-7.6-3.4-7.6-7.6v-10.6c0-4.2,3.4-7.6,7.6-7.6h3.4c4.2,0,7.6,3.4,7.6,7.6V144
		C147.1,148.2,143.7,151.6,139.5,151.6z M136.1,132.3c-0.6,0-1.2,0.5-1.2,1.2V144c0,0.6,0.5,1.2,1.2,1.2h3.4c0.6,0,1.2-0.5,1.2-1.2
		v-10.6c0-0.6-0.5-1.2-1.2-1.2H136.1z"/>
	<path fill="#2E446D" d="M160.6,142h-6.1c-1.8,0-3.2-1.4-3.2-3.2s1.4-3.2,3.2-3.2h6.1c0.9,0,1.6-0.7,1.6-1.6s-0.7-1.6-1.6-1.6h-6.1
		c-1.8,0-3.2-1.4-3.2-3.2c0-1.8,1.4-3.2,3.2-3.2h6.1c4.4,0,8.1,3.6,8.1,8.1C168.7,138.3,165.1,142,160.6,142z"/>
	<path fill="#2E446D" d="M160.6,151.6h-6.1c-1.8,0-3.2-1.4-3.2-3.2s1.4-3.2,3.2-3.2h6.1c0.9,0,1.6-0.7,1.6-1.6
		c0-0.9-0.7-1.6-1.6-1.6h-6.1c-1.8,0-3.2-1.4-3.2-3.2s1.4-3.2,3.2-3.2h6.1c4.4,0,8.1,3.6,8.1,8.1C168.7,148,165.1,151.6,160.6,151.6
		z"/>
	<path fill="#2E446D" d="M140.5,185.9h-3.4c-4.2,0-7.6-3.4-7.6-7.6v-10.6c0-4.2,3.4-7.6,7.6-7.6h3.4c4.2,0,7.6,3.4,7.6,7.6v10.6
		C148.1,182.5,144.7,185.9,140.5,185.9z M137.1,166.5c-0.6,0-1.2,0.5-1.2,1.2v10.6c0,0.6,0.5,1.2,1.2,1.2h3.4c0.6,0,1.2-0.5,1.2-1.2
		v-10.6c0-0.6-0.5-1.2-1.2-1.2H137.1z"/>
	<path fill="#2E446D" d="M164.4,174.8h-9c-1.8,0-3.2-1.4-3.2-3.2v-8.3c0-1.8,1.4-3.2,3.2-3.2c1.8,0,3.2,1.4,3.2,3.2v5.1h5.8
		c1.8,0,3.2,1.4,3.2,3.2S166.2,174.8,164.4,174.8z"/>
	<path fill="#2E446D" d="M165.4,185.5c-1.8,0-3.2-1.4-3.2-3.2v-19c0-1.8,1.4-3.2,3.2-3.2c1.8,0,3.2,1.4,3.2,3.2v19
		C168.7,184,167.2,185.5,165.4,185.5z"/>
	<path fill="#2E446D" d="M266.4,168.4c-1.8,0-3.2-1.4-3.2-3.2V149h-0.3c-1.8,0-3.2-1.4-3.2-3.2c0-1.8,1.4-3.2,3.2-3.2h3.5
		c1.8,0,3.2,1.4,3.2,3.2v19.4C269.6,166.9,268.1,168.4,266.4,168.4z"/>
	<path fill="#2E446D" d="M254.1,168.2h-11.7c-1.4,0-2.6-0.9-3-2.2c-0.5-1.3,0-2.7,1-3.6c3.2-2.6,8.3-7.4,9.3-9.8
		c0.4-0.9,0.3-2-0.2-2.7c-0.4-0.6-0.9-0.8-1.7-0.8c-1.2,0-2.2,1-2.2,2.2c0,1.8-1.4,3.2-3.2,3.2c-1.8,0-3.2-1.4-3.2-3.2
		c0-4.8,3.9-8.7,8.7-8.7c2.9,0,5.4,1.4,7,3.7c1.7,2.5,2,5.8,0.8,8.7c-0.9,2.1-2.8,4.5-4.9,6.6h3.3c1.8,0,3.2,1.4,3.2,3.2
		S255.8,168.2,254.1,168.2z"/>
	<path fill="#2E446D" d="M280.5,163.1c-0.8,0-1.6-0.3-2.3-0.9c-1.3-1.3-1.3-3.3,0-4.6l8.8-8.8c1.3-1.3,3.3-1.3,4.6,0
		c1.3,1.3,1.3,3.3,0,4.6l-8.8,8.8C282.1,162.8,281.3,163.1,280.5,163.1z"/>
	<path fill="#2E446D" d="M289.3,163.1c-0.8,0-1.6-0.3-2.3-0.9l-8.8-8.8c-1.3-1.3-1.3-3.3,0-4.6c1.3-1.3,3.3-1.3,4.6,0l8.8,8.8
		c1.3,1.3,1.3,3.3,0,4.6C290.9,162.8,290.1,163.1,289.3,163.1z"/>
	<path fill="#2E446D" d="M254.2,212h-31.9c-1.8,0-3.2-1.4-3.2-3.2c0-1.8,1.4-3.2,3.2-3.2h31.9c1.8,0,3.2,1.4,3.2,3.2
		C257.5,210.6,256,212,254.2,212z"/>
	<path fill="#2E446D" d="M271.6,223.3h-49.3c-1.8,0-3.2-1.4-3.2-3.2c0-1.8,1.4-3.2,3.2-3.2h49.3c1.8,0,3.2,1.4,3.2,3.2
		C274.9,221.9,273.4,223.3,271.6,223.3z"/>
	<path fill="#2E446D" d="M223.3,200.4c1.8,0,3.2-1.4,3.2-3.2s-1.4-3.2-3.2-3.2s-3.2,1.4-3.2,3.2S221.5,200.4,223.3,200.4z"/>
	<path fill="#2E446D" d="M233.8,200.4c1.8,0,3.2-1.4,3.2-3.2s-1.4-3.2-3.2-3.2c-1.8,0-3.2,1.4-3.2,3.2S232,200.4,233.8,200.4z"/>
	<path fill="#FEE784" d="M320,238h-35.1v-58.4c0-1.8,1.4-3.2,3.2-3.2h28.7c1.8,0,3.2,1.4,3.2,3.2V238z"/>
	<path fill="#FEE784" d="M197.2,238H125v-17.9c0-1.8,1.4-3.2,3.2-3.2H194c1.8,0,3.2,1.4,3.2,3.2V238z"/>
</g>
</svg>
