<?xml version="1.0" encoding="utf-8"?>
<!-- Generator: Adobe Illustrator 22.1.0, SVG Export Plug-In . SVG Version: 6.00 Build 0)  -->
<svg version="1.1" xmlns="http://www.w3.org/2000/svg" xmlns:xlink="http://www.w3.org/1999/xlink" x="0px" y="0px"
	 viewBox="0 0 240.2 197.8" enable-background="new 0 0 240.2 197.8" xml:space="preserve">
<g id="Layer_2">
</g>
<g id="Layer_1">
	<g>
		<g>
			<g>
				<polygon fill="#5CFFF6" points="104.6,16.7 0,197.8 209.1,197.8 				"/>
				<polygon fill="#0BE3F3" points="0,197.8 156.9,107.2 209.1,197.8 				"/>
				<polygon fill="#00BCFF" points="209.1,197.8 156.9,107.2 104.6,197.8 				"/>
				<polygon fill="#005CFF" points="104.6,197.8 183,152.5 209.1,197.8 				"/>
				<polygon fill="#0825F8" points="209.1,197.8 183,152.5 156.9,197.8 				"/>
				<polygon fill="#2E12D5" points="183,152.5 183,197.8 209.1,197.8 				"/>
				<g>
					<path fill="#003DFF" d="M134.2,6l-3.8,2.2l4.3,7.3c1,1.7,1.3,3.6,0.7,5.5c-0.5,1.9-1.6,3.4-3.3,4.4c-1.7,1-3.6,1.3-5.5,0.7
						c-1.9-0.5-3.4-1.6-4.4-3.3l-5.6-9.5c-0.4-0.6-0.4-1.2-0.3-1.9c0.2-0.7,0.6-1.2,1.2-1.5l16.3-9.5c0.6-0.3,1.2-0.4,1.9-0.3
						c0.7,0.2,1.2,0.6,1.6,1.2l6.4,10.9c0.3,0.6,0.4,1.2,0.3,1.9c-0.2,0.7-0.6,1.2-1.2,1.5s-1.2,0.4-1.9,0.3
						c-0.7-0.2-1.2-0.6-1.5-1.2L134.2,6z M126,10.7l-3.8,2.2l4.3,7.3c0.3,0.5,0.8,0.9,1.3,1c0.6,0.2,1.2,0.1,1.7-0.2
						c0.5-0.3,0.9-0.8,1-1.3c0.2-0.6,0.1-1.1-0.2-1.7L126,10.7z"/>
					<path fill="#003DFF" d="M129.4,35c-0.1-0.5,0-1,0.2-1.5c0.2-0.5,0.6-0.9,1-1.1l16.3-9.5c0.6-0.3,1.2-0.4,1.9-0.3
						c0.7,0.2,1.2,0.6,1.6,1.2c0.3,0.6,0.4,1.2,0.2,1.9c-0.2,0.7-0.6,1.2-1.2,1.5l-10.3,6l17.4,2.9c0.5,0.1,1,0.3,1.4,0.7
						c0.4,0.4,0.6,0.8,0.7,1.3c0.1,0.5,0,1-0.2,1.5c-0.2,0.5-0.6,0.9-1,1.1l-16.3,9.5c-0.6,0.4-1.2,0.4-1.9,0.3
						c-0.7-0.2-1.2-0.6-1.5-1.2c-0.3-0.6-0.4-1.2-0.3-1.9c0.2-0.7,0.6-1.2,1.2-1.5l10.3-6L131.4,37c-0.8-0.1-1.4-0.5-1.8-1.2
						C129.5,35.5,129.4,35.2,129.4,35z"/>
					<path fill="#003DFF" d="M143.4,59.3c-0.4-0.6-0.4-1.2-0.3-1.9c0.2-0.7,0.6-1.2,1.2-1.5l16.3-9.5c0.6-0.3,1.2-0.4,1.9-0.3
						c0.7,0.2,1.2,0.6,1.6,1.2c0.3,0.6,0.4,1.2,0.2,1.9c-0.2,0.7-0.6,1.2-1.2,1.5l-6,3.5l5.4,9.3l6-3.5c0.6-0.3,1.2-0.4,1.9-0.3
						c0.7,0.2,1.2,0.6,1.5,1.2c0.4,0.6,0.4,1.2,0.3,1.9c-0.2,0.7-0.6,1.2-1.2,1.5l-16.3,9.5c-0.6,0.4-1.2,0.4-1.9,0.3
						c-0.7-0.2-1.2-0.6-1.5-1.2c-0.4-0.6-0.4-1.2-0.3-1.9c0.2-0.7,0.6-1.2,1.2-1.5l6-3.5l-5.4-9.3l-6,3.5c-0.6,0.4-1.2,0.4-1.9,0.3
						S143.8,59.9,143.4,59.3z"/>
					<path fill="#0BE3F3" d="M185.8,84.3c0.3,0.6,0.4,1.2,0.3,1.9c-0.2,0.7-0.6,1.2-1.2,1.5l-16.3,9.5c-0.6,0.4-1.2,0.4-1.9,0.3
						c-0.7-0.2-1.2-0.6-1.5-1.2c-0.4-0.6-0.4-1.2-0.3-1.9c0.2-0.7,0.6-1.2,1.2-1.5l14.1-8.3l-5.4-9.3l-14.1,8.3
						c-0.6,0.4-1.2,0.4-1.9,0.3c-0.7-0.2-1.2-0.6-1.5-1.2c-0.4-0.6-0.4-1.2-0.3-1.9c0.2-0.7,0.6-1.2,1.2-1.5l16.3-9.5
						c0.6-0.3,1.2-0.4,1.9-0.3c0.7,0.2,1.2,0.6,1.6,1.2L185.8,84.3z"/>
					<path fill="#0BE3F3" d="M179.3,97c2.9-1.7,5.9-2.1,9.1-1.2c3.2,0.8,5.6,2.7,7.3,5.5c1.7,2.9,2.1,5.9,1.2,9.1
						c-0.8,3.2-2.7,5.6-5.5,7.3c-2.8,1.7-5.9,2.1-9.1,1.2c-3.2-0.8-5.6-2.7-7.3-5.5c-1.7-2.8-2.1-5.9-1.2-9.1
						C174.7,101.1,176.5,98.7,179.3,97z M188.9,113.4c1.6-1,2.7-2.4,3.2-4.2c0.5-1.9,0.3-3.6-0.7-5.3c-1-1.6-2.4-2.7-4.2-3.2
						c-1.9-0.5-3.6-0.2-5.3,0.7c-1.6,1-2.7,2.4-3.2,4.2c-0.5,1.9-0.2,3.6,0.7,5.3c1,1.6,2.4,2.7,4.2,3.2
						C185.5,114.6,187.2,114.3,188.9,113.4z"/>
					<path fill="#0BE3F3" d="M184.7,129.6c-0.1-0.5,0-1,0.2-1.5c0.2-0.5,0.6-0.9,1-1.1l16.3-9.5c0.6-0.3,1.2-0.4,1.9-0.3
						c0.7,0.2,1.2,0.6,1.6,1.2c0.3,0.6,0.4,1.2,0.2,1.9c-0.2,0.7-0.6,1.2-1.2,1.5l-10.3,6l17.4,2.9c0.5,0.1,1,0.3,1.4,0.7
						c0.4,0.4,0.6,0.8,0.7,1.3c0.1,0.5,0,1-0.2,1.5c-0.2,0.5-0.6,0.9-1,1.1l-16.3,9.5c-0.6,0.4-1.2,0.4-1.9,0.3
						c-0.7-0.2-1.2-0.6-1.5-1.2c-0.3-0.6-0.4-1.2-0.3-1.9c0.2-0.7,0.6-1.2,1.2-1.5l10.3-6l-17.4-2.9c-0.8-0.1-1.4-0.5-1.8-1.2
						C184.8,130.2,184.7,129.9,184.7,129.6z"/>
					<path fill="#0BE3F3" d="M202.9,161c-1.7-2.9-2.1-5.9-1.2-9.1c0.8-3.2,2.7-5.6,5.5-7.3c2.9-1.7,5.9-2.1,9.1-1.2
						c3.2,0.8,5.6,2.7,7.3,5.5s2.1,5.9,1.2,9.1c-0.2,0.7-0.6,1.2-1.2,1.5s-1.2,0.4-1.9,0.3c-0.7-0.2-1.2-0.6-1.5-1.2
						c-0.4-0.6-0.4-1.2-0.3-1.9c0.5-1.9,0.2-3.6-0.7-5.3c-1-1.6-2.4-2.7-4.2-3.2c-1.9-0.5-3.6-0.2-5.3,0.7c-1.6,1-2.7,2.4-3.2,4.2
						c-0.5,1.9-0.2,3.6,0.7,5.3c1,1.6,2.4,2.7,4.2,3.2c0.7,0.2,1.2,0.6,1.5,1.2c0.3,0.6,0.4,1.2,0.3,1.9c-0.2,0.7-0.6,1.2-1.2,1.5
						c-0.6,0.4-1.2,0.4-1.9,0.3C207,165.7,204.5,163.9,202.9,161z"/>
					<path fill="#0BE3F3" d="M240.2,178.2c0,0.7-0.3,1.3-0.8,1.7c-0.5,0.5-1.1,0.7-1.8,0.6l-9.7-0.6l-4.2,8.7
						c-0.3,0.6-0.8,1-1.4,1.3c-0.7,0.2-1.3,0.2-1.9-0.1c-0.5-0.2-0.8-0.6-1.1-1c-0.5-0.8-0.5-1.6-0.1-2.4l4.4-9l-2.8-4.8l-6,3.5
						c-0.6,0.4-1.2,0.4-1.9,0.3c-0.7-0.2-1.2-0.6-1.5-1.2c-0.4-0.6-0.4-1.2-0.3-1.9c0.2-0.7,0.6-1.2,1.2-1.5l16.3-9.5
						c0.6-0.3,1.2-0.4,1.9-0.3c0.7,0.2,1.2,0.6,1.6,1.2c0.3,0.6,0.4,1.2,0.2,1.9c-0.2,0.7-0.6,1.2-1.2,1.5l-6,3.5l2.8,4.8l10,0.6
						c0.7,0,1.3,0.3,1.7,0.8C240,176.9,240.2,177.5,240.2,178.2z"/>
				</g>
				
					<line display="none" fill="none" stroke="#A5A7AA" stroke-width="0.25" stroke-miterlimit="10" x1="147.9" y1="233.1" x2="270.4" y2="162.4"/>
				
					<line display="none" fill="none" stroke="#A5A7AA" stroke-width="0.25" stroke-miterlimit="10" x1="43.3" y1="52" x2="165.8" y2="-18.7"/>
			</g>
		</g>
	</g>
</g>
</svg>
