<?xml version="1.0" encoding="utf-8"?>
<!-- Generator: Adobe Illustrator 22.1.0, SVG Export Plug-In . SVG Version: 6.00 Build 0)  -->
<svg version="1.1" xmlns="http://www.w3.org/2000/svg" xmlns:xlink="http://www.w3.org/1999/xlink" x="0px" y="0px"
	 viewBox="0 0 280.2 336.7" enable-background="new 0 0 280.2 336.7" xml:space="preserve">
<g id="Layer_2">
</g>
<g id="Layer_1">
	
		<linearGradient id="SVGID_1_" gradientUnits="userSpaceOnUse" x1="335.7166" y1="-4603.981" x2="5.5662" y2="-4794.7349" gradientTransform="matrix(1 0 0 -1 -41.5 -4524.6577)">
		<stop  offset="1.200000e-03" style="stop-color:#FFEA33"/>
		<stop  offset="1" style="stop-color:#FFFFFF;stop-opacity:0"/>
	</linearGradient>
	<path fill="url(#SVGID_1_)" d="M205.4,179.8c-34.7,0-62.8-28.1-62.8-62.8V77.1c0-36.4-29.5-65.8-65.8-65.8
		c-36.4,0-65.8,29.5-65.8,65.8v52.7c0,107.4,87.1,194.5,194.5,194.5c36.4,0,65.8-29.5,65.8-65.8v-12.8
		C271.3,209.3,241.8,179.8,205.4,179.8z"/>
	<path opacity="0.1" fill="#2D456E" enable-background="new    " d="M173,197.9v-21.4c0-3.4-2.7-6.1-6.1-6.1H166l61.3-90.5
		c0.8-1.2,0.7-2.7-0.3-3.8c-6.8-7.5-13.6-15.1-20.4-22.6H75.5c-6.8,7.5-13.6,15-20.4,22.6c-0.9,1-1,2.6-0.3,3.8l61.3,90.5h-0.9
		c-3.4,0-6.1,2.7-6.1,6.1v21.4c-16.8,10.7-27.9,29.6-27.6,51.1c0.4,32.1,26.6,58.3,58.7,58.7c33.3,0.5,60.4-26.4,60.4-59.5
		C200.6,227,189.6,208.5,173,197.9z M186.7,83.7l-45.6,68.8L95.5,83.7H186.7z"/>
	<path fill="#0825F8" d="M62.3,139.8h-1.8V138c0-1.7-1.4-3.1-3.1-3.1s-3.1,1.4-3.1,3.1v1.8h-1.8c-1.7,0-3.1,1.4-3.1,3.1
		c0,1.7,1.4,3.1,3.1,3.1h1.8v1.8c0,1.7,1.4,3.1,3.1,3.1s3.1-1.4,3.1-3.1v-1.8h1.8c1.7,0,3.1-1.4,3.1-3.1
		C65.4,141.2,64,139.8,62.3,139.8z"/>
	<path fill="#FFDC15" d="M80.4,166h-1.8v-1.8c0-1.7-1.4-3.1-3.1-3.1c-1.7,0-3.1,1.4-3.1,3.1v1.8h-1.8c-1.7,0-3.1,1.4-3.1,3.1
		c0,1.7,1.4,3.1,3.1,3.1h1.8v1.8c0,1.7,1.4,3.1,3.1,3.1c1.7,0,3.1-1.4,3.1-3.1v-1.8h1.8c1.7,0,3.1-1.4,3.1-3.1
		C83.5,167.3,82.1,166,80.4,166z"/>
	<path fill="#0825F8" d="M216.4,166.6c-0.8,0-1.6-0.3-2.2-0.9l-2.7-2.7l-2.7,2.7c-1.2,1.2-3.1,1.2-4.3,0c-1.2-1.2-1.2-3.1,0-4.3
		l4.9-4.9c1.2-1.2,3.1-1.2,4.3,0l4.9,4.9c1.2,1.2,1.2,3.1,0,4.3C218,166.3,217.2,166.6,216.4,166.6z"/>
	<path fill="#FB3F3A" d="M216.4,288.9c-0.8,0-1.6-0.3-2.2-0.9l-2.7-2.7l-2.7,2.7c-1.2,1.2-3.1,1.2-4.3,0c-1.2-1.2-1.2-3.1,0-4.3
		l4.9-4.9c1.2-1.2,3.1-1.2,4.3,0l4.9,4.9c1.2,1.2,1.2,3.1,0,4.3C218,288.6,217.2,288.9,216.4,288.9z"/>
	<path fill="#FB3F3A" d="M59.2,222.6c-0.8,0-1.6-0.3-2.2-0.9l-2.7-2.7l-2.7,2.7c-1.2,1.2-3.1,1.2-4.3,0c-1.2-1.2-1.2-3.1,0-4.3
		l4.9-4.9c1.2-1.2,3.1-1.2,4.3,0l4.9,4.9c1.2,1.2,1.2,3.1,0,4.3C60.8,222.3,60,222.6,59.2,222.6z"/>
	<path fill="#D2051E" d="M190.6,67.1h-99L75.5,37.1h131.1L190.6,67.1z"/>
	<path fill="#ED4036" d="M206.7,37.1c6.8,7.5,13.6,15,20.4,22.6c0.9,1,1,2.6,0.3,3.8l-66.2,97.7h-36.7L206.7,37.1z"/>
	<path fill="#FB3F3A" d="M75.5,37.1c-6.8,7.5-13.6,15-20.4,22.6c-0.9,1-1,2.6-0.3,3.8l66.2,97.7h36.7L75.5,37.1z"/>
	<path fill="#FFEA33" d="M173,194.5h-63.8V160c0-3.4,2.7-6.1,6.1-6.1h51.6c3.4,0,6.1,2.7,6.1,6.1V194.5z"/>
	<path fill="#FFEA33" d="M141.1,291.2c32.9,0,59.5-26.7,59.5-59.5s-26.7-59.5-59.5-59.5s-59.5,26.7-59.5,59.5
		S108.2,291.2,141.1,291.2z"/>
	<path fill="#FFFA99" d="M141.1,278.5c25.9,0,46.9-21,46.9-46.9s-21-46.9-46.9-46.9s-46.9,21-46.9,46.9S115.2,278.5,141.1,278.5z"/>
	<path fill="#FFDC15" d="M141.1,272c22.3,0,40.3-18.1,40.3-40.3c0-22.3-18.1-40.3-40.3-40.3s-40.3,18.1-40.3,40.3
		C100.8,253.9,118.8,272,141.1,272z"/>
	<path fill="#FFFFFF" d="M141.1,263.1c-17.3,0-31.4-14.1-31.4-31.4s14.1-31.4,31.4-31.4s31.4,14.1,31.4,31.4
		S158.4,263.1,141.1,263.1z M141.1,206.4c-14,0-25.3,11.4-25.3,25.3s11.4,25.3,25.3,25.3c14,0,25.3-11.4,25.3-25.3
		S155,206.4,141.1,206.4z"/>
	<path fill="#FFFFFF" d="M141.1,263.1c-10,0-15.5-16.2-15.5-31.4c0-15.2,5.4-31.4,15.5-31.4c10,0,15.5,16.2,15.5,31.4
		S151.1,263.1,141.1,263.1z M141.1,206.4c-3.8,0-9.4,9.9-9.4,25.3c0,7.2,1.2,13.9,3.4,18.8c1.7,4,4,6.5,6,6.5
		c3.8,0,9.4-9.9,9.4-25.3c0-7.2-1.2-13.8-3.4-18.8C145.3,208.8,143,206.4,141.1,206.4z"/>
	<path fill="#FFFFFF" d="M141.1,225.8c-10,0-19.4-2.2-25.2-6c-1.4-0.9-1.8-2.8-0.9-4.2c0.9-1.4,2.8-1.8,4.2-0.9c4.8,3.1,13,5,21.9,5
		c8.9,0,17.3-1.9,22-5.1c1.4-0.9,3.3-0.6,4.2,0.9c0.9,1.4,0.6,3.3-0.9,4.2C160.7,223.5,151.2,225.8,141.1,225.8z"/>
	<path fill="#FFFFFF" d="M117.3,249.3c-1,0-1.9-0.5-2.5-1.4c-0.9-1.4-0.6-3.3,0.8-4.2c5.7-3.9,15.3-6.2,25.5-6.2
		c10,0,19.4,2.2,25.2,6c1.4,0.9,1.8,2.8,0.9,4.2c-0.9,1.4-2.8,1.8-4.2,0.9c-4.8-3.1-13-5-21.9-5c-8.9,0-17.4,2-22.1,5.1
		C118.5,249.1,117.9,249.3,117.3,249.3z"/>
	<path fill="#2E3190" d="M229.3,57.6l-0.2-0.2c-6.6-7.3-13.4-14.9-20.2-22.3c-0.6-0.6-1.4-1-2.3-1H75.5c-0.8,0-1.7,0.4-2.3,1
		c-6.8,7.4-13.6,15-20.2,22.3l-0.2,0.2c-1.9,2.1-2.1,5.2-0.5,7.5l58.7,86.7c-2.9,1.5-5,4.6-5,8.1v19.8
		c-16.7,11.3-27.6,30.3-27.6,51.9c0,34.5,28.1,62.6,62.6,62.6c15,0,29.5-5.4,40.8-15.2c11.2-9.7,18.7-23,21-37.6
		c0.3-1.7-0.9-3.2-2.5-3.5c-1.7-0.3-3.2,0.9-3.5,2.5c-2.1,13.1-8.8,25.2-18.9,33.9c-10.2,8.8-23.3,13.7-36.9,13.7
		c-31.1,0-56.5-25.3-56.5-56.5s25.3-56.5,56.5-56.5c13.5,0,26.6,4.9,36.9,13.7c10.1,8.7,16.8,20.8,18.9,33.9
		c0.3,1.7,1.8,2.8,3.5,2.5c1.7-0.3,2.8-1.8,2.5-3.5c-2.3-14.6-9.7-27.9-21-37.6c-1.9-1.6-3.8-3.1-5.9-4.5V160c0-3.5-2-6.6-5-8.1
		l58.7-86.7C231.4,62.8,231.2,59.7,229.3,57.6z M185.1,64.1h-68.8c-1.7,0-3.1,1.4-3.1,3.1s1.4,3.1,3.1,3.1H181l-39.9,60.2L81.2,40.1
		H201L185.1,64.1z M57.6,61.4C63.4,55,69.3,48.5,75.1,42l72.1,108.8h-29.5L57.4,61.7L57.6,61.4z M141.1,169.1
		c-10.4,0-20.2,2.6-28.9,7.1V160c0-1.7,1.4-3.1,3.1-3.1h51.6c1.7,0,3.1,1.4,3.1,3.1v16.2C161.1,171.5,151.2,169.1,141.1,169.1z
		 M164.4,150.8h-9.8l-9.8-14.8l44.5-67.1L207,42c5.9,6.5,11.8,13,17.5,19.4l0.2,0.2L164.4,150.8z"/>
</g>
</svg>
