<?xml version="1.0" encoding="utf-8"?>
<!-- Generator: Adobe Illustrator 22.1.0, SVG Export Plug-In . SVG Version: 6.00 Build 0)  -->
<svg version="1.1" xmlns="http://www.w3.org/2000/svg" xmlns:xlink="http://www.w3.org/1999/xlink" x="0px" y="0px"
	 viewBox="0 0 80.4 69.6" enable-background="new 0 0 80.4 69.6" xml:space="preserve">
<g id="Layer_2">
</g>
<g id="Layer_1">
	<g>
		<g>
		</g>
		<g>
			<polygon fill="#C252FF" points="40.2,0 0,69.6 80.4,69.6 			"/>
			<polygon fill="#8531F3" points="0,69.6 60.3,34.8 80.4,69.6 			"/>
			<polygon fill="#581BEC" points="80.4,69.6 60.3,34.8 40.2,69.6 			"/>
			<polygon fill="#551EAC" points="60.3,34.8 60.3,69.6 80.4,69.6 			"/>
		</g>
	</g>
</g>
</svg>
