<?xml version="1.0" encoding="utf-8"?>
<!-- Generator: Adobe Illustrator 22.1.0, SVG Export Plug-In . SVG Version: 6.00 Build 0)  -->
<svg version="1.1" xmlns="http://www.w3.org/2000/svg" xmlns:xlink="http://www.w3.org/1999/xlink" x="0px" y="0px"
	 viewBox="0 0 356.8 356.8" enable-background="new 0 0 356.8 356.8" xml:space="preserve">
<g id="Layer_2">
</g>
<g id="Layer_1">
	<g>
		<path id="SVGID_x5F_1_x5F_" fill="none" d="M306.5,179.3c0,68.9-55.9,124.8-124.8,124.8S56.9,248.2,56.9,179.3
			S112.7,54.5,181.7,54.5S306.5,110.4,306.5,179.3z"/>
		<text>		<textPath  xlink:href="#SVGID_x5F_1_x5F_" startOffset="-21812.582%">
<tspan  fill="#D2051E" font-family="'Aqum'" font-size="20.0806px">кружок спортивного программирования - НИУ МЭИ ИВТИ ПМ -</tspan>		</textPath>
</text>
		<g>
			<path fill="#FB3F3A" d="M180.4,331.2c-84.4,0-152.8-68.4-152.8-152.8c0-40.5,15.8-77.4,41.5-104.7L50,54.5
				c-67.4,69.8-66.7,181.1,2.2,250c68.9,68.9,180.2,69.7,250.1,2.2l-17.2-17.2C257.8,315.4,221,331.2,180.4,331.2z"/>
			<path fill="#FFEA33" d="M320.3,240.7c-6.7,15.2-15.9,29.2-26.9,41.3l16.8,16.7c13.7-14.9,24.3-31.6,32-49.3L320.3,240.7z"/>
			<path fill="#FF8E1F" d="M333.1,173.3h23.7c-1.2-41.2-16.6-82.2-46.2-114.8l-17.7,17.7C316.6,102,331.5,135.9,333.1,173.3z"/>
			<path fill="#FF6022" d="M180.4,26.8c40.5,0,77.3,15.7,104.6,41.4l17.8-17.8C234.9-15.5,127.5-16.8,58,46.7l19.7,19.7
				C104.9,41.8,140.9,26.8,180.4,26.8z"/>
			<path fill="#FFA531" d="M333.1,184.5c-0.5,16-3.4,31.5-8.4,45.9l21.5,8.7c6.4-17.6,9.9-36.1,10.5-54.6H333.1z"/>
		</g>
		<g>
			<path fill="#FFEA33" d="M210.7,193.6l69.1,27.9c-4.7,10.7-11.1,20.8-19.4,29.9l-52.7-52.7C208.8,197.1,209.8,195.4,210.7,193.6z"
				/>
			<path fill="#FFA531" d="M213.7,182.1h74.9c-0.4,11.2-2.5,22.4-6.4,33.1l-69.3-28C213.4,185.6,213.6,183.8,213.7,182.1z"/>
			<path fill="#FF6022" d="M255.9,100.8l-54,54c-11.3-9.2-27.5-9.5-39.1-0.9l-55.4-55.4C149.5,59.9,214.7,60.7,255.9,100.8z"/>
			<path fill="#FF8E1F" d="M213.5,175.3c-0.8-5.6-3-11.1-6.8-15.7l53.9-53.9c18,19.8,27.3,44.6,28,69.6H213.5z"/>
			<path fill="#FB3F3A" d="M203,203.7l52.6,52.6c-42.4,40.9-109.9,40.5-151.7-1.4c-41.8-41.8-42.3-109.3-1.4-151.7l55.3,55.3
				c-11.2,12.6-10.7,31.8,1.3,43.9C171.2,214.5,190.4,214.9,203,203.7z"/>
		</g>
	</g>
</g>
</svg>
