com\yethi\tenjin\xmlutils\Xml.class
com\yethi\tenjin\xmlutils\Xml$FromType.class
com\yethi\tenjin\xmlutils\Json$JsonObject.class
com\yethi\tenjin\xmlutils\U$LruCache.class
com\yethi\tenjin\xmlutils\Xml$XmlValue.class
com\yethi\tenjin\xmlutils\Json$ParseException.class
com\yethi\tenjin\xmlutils\Underscore$3.class
com\yethi\tenjin\xmlutils\MemoizeFunction.class
com\yethi\tenjin\xmlutils\Underscore$1BeforeFunction.class
com\yethi\tenjin\xmlutils\Xml$XmlStringBuilder.class
com\yethi\tenjin\xmlutils\PredicateIndexed.class
com\yethi\tenjin\xmlutils\Underscore$MyIterable.class
com\yethi\tenjin\xmlutils\U$OperationType.class
com\yethi\tenjin\xmlutils\U$FetchResponse.class
com\yethi\tenjin\xmlutils\Json$JsonStringBuilder.class
com\yethi\tenjin\xmlutils\Json$JsonValue.class
com\yethi\tenjin\xmlutils\Tuple.class
com\yethi\tenjin\xmlutils\SampleCheck.class
com\yethi\tenjin\kotakvlos\ApplicationImpl.class
com\yethi\tenjin\xmlutils\U$BaseHttpSslSocketFactory.class
com\yethi\tenjin\xmlutils\Underscore$WherePredicate.class
com\yethi\tenjin\xmlutils\Underscore$4.class
com\yethi\tenjin\xmlutils\Xml$ArrayTrue.class
com\yethi\tenjin\xmlutils\Function3.class
com\yethi\tenjin\xmlutils\Json.class
com\yethi\tenjin\xmlutils\Underscore$TemplateImpl.class
com\yethi\tenjin\xmlutils\Base32$DecodingException.class
com\yethi\tenjin\xmlutils\Json$JsonStringBuilder$Step.class
com\yethi\tenjin\xmlutils\Xml$Document.class
com\yethi\tenjin\kotakvlos\CryptoUtils.class
com\yethi\tenjin\xmlutils\Template.class
com\yethi\tenjin\xmlutils\Underscore$1ThrottleLater.class
com\yethi\tenjin\xmlutils\Underscore$Chain.class
com\yethi\tenjin\xmlutils\Underscore.class
com\yethi\tenjin\xmlutils\Xml$XmlArray.class
com\yethi\tenjin\xmlutils\Xml$XmlStringBuilder$Step.class
com\yethi\tenjin\xmlutils\Xml$XmlStringBuilderWithoutRoot.class
com\yethi\tenjin\xmlutils\Underscore$1AfterFunction.class
com\yethi\tenjin\xmlutils\Underscore$1ThrottleFunction.class
com\yethi\tenjin\xmlutils\U$ArrayBuilder.class
com\yethi\tenjin\xmlutils\Underscore$1.class
com\yethi\tenjin\xmlutils\Json$JsonArray.class
com\yethi\tenjin\xmlutils\Base32.class
com\yethi\tenjin\xmlutils\Json$JsonStringBuilder$Type.class
com\yethi\tenjin\xmlutils\U$BaseHttpSslSocketFactory$MyX509TrustManager.class
com\yethi\tenjin\xmlutils\U$TextType.class
com\yethi\tenjin\xmlutils\U$Mode.class
com\yethi\tenjin\xmlutils\Xml$1.class
com\yethi\tenjin\xmlutils\Xml$XmlStringBuilderWithoutHeader.class
com\yethi\tenjin\xmlutils\U$Chain.class
com\yethi\tenjin\xmlutils\Underscore$ValueThenKeyComparator.class
com\yethi\tenjin\xmlutils\Json$JsonParser.class
com\yethi\tenjin\xmlutils\Underscore$2.class
com\yethi\tenjin\xmlutils\Xml$MyEntityResolver.class
com\yethi\tenjin\xmlutils\U$Builder.class
com\yethi\tenjin\kotakvlos\ResponseValidateImpl.class
com\yethi\tenjin\xmlutils\U.class
com\yethi\tenjin\xmlutils\Xml$XmlStringBuilderText.class
com\yethi\tenjin\xmlutils\U$Fetch.class
com\yethi\tenjin\xmlutils\Xml$XmlObject.class
com\yethi\tenjin\xmlutils\Underscore$MyIterable$1.class
