<?xml version="1.0" encoding="UTF-8" standalone="no"?>
<!-- Created with Inkscape (http://www.inkscape.org/) -->

<svg
   xmlns:dc="http://purl.org/dc/elements/1.1/"
   xmlns:cc="http://creativecommons.org/ns#"
   xmlns:rdf="http://www.w3.org/1999/02/22-rdf-syntax-ns#"
   xmlns:svg="http://www.w3.org/2000/svg"
   xmlns="http://www.w3.org/2000/svg"
   xmlns:xlink="http://www.w3.org/1999/xlink"
   xmlns:sodipodi="http://sodipodi.sourceforge.net/DTD/sodipodi-0.dtd"
   xmlns:inkscape="http://www.inkscape.org/namespaces/inkscape"
   width="128"
   height="128"
   viewBox="0 0 128 128"
   id="svg2"
   version="1.1"
   inkscape:version="0.91 r13725"
   sodipodi:docname="ui_effect_unk1.svg"
   inkscape:export-filename="ui_effect_unk1.png"
   inkscape:export-xdpi="90"
   inkscape:export-ydpi="90">
  <defs
     id="defs4">
    <linearGradient
       inkscape:collect="always"
       id="linearGradient4166">
      <stop
         style="stop-color:#b30000;stop-opacity:1"
         offset="0"
         id="stop4168" />
      <stop
         style="stop-color:#840000;stop-opacity:1"
         offset="1"
         id="stop4170" />
    </linearGradient>
    <mask
       maskUnits="userSpaceOnUse"
       id="mask3362">
      <circle
         r="59"
         cy="988.36218"
         cx="64"
         id="circle3364"
         style="opacity:1;fill:#ffffff;fill-opacity:1;stroke:none;stroke-width:5;stroke-linecap:round;stroke-linejoin:round;stroke-miterlimit:4;stroke-dasharray:none;stroke-dashoffset:0;stroke-opacity:1" />
    </mask>
    <mask
       maskUnits="userSpaceOnUse"
       id="mask3366">
      <circle
         r="59"
         cy="988.36218"
         cx="64"
         id="circle3368"
         style="opacity:1;fill:#ffffff;fill-opacity:1;stroke:none;stroke-width:5;stroke-linecap:round;stroke-linejoin:round;stroke-miterlimit:4;stroke-dasharray:none;stroke-dashoffset:0;stroke-opacity:1" />
    </mask>
    <mask
       maskUnits="userSpaceOnUse"
       id="mask3370">
      <circle
         r="59"
         cy="988.36218"
         cx="64"
         id="circle3372"
         style="opacity:1;fill:#ffffff;fill-opacity:1;stroke:none;stroke-width:5;stroke-linecap:round;stroke-linejoin:round;stroke-miterlimit:4;stroke-dasharray:none;stroke-dashoffset:0;stroke-opacity:1" />
    </mask>
    <radialGradient
       inkscape:collect="always"
       xlink:href="#linearGradient4166"
       id="radialGradient4167"
       cx="50.695114"
       cy="32.327278"
       fx="50.695114"
       fy="32.327278"
       r="48.016544"
       gradientTransform="matrix(1,0,0,1.0204816,0,-1.3108247)"
       gradientUnits="userSpaceOnUse" />
  </defs>
  <sodipodi:namedview
     id="base"
     pagecolor="#ffffff"
     bordercolor="#666666"
     borderopacity="1.0"
     inkscape:pageopacity="0.0"
     inkscape:pageshadow="2"
     inkscape:zoom="5.6"
     inkscape:cx="12.172414"
     inkscape:cy="57.731775"
     inkscape:document-units="px"
     inkscape:current-layer="layer1"
     showgrid="false"
     units="px"
     inkscape:window-width="1920"
     inkscape:window-height="1017"
     inkscape:window-x="-8"
     inkscape:window-y="-8"
     inkscape:window-maximized="1" />
  <metadata
     id="metadata7">
    <rdf:RDF>
      <cc:Work
         rdf:about="">
        <dc:format>image/svg+xml</dc:format>
        <dc:type
           rdf:resource="http://purl.org/dc/dcmitype/StillImage" />
        <dc:title />
      </cc:Work>
    </rdf:RDF>
  </metadata>
  <g
     inkscape:label="Ebene 1"
     inkscape:groupmode="layer"
     id="layer1"
     transform="translate(0,-924.3622)">
    <ellipse
       style="opacity:1;fill:none;fill-opacity:1;stroke:#730073;stroke-width:5;stroke-linecap:round;stroke-linejoin:miter;stroke-miterlimit:4;stroke-dasharray:none;stroke-dashoffset:0;stroke-opacity:1"
       id="ring"
       cx="64"
       cy="988.36218"
       rx="61.500004"
       ry="61.5" />
    <path
       style="opacity:1;fill:url(#radialGradient4167);fill-opacity:1;stroke:#d60000;stroke-width:5;stroke-linecap:round;stroke-linejoin:round;stroke-miterlimit:4;stroke-dasharray:none;stroke-dashoffset:0;stroke-opacity:1"
       d="m 64,17.5 c -25.681241,0 -46.5,20.818759 -46.5,46.5 0,25.681241 20.818759,46.5 46.5,46.5 0.263093,-0.007 0.526123,-0.016 0.789062,-0.0273 L 32.321429,40.142857 71.25,78.714844 56.072266,47.107422 l 45.892574,27.5 L 58.572266,38.177734 108.5332,50.742188 C 102.67089,31.034319 84.561287,17.516252 64,17.5 Z"
       transform="translate(0,924.3622)"
       id="path4156"
       inkscape:connector-curvature="0"
       sodipodi:nodetypes="csccccccccc" />
  </g>
</svg>
