<?xml version="1.0" encoding="UTF-8" standalone="no"?>
<svg
   xmlns:dc="http://purl.org/dc/elements/1.1/"
   xmlns:cc="http://creativecommons.org/ns#"
   xmlns:rdf="http://www.w3.org/1999/02/22-rdf-syntax-ns#"
   xmlns:svg="http://www.w3.org/2000/svg"
   xmlns="http://www.w3.org/2000/svg"
   xmlns:sodipodi="http://sodipodi.sourceforge.net/DTD/sodipodi-0.dtd"
   xmlns:inkscape="http://www.inkscape.org/namespaces/inkscape"
   width="800"
   height="600"
   viewBox="0 0 211.66666 158.75"
   version="1.1"
   id="svg8"
   inkscape:version="1.0.1 (3bc2e813f5, 2020-09-07, custom)"
   sodipodi:docname="background_4x3.svg"
   inkscape:export-filename="background_4x3.png"
   inkscape:export-xdpi="122.88"
   inkscape:export-ydpi="122.88">
  <defs
     id="defs2">
    <filter
       style="color-interpolation-filters:sRGB"
       inkscape:label="Roughen"
       id="filter995">
      <feTurbulence
         type="fractalNoise"
         numOctaves="5"
         seed="1"
         baseFrequency="0.75 0.75"
         result="turbulence"
         id="feTurbulence991" />
      <feDisplacementMap
         in="SourceGraphic"
         in2="turbulence"
         scale="1"
         yChannelSelector="G"
         xChannelSelector="R"
         id="feDisplacementMap993" />
    </filter>
    <filter
       style="color-interpolation-filters:sRGB;"
       inkscape:label="Roughen"
       id="filter1003">
      <feTurbulence
         type="fractalNoise"
         numOctaves="5"
         seed="2"
         baseFrequency="0.75 0.75"
         result="turbulence"
         id="feTurbulence999" />
      <feDisplacementMap
         in="SourceGraphic"
         in2="turbulence"
         scale="1"
         yChannelSelector="G"
         xChannelSelector="R"
         id="feDisplacementMap1001" />
    </filter>
    <filter
       style="color-interpolation-filters:sRGB;"
       inkscape:label="Roughen"
       id="filter1037">
      <feTurbulence
         type="fractalNoise"
         numOctaves="5"
         seed="5"
         baseFrequency="0.75 0.75"
         result="turbulence"
         id="feTurbulence1033" />
      <feDisplacementMap
         in="SourceGraphic"
         in2="turbulence"
         scale="1"
         yChannelSelector="G"
         xChannelSelector="R"
         id="feDisplacementMap1035" />
    </filter>
    <filter
       style="color-interpolation-filters:sRGB;"
       inkscape:label="Roughen"
       id="filter1085">
      <feTurbulence
         type="fractalNoise"
         numOctaves="5"
         seed="3"
         baseFrequency="0.75 0.75"
         result="turbulence"
         id="feTurbulence1081" />
      <feDisplacementMap
         in="SourceGraphic"
         in2="turbulence"
         scale="3"
         yChannelSelector="G"
         xChannelSelector="R"
         id="feDisplacementMap1083" />
    </filter>
    <filter
       style="color-interpolation-filters:sRGB;"
       inkscape:label="Roughen"
       id="filter1097">
      <feTurbulence
         type="fractalNoise"
         numOctaves="5"
         seed="3"
         baseFrequency="0.75 0.75"
         result="turbulence"
         id="feTurbulence1093" />
      <feDisplacementMap
         in="SourceGraphic"
         in2="turbulence"
         scale="2"
         yChannelSelector="G"
         xChannelSelector="R"
         id="feDisplacementMap1095" />
    </filter>
    <filter
       style="color-interpolation-filters:sRGB;"
       inkscape:label="Roughen"
       id="filter1105">
      <feTurbulence
         type="fractalNoise"
         numOctaves="5"
         seed="3"
         baseFrequency="0.75 0.75"
         result="turbulence"
         id="feTurbulence1101" />
      <feDisplacementMap
         in="SourceGraphic"
         in2="turbulence"
         scale="2"
         yChannelSelector="G"
         xChannelSelector="R"
         id="feDisplacementMap1103" />
    </filter>
    <filter
       style="color-interpolation-filters:sRGB;"
       inkscape:label="Roughen"
       id="filter1135">
      <feTurbulence
         type="fractalNoise"
         numOctaves="5"
         seed="3"
         baseFrequency="1.5 1"
         result="turbulence"
         id="feTurbulence1131" />
      <feDisplacementMap
         in="SourceGraphic"
         in2="turbulence"
         scale="1"
         yChannelSelector="G"
         xChannelSelector="R"
         id="feDisplacementMap1133" />
    </filter>
  </defs>
  <sodipodi:namedview
     id="base"
     pagecolor="#ffffff"
     bordercolor="#666666"
     borderopacity="1.0"
     inkscape:pageopacity="0.0"
     inkscape:pageshadow="2"
     inkscape:zoom="0.98994949"
     inkscape:cx="491.99709"
     inkscape:cy="236.65256"
     inkscape:document-units="px"
     inkscape:current-layer="layer1"
     inkscape:document-rotation="0"
     showgrid="false"
     units="px"
     inkscape:window-width="1920"
     inkscape:window-height="1016"
     inkscape:window-x="0"
     inkscape:window-y="0"
     inkscape:window-maximized="1" />
  <metadata
     id="metadata5">
    <rdf:RDF>
      <cc:Work
         rdf:about="">
        <dc:format>image/svg+xml</dc:format>
        <dc:type
           rdf:resource="http://purl.org/dc/dcmitype/StillImage" />
        <dc:title />
      </cc:Work>
    </rdf:RDF>
  </metadata>
  <g
     inkscape:label="Ebene 1"
     inkscape:groupmode="layer"
     id="layer1">
    <rect
       style="fill:#2c0b00;fill-opacity:1;stroke:none;stroke-width:0.529166;stroke-linecap:round;stroke-linejoin:bevel;opacity:1"
       id="rect1005"
       width="211.66667"
       height="158.75"
       x="0"
       y="0" />
    <path
       style="fill:none;stroke:#f77300;stroke-width:0.785687;stroke-linecap:round;stroke-linejoin:bevel;stroke-miterlimit:4;stroke-dasharray:none;filter:url(#filter1135)"
       id="path24"
       transform="matrix(3.4996508,-2.0205243,2.0205243,3.4996508,-607.27718,343.96403)"
       sodipodi:type="arc"
       sodipodi:cx="171.66298"
       sodipodi:cy="36.875622"
       sodipodi:rx="25.395565"
       sodipodi:ry="25.395565"
       sodipodi:start="4.4813551"
       sodipodi:end="0.88982967"
       sodipodi:open="true"
       sodipodi:arc-type="arc"
       d="m 165.8478,12.154813 a 25.395565,25.395565 0 0 1 28.61585,13.537603 25.395565,25.395565 0 0 1 -6.81304,30.914659" />
    <path
       style="fill:none;fill-rule:evenodd;stroke:#f77300;stroke-width:1.5875;stroke-linecap:butt;stroke-linejoin:miter;stroke-miterlimit:4;stroke-dasharray:none;stroke-opacity:1;filter:url(#filter1105)"
       d="M -1.8795456,12.325567 C 48.973695,22.925582 130.45692,24.6341 215.12898,14.639195"
       id="path1099"
       sodipodi:nodetypes="cc" />
    <rect
       style="opacity:1;fill:#a12e00;fill-opacity:1;stroke:none;stroke-width:0.79375;stroke-linecap:round;stroke-linejoin:bevel;stroke-miterlimit:4;stroke-dasharray:none;stroke-opacity:1;filter:url(#filter1085)"
       id="rect1061"
       width="103.0096"
       height="9.842145"
       x="30.282957"
       y="14.429369" />
    <rect
       style="opacity:1;fill:#020000;fill-opacity:1;stroke:#eb812b;stroke-width:0.79375;stroke-linecap:round;stroke-linejoin:bevel;stroke-miterlimit:4;stroke-dasharray:none;stroke-opacity:1;filter:url(#filter1097)"
       id="rect1059"
       width="97.258003"
       height="6.021781"
       x="33.001198"
       y="16.379015" />
    <circle
       style="fill:none;stroke:#f77300;stroke-width:0.34154;stroke-linecap:round;stroke-linejoin:bevel;filter:url(#filter1003)"
       id="circle997"
       cx="171.66298"
       cy="36.875622"
       r="25.395565"
       transform="matrix(1.5493581,0,0,1.5493581,-98.336467,-15.584883)" />
    <circle
       style="fill:#2a0900;stroke:#f77300;stroke-width:0.49950577;stroke-linecap:round;stroke-linejoin:bevel;stroke-miterlimit:4;stroke-dasharray:none;filter:url(#filter1037);fill-opacity:1"
       id="circle1013"
       cx="171.66298"
       cy="36.875622"
       r="25.395565"
       transform="matrix(1.5890707,0,0,1.5890707,-105.15366,-17.049311)" />
    <circle
       style="fill:none;stroke:#f77300;stroke-width:0.51230893;stroke-linecap:round;stroke-linejoin:bevel;filter:url(#filter1003);stroke-miterlimit:4;stroke-dasharray:none"
       id="circle1011"
       cx="171.66298"
       cy="36.875622"
       r="25.395565"
       transform="matrix(1.5493581,0,0,1.5493581,-98.336467,-15.584883)" />
  </g>
</svg>
