<?xml version="1.0" encoding="UTF-8" standalone="no"?>
<!-- Created with Inkscape (http://www.inkscape.org/) -->

<svg
   xmlns:dc="http://purl.org/dc/elements/1.1/"
   xmlns:cc="http://creativecommons.org/ns#"
   xmlns:rdf="http://www.w3.org/1999/02/22-rdf-syntax-ns#"
   xmlns:svg="http://www.w3.org/2000/svg"
   xmlns="http://www.w3.org/2000/svg"
   xmlns:xlink="http://www.w3.org/1999/xlink"
   xmlns:sodipodi="http://sodipodi.sourceforge.net/DTD/sodipodi-0.dtd"
   xmlns:inkscape="http://www.inkscape.org/namespaces/inkscape"
   width="64"
   height="64"
   viewBox="0 0 64.000001 64.000001"
   id="svg2"
   version="1.1"
   inkscape:version="0.91 r13725"
   sodipodi:docname="ui_crosshair_phoenix.svg"
   inkscape:export-filename="ui_crosshair_phoenix.png"
   inkscape:export-xdpi="90"
   inkscape:export-ydpi="90">
  <defs
     id="defs4">
    <linearGradient
       inkscape:collect="always"
       id="linearGradient4178">
      <stop
         style="stop-color:#00b5ff;stop-opacity:1"
         offset="0"
         id="stop4180" />
      <stop
         style="stop-color:#00b5ff;stop-opacity:0"
         offset="1"
         id="stop4182" />
    </linearGradient>
    <linearGradient
       id="linearGradient4162"
       inkscape:collect="always">
      <stop
         id="stop4164"
         offset="0"
         style="stop-color:#ffc600;stop-opacity:1" />
      <stop
         id="stop4166"
         offset="1"
         style="stop-color:#ffc600;stop-opacity:0" />
    </linearGradient>
    <linearGradient
       inkscape:collect="always"
       id="linearGradient4182">
      <stop
         style="stop-color:#f50000;stop-opacity:1"
         offset="0"
         id="stop4184" />
      <stop
         style="stop-color:#f50000;stop-opacity:0"
         offset="1"
         id="stop4186" />
    </linearGradient>
    <linearGradient
       inkscape:collect="always"
       xlink:href="#linearGradient4162"
       id="linearGradient4188"
       x1="33.082497"
       y1="1016.5017"
       x2="33.082497"
       y2="996.04614"
       gradientUnits="userSpaceOnUse" />
    <linearGradient
       inkscape:collect="always"
       xlink:href="#linearGradient4178"
       id="linearGradient4196"
       gradientUnits="userSpaceOnUse"
       x1="27.274052"
       y1="1018.4498"
       x2="-33.713909"
       y2="1018.4498"
       gradientTransform="matrix(0,0.33540371,-2.9814816,0,3069.5718,1007.3539)" />
    <linearGradient
       inkscape:collect="always"
       xlink:href="#linearGradient4182"
       id="linearGradient4198"
       gradientUnits="userSpaceOnUse"
       x1="33.082497"
       y1="1016.5017"
       x2="33.082497"
       y2="996.04614"
       gradientTransform="matrix(0,0.33540371,-2.9814816,0,3069.5718,1007.3539)" />
    <linearGradient
       inkscape:collect="always"
       xlink:href="#linearGradient4162"
       id="linearGradient4200"
       gradientUnits="userSpaceOnUse"
       x1="33.082497"
       y1="1016.5017"
       x2="33.082497"
       y2="996.04614"
       gradientTransform="matrix(0,0.33540371,-2.9814816,0,3069.5718,1007.3539)" />
    <linearGradient
       inkscape:collect="always"
       xlink:href="#linearGradient4178"
       id="linearGradient4220"
       gradientUnits="userSpaceOnUse"
       gradientTransform="matrix(0,-0.33540371,2.9814816,0,-3003.4067,1029.546)"
       x1="38.891285"
       y1="1018.4497"
       x2="99.87925"
       y2="1018.4497" />
    <linearGradient
       inkscape:collect="always"
       xlink:href="#linearGradient4182"
       id="linearGradient4222"
       gradientUnits="userSpaceOnUse"
       gradientTransform="matrix(0,-0.33540371,2.9814816,0,-3003.4067,1029.546)"
       x1="33.082497"
       y1="1016.5017"
       x2="33.082497"
       y2="996.04614" />
    <linearGradient
       inkscape:collect="always"
       xlink:href="#linearGradient4162"
       id="linearGradient4224"
       gradientUnits="userSpaceOnUse"
       gradientTransform="matrix(0,-0.33540371,2.9814816,0,-3003.4067,1029.546)"
       x1="33.082497"
       y1="1016.5017"
       x2="33.082497"
       y2="996.04614" />
    <linearGradient
       inkscape:collect="always"
       xlink:href="#linearGradient4162"
       id="linearGradient4174"
       x1="33.082497"
       y1="1016.5018"
       x2="33.082497"
       y2="996.04614"
       gradientUnits="userSpaceOnUse" />
    <linearGradient
       inkscape:collect="always"
       xlink:href="#linearGradient4178"
       id="linearGradient4184"
       gradientUnits="userSpaceOnUse"
       x1="33.082497"
       y1="1016.5018"
       x2="33.082497"
       y2="996.04614" />
    <linearGradient
       inkscape:collect="always"
       xlink:href="#linearGradient4178"
       id="linearGradient4186"
       gradientUnits="userSpaceOnUse"
       x1="33.082497"
       y1="1016.5017"
       x2="33.082497"
       y2="996.04614" />
  </defs>
  <sodipodi:namedview
     id="base"
     pagecolor="#ffffff"
     bordercolor="#666666"
     borderopacity="1.0"
     inkscape:pageopacity="0.0"
     inkscape:pageshadow="2"
     inkscape:zoom="7.919596"
     inkscape:cx="42.87825"
     inkscape:cy="6.9356654"
     inkscape:document-units="px"
     inkscape:current-layer="layer1"
     showgrid="true"
     units="px"
     inkscape:snap-grids="true"
     inkscape:window-width="1920"
     inkscape:window-height="1017"
     inkscape:window-x="-8"
     inkscape:window-y="-8"
     inkscape:window-maximized="1">
    <inkscape:grid
       type="xygrid"
       id="grid4160" />
  </sodipodi:namedview>
  <metadata
     id="metadata7">
    <rdf:RDF>
      <cc:Work
         rdf:about="">
        <dc:format>image/svg+xml</dc:format>
        <dc:type
           rdf:resource="http://purl.org/dc/dcmitype/StillImage" />
        <dc:title></dc:title>
      </cc:Work>
    </rdf:RDF>
  </metadata>
  <g
     inkscape:label="Ebene 1"
     inkscape:groupmode="layer"
     id="layer1"
     transform="translate(0,-988.36216)">
    <g
       id="g4141"
       transform="matrix(-0.34433025,0,0,0.19554558,43.391304,823.58974)"
       style="fill:#f50000;fill-opacity:1">
      <g
         id="g4138"
         style="fill:#f50000;fill-opacity:1">
        <rect
           style="opacity:0.5;fill:#00b5ff;fill-opacity:1;stroke:none;stroke-width:5;stroke-linecap:round;stroke-linejoin:miter;stroke-miterlimit:4;stroke-dasharray:none;stroke-dashoffset:0;stroke-opacity:1"
           id="rect4136"
           width="11.616755"
           height="20.455589"
           x="27.274118"
           y="996.04614" />
      </g>
    </g>
    <g
       transform="matrix(-0.34433025,0,0,1.0266143,43.391304,-25.193034)"
       id="g4162"
       style="fill-opacity:1.0;fill:url(#linearGradient4188)">
      <g
         id="g4164"
         style="fill-opacity:1.0;fill:url(#linearGradient4188)">
        <rect
           y="996.04614"
           x="27.274118"
           height="20.455589"
           width="11.616755"
           id="rect4166"
           style="opacity:0.5;fill:url(#linearGradient4186);fill-opacity:1;stroke:none;stroke-width:5;stroke-linecap:round;stroke-linejoin:miter;stroke-miterlimit:4;stroke-dasharray:none;stroke-dashoffset:0;stroke-opacity:1" />
      </g>
    </g>
    <g
       style="fill:url(#linearGradient4200);fill-opacity:1.0"
       id="g4190"
       transform="matrix(0,-0.34433025,-1.0266143,0,1077.5552,1031.7535)">
      <g
         style="fill:url(#linearGradient4198);fill-opacity:1.0"
         id="g4192">
        <rect
           style="opacity:0.5;fill:url(#linearGradient4196);fill-opacity:1.0;stroke:none;stroke-width:5;stroke-linecap:round;stroke-linejoin:miter;stroke-miterlimit:4;stroke-dasharray:none;stroke-dashoffset:0;stroke-opacity:1"
           id="rect4194"
           width="11.616755"
           height="20.455589"
           x="27.274118"
           y="996.04614" />
      </g>
    </g>
    <g
       style="fill:url(#linearGradient4174);fill-opacity:1"
       id="g4202"
       transform="matrix(0.34433025,0,0,-1.0266143,20.608696,2065.9174)">
      <g
         style="fill:url(#linearGradient4174);fill-opacity:1.0"
         id="g4204">
        <rect
           style="opacity:0.5;fill:url(#linearGradient4184);fill-opacity:1;stroke:none;stroke-width:5;stroke-linecap:round;stroke-linejoin:miter;stroke-miterlimit:4;stroke-dasharray:none;stroke-dashoffset:0;stroke-opacity:1"
           id="rect4206"
           width="11.616755"
           height="20.455589"
           x="27.274118"
           y="996.04614" />
      </g>
    </g>
    <g
       transform="matrix(0,0.34433025,1.0266143,0,-1013.5552,1008.9709)"
       id="g4208"
       style="fill:url(#linearGradient4224);fill-opacity:1.0">
      <g
         id="g4210"
         style="fill:url(#linearGradient4222);fill-opacity:1.0">
        <rect
           y="996.04614"
           x="27.274118"
           height="20.455589"
           width="11.616755"
           id="rect4212"
           style="opacity:0.5;fill:url(#linearGradient4220);fill-opacity:1.0;stroke:none;stroke-width:5;stroke-linecap:round;stroke-linejoin:miter;stroke-miterlimit:4;stroke-dasharray:none;stroke-dashoffset:0;stroke-opacity:1" />
      </g>
    </g>
  </g>
</svg>
