<?xml version="1.0" encoding="UTF-8" standalone="no"?>
<!-- Created with Inkscape (http://www.inkscape.org/) -->

<svg
   xmlns:dc="http://purl.org/dc/elements/1.1/"
   xmlns:cc="http://creativecommons.org/ns#"
   xmlns:rdf="http://www.w3.org/1999/02/22-rdf-syntax-ns#"
   xmlns:svg="http://www.w3.org/2000/svg"
   xmlns="http://www.w3.org/2000/svg"
   xmlns:xlink="http://www.w3.org/1999/xlink"
   xmlns:sodipodi="http://sodipodi.sourceforge.net/DTD/sodipodi-0.dtd"
   xmlns:inkscape="http://www.inkscape.org/namespaces/inkscape"
   width="128"
   height="128"
   viewBox="0 0 128 128"
   id="svg2"
   version="1.1"
   inkscape:version="0.91 r13725"
   sodipodi:docname="ui_effect_blindness_iii.svg"
   inkscape:export-filename="ui_effect_blindness_iii.png"
   inkscape:export-xdpi="90"
   inkscape:export-ydpi="90">
  <defs
     id="defs4">
    <linearGradient
       inkscape:collect="always"
       id="linearGradient4135">
      <stop
         style="stop-color:#006ba1;stop-opacity:1"
         offset="0"
         id="stop4137" />
      <stop
         style="stop-color:#00527b;stop-opacity:1"
         offset="1"
         id="stop4139" />
    </linearGradient>
    <radialGradient
       inkscape:collect="always"
       xlink:href="#linearGradient4135"
       id="radialGradient4141"
       cx="71.091267"
       cy="991.25026"
       fx="71.091267"
       fy="991.25026"
       r="44.036093"
       gradientTransform="matrix(0.99999999,0,0,1.0257701,8.8685725e-7,-25.544683)"
       gradientUnits="userSpaceOnUse" />
    <radialGradient
       inkscape:collect="always"
       xlink:href="#linearGradient4135"
       id="radialGradient4163"
       gradientUnits="userSpaceOnUse"
       gradientTransform="matrix(0.99999997,0,0,1.0257702,-1.4663218e-6,-25.544675)"
       cx="71.091267"
       cy="991.25026"
       fx="71.091267"
       fy="991.25026"
       r="44.036093" />
    <radialGradient
       inkscape:collect="always"
       xlink:href="#linearGradient4135"
       id="radialGradient3360"
       gradientUnits="userSpaceOnUse"
       gradientTransform="matrix(0.99999999,0,0,1.0257701,6.2629045e-6,-25.544686)"
       cx="71.091267"
       cy="991.25026"
       fx="71.091267"
       fy="991.25026"
       r="44.036093" />
    <mask
       maskUnits="userSpaceOnUse"
       id="mask3362">
      <circle
         r="59"
         cy="988.36218"
         cx="64"
         id="circle3364"
         style="opacity:1;fill:#ffffff;fill-opacity:1;stroke:none;stroke-width:5;stroke-linecap:round;stroke-linejoin:round;stroke-miterlimit:4;stroke-dasharray:none;stroke-dashoffset:0;stroke-opacity:1" />
    </mask>
    <mask
       maskUnits="userSpaceOnUse"
       id="mask3366">
      <circle
         r="59"
         cy="988.36218"
         cx="64"
         id="circle3368"
         style="opacity:1;fill:#ffffff;fill-opacity:1;stroke:none;stroke-width:5;stroke-linecap:round;stroke-linejoin:round;stroke-miterlimit:4;stroke-dasharray:none;stroke-dashoffset:0;stroke-opacity:1" />
    </mask>
    <mask
       maskUnits="userSpaceOnUse"
       id="mask3370">
      <circle
         r="59"
         cy="988.36218"
         cx="64"
         id="circle3372"
         style="opacity:1;fill:#ffffff;fill-opacity:1;stroke:none;stroke-width:5;stroke-linecap:round;stroke-linejoin:round;stroke-miterlimit:4;stroke-dasharray:none;stroke-dashoffset:0;stroke-opacity:1" />
    </mask>
  </defs>
  <sodipodi:namedview
     id="base"
     pagecolor="#ffffff"
     bordercolor="#666666"
     borderopacity="1.0"
     inkscape:pageopacity="0.0"
     inkscape:pageshadow="2"
     inkscape:zoom="5.6"
     inkscape:cx="91.691996"
     inkscape:cy="57.337968"
     inkscape:document-units="px"
     inkscape:current-layer="layer1"
     showgrid="false"
     units="px"
     inkscape:window-width="1920"
     inkscape:window-height="1017"
     inkscape:window-x="-8"
     inkscape:window-y="-8"
     inkscape:window-maximized="1" />
  <metadata
     id="metadata7">
    <rdf:RDF>
      <cc:Work
         rdf:about="">
        <dc:format>image/svg+xml</dc:format>
        <dc:type
           rdf:resource="http://purl.org/dc/dcmitype/StillImage" />
        <dc:title />
      </cc:Work>
    </rdf:RDF>
  </metadata>
  <g
     inkscape:label="Ebene 1"
     inkscape:groupmode="layer"
     id="layer1"
     transform="translate(0,-924.3622)">
    <ellipse
       style="opacity:1;fill:none;fill-opacity:1;stroke:#730073;stroke-width:5;stroke-linecap:round;stroke-linejoin:miter;stroke-miterlimit:4;stroke-dasharray:none;stroke-dashoffset:0;stroke-opacity:1"
       id="ring"
       cx="64"
       cy="988.36218"
       rx="61.500004"
       ry="61.5" />
    <path
       style="fill:url(#radialGradient4141);fill-opacity:1;fill-rule:evenodd;stroke:#00a5e7;stroke-width:5;stroke-linecap:round;stroke-linejoin:round;stroke-miterlimit:4;stroke-dasharray:none;stroke-opacity:1"
       d="m 47.690571,996.03301 c 2.602543,-20.35644 -2.773236,-36.8372 -33.02544,-41.23368 28.461342,2.65146 39.913307,-12.50031 41.269813,-38.21871 -3.512323,38.36333 14.77867,44.4759 36.224419,45.92207 -36.395776,-5.87877 -39.703047,10.47154 -44.468792,33.53032 z"
       id="star1"
       inkscape:connector-curvature="0"
       sodipodi:nodetypes="ccccc"
       mask="url(#mask3370)" />
    <path
       sodipodi:nodetypes="ccccc"
       inkscape:connector-curvature="0"
       id="star2"
       d="m 110.45901,1036.4725 c -7.06782,-18.8437 -19.277933,-30.6707 -47.521712,-20.6193 25.891713,-10.7439 28.880748,-29.13 18.276514,-52.05209 14.527091,34.87445 33.186048,31.79253 52.442848,23.21866 -34.24948,11.58145 -29.62769,27.27453 -23.19765,49.45273 z"
       style="fill:url(#radialGradient4163);fill-opacity:1;fill-rule:evenodd;stroke:#00a5e7;stroke-width:5;stroke-linecap:round;stroke-linejoin:round;stroke-miterlimit:4;stroke-dasharray:none;stroke-opacity:1"
       mask="url(#mask3366)" />
    <path
       mask="url(#mask3362)"
       sodipodi:nodetypes="ccccc"
       inkscape:connector-curvature="0"
       id="path3358"
       d="m 69.563632,1040.9109 c -14.30688,-14.7879 -30.577979,-20.9023 -52.973837,0.026 19.907639,-20.62 15.219961,-39.0756 -4.065563,-56.24649 27.834823,26.77889 44.080212,16.28859 58.648758,0.40569 -27.405504,24.8099 -16.676647,37.6402 -1.609358,55.8141 z"
       style="fill:url(#radialGradient3360);fill-opacity:1;fill-rule:evenodd;stroke:#00a5e7;stroke-width:5;stroke-linecap:round;stroke-linejoin:round;stroke-miterlimit:4;stroke-dasharray:none;stroke-opacity:1" />
  </g>
</svg>
