[gd_scene load_steps=5 format=3 uid="uid://cj01hfya2sk4k"]

[ext_resource type="Script" path="res://Assets/Spells/Scripts/Projectile.gd" id="1"]
[ext_resource type="PackedScene" path="res://Assets/Spells/ice_bolt.fbx" id="2"]

[sub_resource type="BoxShape3D" id="1"]
size = Vector3(0.369, 3.5632, 0.350002)

[sub_resource type="BoxShape3D" id="2"]
size = Vector3(0.40923, 0.390888, 3.60462)

[node name="IceBolt" type="RigidBody3D"]
transform = Transform3D(1, 0, 0, 0, 1, 0, 0, 0, 1, 0, 0, -2.05851)
gravity_scale = 0.0
script = ExtResource("1")
speed = 35.0

[node name="ice_bolt" parent="." instance=ExtResource("2")]
transform = Transform3D(1, 0, 0, 0, -4.37114e-08, 1, 0, -1, -4.37114e-08, 0, 0, 2)

[node name="CollisionShape3D" type="CollisionShape3D" parent="."]
transform = Transform3D(1, 0, 0, 0, -4.37114e-08, 1, 0, -1, -4.37114e-08, 0, 0.00265377, 0.222961)
shape = SubResource("1")

[node name="Area3D" type="Area3D" parent="."]

[node name="CollisionShape3D" type="CollisionShape3D" parent="Area3D"]
transform = Transform3D(1, 0, 0, 0, 1, 0, 0, 0, 1, 0, 0.00639349, 0.21738)
shape = SubResource("2")

[connection signal="area_entered" from="Area3D" to="." method="_on_Area_area_entered"]
