[gd_scene load_steps=6 format=2]

[ext_resource path="res://Assets/Scripts/Team.gd" type="Script" id=1]
[ext_resource path="res://Assets/Teams/Team.tscn" type="PackedScene" id=2]
[ext_resource path="res://Assets/Ui/ui_gryphon.png" type="Texture2D" id=3]
[ext_resource path="res://Assets/Ui/ui_dragon.png" type="Texture2D" id=4]
[ext_resource path="res://Assets/Ui/ui_phoenix.png" type="Texture2D" id=5]


[node name="Teams" type="Node"]

[node name="Team Dragon" type="Node" parent="." groups=[
"Team",
] instance=ExtResource( 2 )]
script = ExtResource( 1 )
color = Color( 0.839216, 0, 0, 1 )
nexusImage = ExtResource( 4 )

[node name="Team Gryphon" type="Node" parent="." groups=[
"Team",
] instance=ExtResource( 2 )]
script = ExtResource( 1 )
color = Color( 1, 0.776471, 0, 1 )
nexusImage = ExtResource( 3 )

[node name="Team Phoenix" type="Node" parent="." groups=[
"Team",
] instance=ExtResource( 2 )]
script = ExtResource( 1 )
color = Color( 0, 0.709804, 1, 1 )
nexusImage = ExtResource( 5 )
