<?xml version="1.0" encoding="UTF-8" standalone="no"?>
<!-- Created with Inkscape (http://www.inkscape.org/) -->

<svg
   xmlns:dc="http://purl.org/dc/elements/1.1/"
   xmlns:cc="http://creativecommons.org/ns#"
   xmlns:rdf="http://www.w3.org/1999/02/22-rdf-syntax-ns#"
   xmlns:svg="http://www.w3.org/2000/svg"
   xmlns="http://www.w3.org/2000/svg"
   xmlns:xlink="http://www.w3.org/1999/xlink"
   xmlns:sodipodi="http://sodipodi.sourceforge.net/DTD/sodipodi-0.dtd"
   xmlns:inkscape="http://www.inkscape.org/namespaces/inkscape"
   width="128"
   height="128"
   viewBox="0 0 128 128"
   id="svg2"
   version="1.1"
   inkscape:version="0.91 r13725"
   sodipodi:docname="ui_effect_pray_ii.svg"
   inkscape:export-filename="ui_effect_pray_ii.png"
   inkscape:export-xdpi="90"
   inkscape:export-ydpi="90">
  <defs
     id="defs4">
    <linearGradient
       inkscape:collect="always"
       id="linearGradient4135">
      <stop
         style="stop-color:#006ba1;stop-opacity:1"
         offset="0"
         id="stop4137" />
      <stop
         style="stop-color:#00527b;stop-opacity:1"
         offset="1"
         id="stop4139" />
    </linearGradient>
    <radialGradient
       inkscape:collect="always"
       xlink:href="#linearGradient4135"
       id="radialGradient4175"
       cx="64"
       cy="64"
       fx="64"
       fy="64"
       r="49"
       gradientUnits="userSpaceOnUse" />
  </defs>
  <sodipodi:namedview
     id="base"
     pagecolor="#ffffff"
     bordercolor="#666666"
     borderopacity="1.0"
     inkscape:pageopacity="0.0"
     inkscape:pageshadow="2"
     inkscape:zoom="5.6"
     inkscape:cx="44.888443"
     inkscape:cy="61.843205"
     inkscape:document-units="px"
     inkscape:current-layer="layer1"
     showgrid="false"
     units="px"
     inkscape:window-width="1920"
     inkscape:window-height="1017"
     inkscape:window-x="-8"
     inkscape:window-y="-8"
     inkscape:window-maximized="1" />
  <metadata
     id="metadata7">
    <rdf:RDF>
      <cc:Work
         rdf:about="">
        <dc:format>image/svg+xml</dc:format>
        <dc:type
           rdf:resource="http://purl.org/dc/dcmitype/StillImage" />
        <dc:title />
      </cc:Work>
    </rdf:RDF>
  </metadata>
  <g
     inkscape:label="Ebene 1"
     inkscape:groupmode="layer"
     id="layer1"
     transform="translate(0,-924.3622)">
    <ellipse
       style="opacity:1;fill:none;fill-opacity:1;stroke:#730073;stroke-width:5.00000048;stroke-linecap:round;stroke-linejoin:miter;stroke-miterlimit:4;stroke-dasharray:none;stroke-dashoffset:0;stroke-opacity:1"
       id="ring"
       cx="64"
       cy="988.36218"
       rx="61.500004"
       ry="61.5" />
    <circle
       style="opacity:1;fill:none;fill-opacity:1;stroke:#00a5e7;stroke-width:5;stroke-linecap:round;stroke-linejoin:round;stroke-miterlimit:4;stroke-dasharray:none;stroke-dashoffset:0;stroke-opacity:1"
       id="path3351"
       cx="63.999996"
       cy="988.36218"
       r="31.499998" />
    <path
       style="opacity:1;fill:url(#radialGradient4175);fill-opacity:1.0;stroke:#00a5e7;stroke-width:5;stroke-linecap:round;stroke-linejoin:round;stroke-miterlimit:4;stroke-dasharray:none;stroke-dashoffset:0;stroke-opacity:1"
       d="M 64 17.5 A 46.5 46.5 0 0 0 43.412109 22.369141 A 17.5 17.5 0 0 1 55.5 39 A 17.5 17.5 0 0 1 38 56.5 A 17.5 17.5 0 0 1 21.595703 45.060547 A 46.5 46.5 0 0 0 17.5 64 A 46.5 46.5 0 0 0 21.591797 82.978516 A 17.5 17.5 0 0 1 38 71.5 A 17.5 17.5 0 0 1 55.5 89 A 17.5 17.5 0 0 1 43.351562 105.63867 A 46.5 46.5 0 0 0 64 110.5 A 46.5 46.5 0 0 0 84.587891 105.63086 A 17.5 17.5 0 0 1 72.5 89 A 17.5 17.5 0 0 1 90 71.5 A 17.5 17.5 0 0 1 106.4043 82.939453 A 46.5 46.5 0 0 0 110.5 64 A 46.5 46.5 0 0 0 106.39844 45.048828 A 17.5 17.5 0 0 1 90 56.5 A 17.5 17.5 0 0 1 72.5 39 A 17.5 17.5 0 0 1 84.603516 22.376953 A 46.5 46.5 0 0 0 64 17.5 z "
       transform="translate(0,924.3622)"
       id="path3350" />
  </g>
</svg>
