unit,genotype,g_alias,treatment,timestamp,Digital biomass [mm3],greenness average [],greenness bin0 [%],greenness bin1 [%],greenness bin2 [%],greenness bin3 [%],greenness bin4 [%],greenness bin5 [%],Height [mm],Height Max [mm],hue average [degrees],hue bin0 [%],hue bin1 [%],hue bin2 [%],hue bin3 [%],hue bin4 [%],hue bin5 [%],Leaf angle [degrees],Leaf area [mm2],Leaf area index [mm2/mm2],Leaf area (projected) [mm2],Leaf inclination [mm2/mm2],Light penetration depth [mm],NDVI average [],NDVI bin0 [%],NDVI bin1 [%],NDVI bin2 [%],NDVI bin3 [%],NDVI bin4 [%],NDVI bin5 [%],NPCI average [],NPCI bin0 [%],NPCI bin1 [%],NPCI bin2 [%],NPCI bin3 [%],NPCI bin4 [%],NPCI bin5 [%],PSRI average [],PSRI bin0 [%],PSRI bin1 [%],PSRI bin2 [%],PSRI bin3 [%],PSRI bin4 [%],PSRI bin5 [%]
1/08/2002,Basil,B-02,07.04.2021,10/04/2021 11:46,121247,0.23259,0.00036,0.00107,0.16407,0.83419,0.00031,0,38.671,53.601,90.7986,0.00137,0.39879,0.43514,0.10534,0.05935,0,36.055,3135.36,0.03,1760.75,1.69898,20.585,0.31393,0.00031,0.00121,0.1354,0.71697,0.14612,0,0.24637,0,0,0.15143,0.81937,0.0292,0,0.17078,0.00026,9.00E-04,0.15048,0.79882,0.03985,0.00969
1/08/2002,Basil,B-02,07.04.2021,11/04/2021 11:49,159570,0.25033,0,0.00114,0.1325,0.86597,0.00039,0,38.942,54.052,89.4298,0.00312,0.35544,0.5187,0.06472,0.05803,0,36.808,4097.61,0.039,2248.99,1.66903,20.315,0.35772,0,0.00219,0.0972,0.67762,0.22299,0,0.25083,0,0,0.10401,0.8766,0.01939,0,0.16694,0.00027,0.00108,0.10266,0.85983,0.0301,0.00605
1/08/2002,Basil,B-02,07.04.2021,12/04/2021 11:51,209293,0.27314,0,0.00051,0.09603,0.90319,0.00027,0,43.046,54.239,92.704,0.00141,0.305,0.59921,0.06067,0.03371,0,36.271,4862.12,0.046,2648.86,1.69024,19.72,0.3875,0,0.00294,0.07081,0.65728,0.26898,0,0.25303,1.00E-04,0.00055,0.09629,0.88579,0.01727,0,0.15891,7.00E-05,0.00142,0.09546,0.87512,0.02259,0.00534
1/08/2002,Basil,B-02,07.04.2021,13/04/2021 11:54,268079,0.27725,5.00E-05,0.00041,0.08768,0.91152,0.00035,0,49.369,52.399,92.3126,0.00137,0.31699,0.59447,0.05253,0.03465,0,36.438,5430.12,0.052,3079.44,1.68357,22.723,0.39778,1.00E-04,0.00227,0.0667,0.64783,0.28309,0,0.25605,7.00E-05,0.00038,0.08667,0.89875,0.01412,0,0.15738,0,7.00E-04,0.08653,0.88827,0.01926,0.00524
1/08/2002,Basil,B-02,07.04.2021,14/04/2021 11:56,366959,0.28581,0,0.00074,0.07063,0.92783,0.00079,0,57.61,62.163,91.916,0.00137,0.32352,0.60896,0.03889,0.02725,0,36.819,6369.69,0.061,3575,1.66859,23.941,0.41847,8.00E-05,0.00194,0.04733,0.62371,0.32695,0,0.26315,0,8.00E-05,0.06471,0.92331,0.0119,0,0.15737,0.00013,0.00037,0.06439,0.91909,0.01259,0.00343
1/08/2002,Basil,B-02,07.04.2021,15/04/2021 11:59,505828,0.30681,4.00E-05,0.00072,0.04165,0.95706,0.00052,0,67.602,73.412,93.6166,0.00072,0.27146,0.6836,0.02628,0.01794,0,35.803,7482.46,0.071,4058.28,1.70934,27.271,0.4463,0,0.00143,0.03342,0.5505,0.41465,0,0.26876,0,0.00021,0.04565,0.94089,0.01325,0,0.15582,8.00E-05,0.00049,0.0453,0.93831,0.01168,0.00414
1/08/2002,Basil,B-02,07.04.2021,16/04/2021 12:01,725294,0.32049,0,0.00024,0.0225,0.9766,0.00065,0,79.098,85.734,93.6706,0.00049,0.26227,0.71626,0.01147,0.0095,0,36.43,9169.54,0.087,4950.31,1.6839,33.327,0.4667,7.00E-05,0.00058,0.02039,0.53565,0.44332,0,0.27385,3.00E-05,3.00E-05,0.02321,0.9681,0.00864,0,0.15503,0,0.00036,0.02297,0.96557,0.00846,0.00264
1/08/2002,Basil,B-02,07.04.2021,17/04/2021 12:10,1178740,0.32796,0.00038,0.00053,0.0126,0.98601,0.00047,0,84.829,92.496,93.9273,0.00042,0.24267,0.74643,0.00462,0.00586,0,37.439,13895.4,0.132,6983.3,1.64489,33.802,0.48306,0.00011,0.00049,0.01326,0.49447,0.49167,0,0.27661,4.00E-05,2.00E-05,0.01195,0.97867,0.00931,0,0.15333,0,0.00032,0.01173,0.97838,0.00699,0.00258
1/08/2002,Basil,B-02,07.04.2021,18/04/2021 12:12,1234290,0.32532,0,0.00025,0.01054,0.98896,0.00026,0,81.779,93.547,93.3826,0.00033,0.29492,0.69497,0.00583,0.00395,0,37.795,15093.1,0.144,8477.7,1.63168,26.431,0.47842,5.00E-05,0.00084,0.00876,0.54908,0.44126,0,0.28159,0,1.00E-04,0.01257,0.97902,0.00831,0,0.1562,9.00E-05,0.00062,0.01201,0.98141,0.00414,0.00173
1/08/2002,Basil,B-02,07.04.2021,19/04/2021 12:15,1617150,0.32678,0,0,0.00537,0.99454,1.00E-04,0,90.205,98.698,93.1421,0.00015,0.32149,0.67334,0.00269,0.00234,0,38.041,17927.5,0.171,9762.07,1.62273,31.641,0.4781,6.00E-05,1.00E-04,0.00654,0.55655,0.43676,0,0.28519,3.00E-05,9.00E-05,0.0087,0.98143,0.00975,0,0.15774,0,3.00E-05,0.00885,0.98734,0.00317,0.00062
1/08/2002,Basil,B-02,07.04.2021,20/04/2021 12:18,2229840,0.32537,0,7.00E-05,0.00488,0.99485,0.00019,0,101.096,111.665,92.3283,0.00017,0.38006,0.61512,0.0024,0.00224,0,34.907,22056.6,0.21,9953.5,1.74744,44.236,0.46776,2.00E-05,0.00021,0.00517,0.61934,0.37526,0,0.294,0,4.00E-05,0.00785,0.98407,0.00803,0,0.16593,8.00E-05,6.00E-05,0.00776,0.98946,0.00209,0.00054
1/08/2002,Basil,B-02,07.04.2021,21/04/2021 10:21,2182190,0.31557,1.00E-05,4.00E-05,0.00606,0.99368,0.00021,0,106.391,120.383,91.1816,0.00025,0.44168,0.55244,0.00366,0.00197,0,35.741,20511,0.195,10497.3,1.71188,46.7,0.44853,0,0.00012,0.00692,0.70011,0.29285,0,0.296,0,3.00E-05,0.00975,0.98247,0.00776,0,0.17512,2.00E-05,0.00013,0.00962,0.98689,0.00292,0.00041
1/08/2002,Basil,B-02,07.04.2021,21/04/2021 11:36,2098940,0.31883,8.00E-05,0.00014,0.00656,0.99267,0.00056,0,105.562,119.683,91.3342,0.00022,0.42768,0.56639,0.00315,0.00256,0,35.984,19883.5,0.189,10640.5,1.70189,45.627,0.45288,6.00E-05,0.00017,0.0074,0.68063,0.31174,0,0.29759,0,6.00E-05,0.00947,0.98198,0.00849,0,0.17432,0,0.00055,0.00901,0.98607,0.00363,0.00073
1/08/2002,Basil,B-02,07.04.2021,22/04/2021 11:38,2651150,0.31298,9.00E-05,0.00013,0.00518,0.99444,0.00015,0,112.783,128.956,90.184,3.00E-04,0.48822,0.50678,0.0023,0.0024,0,37.107,23506.7,0.224,12575.7,1.65749,44.823,0.43532,6.00E-05,0.00015,0.00659,0.76422,0.22898,0,0.30406,2.00E-05,5.00E-05,0.00618,0.98527,0.00848,0,0.18594,0,0.00015,0.00616,0.98907,0.00407,0.00055
1/08/2002,Basil,B-02,07.04.2021,23/04/2021 11:41,2935130,0.3145,2.00E-05,0.00022,0.00428,0.99539,9.00E-05,0,118.068,129.648,90.7984,0.00014,0.4588,0.53686,0.00192,0.00228,0,36.595,24859.6,0.237,13581.8,1.67735,49.9,0.43724,0,0.00038,0.0046,0.75503,0.24,0,0.29846,0,1.00E-05,0.00599,0.98731,0.00669,0,0.18205,0,0.00015,0.00585,0.99148,0.00185,0.00067
1/08/2002,Basil,B-02,07.04.2021,24/04/2021 11:43,3625570,0.31389,0.00015,0.00031,0.00387,0.99538,0.00029,0,122.873,136.964,90.922,0.00021,0.46462,0.53194,0.00113,0.0021,0,35.167,29506.6,0.281,14784.5,1.73616,51.905,0.44438,0.00014,0.00043,0.00593,0.71266,0.28083,0,0.29563,2.00E-05,3.00E-05,0.00488,0.98804,0.00704,0,0.18139,0,0.00017,0.00482,0.99018,0.00324,0.00158
1/08/2002,Basil,B-02,07.04.2021,25/04/2021 11:46,3720010,0.32227,0,0.00017,0.00423,0.99525,0.00035,0,124.986,139.32,93.786,0.00014,0.29588,0.70076,0.0013,0.00193,0,37.034,29763.4,0.283,15679.7,1.66028,58.558,0.47792,8.00E-05,0.00034,0.00521,0.55452,0.43986,0,0.26971,0,7.00E-05,0.00765,0.98827,0.00401,0,0.15312,3.00E-05,0.00015,0.0076,0.98883,0.00254,0.00085
1/09/2002,Basil,B-02,07.04.2021,7/04/2021 11:38,113821,0.28851,0.00045,0.00338,0.14682,0.82428,0.02507,0,41.878,51.204,91.4234,0.00316,0.20243,0.65933,0.06301,0.07206,0,36.47,2717.89,0.026,1571.66,1.68228,14.419,0.40968,3.00E-04,0.00262,0.11561,0.27663,0.60483,0,0.28272,0,0.00051,0.10889,0.81644,0.07416,0,0.15064,1.00E-04,0.00137,0.10806,0.85426,0.02865,0.00756
1/09/2002,Basil,B-02,07.04.2021,8/04/2021 11:41,151681,0.32212,0.00027,0.00271,0.10197,0.86417,0.03087,0,47.995,50.783,92.5661,0.00305,0.18258,0.72535,0.04032,0.04869,0,38.943,3160.38,0.03,1951.36,1.59092,17.719,0.44088,5.00E-04,0.00467,0.09652,0.25195,0.64637,0,0.30555,0,0.00085,0.07565,0.84659,0.07691,0,0.1625,0.00036,0.00238,0.0741,0.88926,0.02512,0.00879
1/09/2002,Basil,B-02,07.04.2021,9/04/2021 11:43,213578,0.33385,0.00045,0.0015,0.08508,0.87907,0.0339,0,54.162,55.522,94.1016,0.00171,0.16021,0.76038,0.03916,0.03854,0,39.642,3943.29,0.038,2418.84,1.56737,19.94,0.46811,0.00035,0.00284,0.06294,0.25547,0.6784,0,0.30347,7.00E-05,2.00E-04,0.06987,0.86411,0.06575,0,0.14572,0.00062,0.00295,0.0668,0.90664,0.01683,0.00616
1/09/2002,Basil,B-02,07.04.2021,10/04/2021 11:46,295670,0.34243,0.00022,0.00153,0.06628,0.89789,0.03408,0,59.214,62.183,94.4021,0.00131,0.16033,0.78118,0.02782,0.02936,0,39.716,4993.22,0.048,2924.03,1.56495,21.038,0.48786,0.00054,0.00175,0.04898,0.23344,0.71529,0,0.30505,0,0.00019,0.05135,0.88263,0.06582,0,0.14698,0.00019,0.00077,0.05107,0.92499,0.01638,0.0066
1/09/2002,Basil,B-02,07.04.2021,11/04/2021 11:49,444266,0.31736,0,0.00087,0.09367,0.87478,0.03068,0,63.905,67.386,92.2487,0.00279,0.17712,0.75434,0.02683,0.03892,0,40.018,6951.96,0.066,3839.65,1.55508,35.898,0.47764,6.00E-05,0.00083,0.04765,0.26717,0.68428,0,0.28618,0,9.00E-05,0.05794,0.89254,0.04943,0,0.14097,0.00035,0.00141,0.05627,0.9208,0.01812,0.00305
1/09/2002,Basil,B-02,07.04.2021,12/04/2021 11:51,563587,0.37402,5.00E-05,0.00041,0.01889,0.95038,0.03028,0,71.284,75.656,96.3508,0.00058,0.12839,0.85499,0.0091,0.00694,0,40.76,7906.2,0.075,4587.28,1.53162,15.603,0.53829,0.00023,0.00093,0.01804,0.18603,0.79477,0,0.31031,0,9.00E-05,0.02331,0.93532,0.04129,0,0.13667,0,0.00032,0.02327,0.96847,0.00609,0.00185
1/09/2002,Basil,B-02,07.04.2021,13/04/2021 11:54,690045,0.38058,6.00E-05,0.00081,0.00814,0.96177,0.02922,0,78.821,85.724,96.506,0.00046,0.12038,0.87172,0.00352,0.00392,0,43.024,8754.61,0.083,5774.24,1.46558,14.619,0.5531,0.00037,0.00076,0.00873,0.17535,0.81479,0,0.30977,4.00E-05,3.00E-04,0.01104,0.94866,0.03996,0,0.13514,0.00019,0.00033,0.01115,0.98157,0.00445,0.00231
1/09/2002,Basil,B-02,07.04.2021,14/04/2021 11:56,922891,0.37893,4.00E-05,0.00015,0.0056,0.96978,0.02444,0,87.212,97.777,96.7245,0.00012,0.11774,0.87743,0.00247,0.00224,0,41.861,10582.2,0.101,6754.15,1.49848,20.196,0.55969,4.00E-05,0.00025,0.00367,0.1537,0.84233,0,0.30444,0,0.00016,0.00919,0.95924,0.03141,0,0.12807,8.00E-05,4.00E-04,0.00887,0.98878,0.00134,0.00054
1/09/2002,Basil,B-02,07.04.2021,15/04/2021 11:59,1248570,0.38046,0.00012,0,0.00366,0.96931,0.0269,0,99.071,103.518,97.8079,0.00012,0.09444,0.90174,0.00218,0.00152,0,40.809,12602.8,0.12,7794.48,1.53008,28.069,0.57354,0,0.00031,0.00409,0.10364,0.89195,0,0.28941,0,0.00016,0.01011,0.95985,0.02988,0,0.11851,2.00E-05,0.00042,0.00983,0.98782,0.00135,0.00056
1/09/2002,Basil,B-02,07.04.2021,16/04/2021 12:01,1657710,0.37851,0.00019,0.00017,0.00473,0.97447,0.02044,0,109.858,113.403,98.0787,0.00017,0.07646,0.91912,0.00201,0.00224,0,39.914,15089.5,0.144,9064.5,1.55846,33.511,0.57706,0.00014,0.00036,0.00459,0.09641,0.8985,0,0.28234,0,0.00021,0.00953,0.96888,0.02138,0,0.11586,0,0.00034,0.00954,0.98695,0.00217,0.001
1/09/2002,Basil,B-02,07.04.2021,17/04/2021 12:10,2411310,0.38696,0.00017,0.00016,0.00307,0.9677,0.02891,0,118.476,124.865,99.403,0.00018,0.05897,0.93799,0.00148,0.00138,0,37.814,20352.7,0.194,10228.3,1.63099,42.799,0.59952,7.00E-05,0.00011,0.00333,0.06185,0.93464,0,0.2697,6.00E-05,0.00022,0.00992,0.97247,0.01734,0,0.1051,4.00E-05,0.00048,0.00972,0.98722,0.00182,0.00072
1/09/2002,Basil,B-02,07.04.2021,18/04/2021 12:12,2833140,0.38673,0.00013,0.00011,0.00376,0.96847,0.02753,0,132.37,140.904,98.6455,0.00018,0.0752,0.92175,0.00109,0.00178,0,36.576,21403.2,0.204,11700.6,1.6781,54.027,0.593,4.00E-05,0.00017,0.00345,0.07333,0.923,0,0.28234,0,6.00E-05,0.01061,0.96832,0.02101,0,0.11127,2.00E-05,0.00011,0.01058,0.986,0.00253,0.00076
1/09/2002,Basil,B-02,07.04.2021,19/04/2021 12:15,3664670,0.38527,1.00E-05,0.00024,0.00339,0.96828,0.02808,0,144.689,154.915,99.1535,8.00E-05,0.06514,0.93221,0.00088,0.0017,0,37.114,25327.9,0.241,13591.8,1.6572,63.04,0.59739,0,7.00E-05,0.00301,0.07081,0.92611,0,0.2709,3.00E-05,0.00013,0.00782,0.97754,0.01448,0,0.10622,0,0.00017,0.00782,0.98941,0.00213,0.00048
1/09/2002,Basil,B-02,07.04.2021,20/04/2021 12:18,4703220,0.38288,0,5.00E-05,0.00286,0.97257,0.02451,0,153.971,168.546,99.626,0.00012,0.06347,0.93445,0.00097,0.00098,0,37.098,30546.2,0.291,14916,1.65782,73.248,0.59677,4.00E-05,7.00E-05,0.00279,0.07809,0.91902,0,0.2615,0,4.00E-05,0.00968,0.97988,0.0104,0,0.10318,1.00E-05,0.00016,0.00955,0.98841,0.00152,0.00034
1/09/2002,Basil,B-02,07.04.2021,21/04/2021 10:21,4347380,0.37782,2.00E-05,0.00016,0.00414,0.97522,0.02046,0,159.374,166.392,99.3205,0.00014,0.07538,0.92157,0.00107,0.00184,0,34.824,27277.8,0.26,14055,1.75108,84.444,0.59416,4.00E-05,9.00E-05,0.00315,0.08299,0.91373,0,0.25984,1.00E-05,2.00E-05,0.01203,0.97688,0.01106,0,0.10399,4.00E-05,7.00E-05,0.01196,0.98579,0.00179,0.00035
1/09/2002,Basil,B-02,07.04.2021,21/04/2021 11:36,4155290,0.38073,3.00E-05,0.00039,0.00267,0.97581,0.0211,0,161.1,168.237,99.3306,0.00012,0.06779,0.92973,0.00065,0.00172,0,35.739,25793.2,0.246,14385.6,1.71199,79.651,0.59587,0.00011,0.00031,0.00267,0.08037,0.91653,0,0.26378,8.00E-05,3.00E-05,0.01058,0.97746,0.01184,0,0.10544,0,5.00E-05,0.01075,0.98712,0.00155,0.00053
1/09/2002,Basil,B-02,07.04.2021,22/04/2021 11:38,4517540,0.37844,0,8.00E-05,0.00193,0.97504,0.02295,0,163.957,173.79,99.1215,0.00013,0.07995,0.91843,0.00073,0.00075,0,32.987,27553.3,0.262,13233.5,1.83664,74.071,0.59685,0,0.00032,0.00199,0.07707,0.92063,0,0.26305,0,0,0.00941,0.97814,0.01245,0,0.10478,2.00E-05,3.00E-05,0.00933,0.98883,0.00122,0.00056
1/09/2002,Basil,B-02,07.04.2021,23/04/2021 11:41,4007290,0.3717,0,1.00E-04,0.0018,0.98293,0.01517,0,167.059,173.759,99.0815,5.00E-05,0.08145,0.91734,0.00058,0.00057,0,34.115,23987.2,0.228,12361.1,1.7829,77.439,0.593,0,9.00E-05,0.00226,0.08167,0.91598,0,0.25655,0,0,0.00895,0.98039,0.01066,0,0.10444,0,0,0.00895,0.98842,0.00206,0.00057
1/09/2002,Basil,B-02,07.04.2021,24/04/2021 11:43,5175000,0.38033,0,2.00E-05,0.00155,0.97927,0.01916,0,177.664,189.218,99.2691,5.00E-05,0.07743,0.92158,0.00042,0.00052,0,32.938,29128,0.277,13050.7,1.83904,73.41,0.59798,3.00E-05,7.00E-05,0.00146,0.07383,0.92461,0,0.26247,1.00E-05,1.00E-05,0.01027,0.97981,0.0099,0,0.10402,4.00E-05,8.00E-05,0.01019,0.98857,0.00089,0.00024
1/09/2002,Basil,B-02,07.04.2021,25/04/2021 11:46,4615180,0.37131,4.00E-05,1.00E-04,0.00089,0.98635,0.01263,0,179.049,185.153,100.171,5.00E-05,0.07334,0.92589,0.00025,0.00047,0,32.13,25776,0.245,11278.4,1.88016,73.556,0.60243,2.00E-05,4.00E-05,0.00097,0.06835,0.93062,0,0.24021,0,0,0.01349,0.97928,0.00724,0,0.09574,0,3.00E-05,0.01348,0.98578,0.00053,0.00019
