2458113.2270  15.625  0.003 R  071
2458113.2280  15.658  0.003 R  071
2458113.2289  15.687  0.003 R  071
2458113.2298  15.734  0.003 R  071
2458113.2307  15.748  0.003 R  071
2458113.2316  15.755  0.003 R  071
2458113.2325  15.749  0.003 R  071
2458113.2334  15.778  0.003 R  071
2458113.2343  15.800  0.003 R  071
2458113.2352  15.810  0.003 R  071
2458113.2362  15.807  0.003 R  071
2458113.2371  15.798  0.003 R  071
2458113.2380  15.823  0.003 R  071
2458113.2389  15.804  0.003 R  071
2458113.2398  15.770  0.003 R  071
2458113.2407  15.730  0.003 R  071
2458113.2416  15.694  0.003 R  071
2458113.2426  15.669  0.003 R  071
2458113.2435  15.643  0.003 R  071
2458113.2444  15.562  0.003 R  071
2458113.2453  15.508  0.003 R  071
2458113.2462  15.538  0.003 R  071
2458113.2471  15.541  0.003 R  071
2458113.2483  15.497  0.003 R  071
2458113.2492  15.470  0.003 R  071
2458113.2502  15.441  0.003 R  071
2458113.2511  15.440  0.003 R  071
2458113.2520  15.432  0.003 R  071
2458113.2529  15.402  0.003 R  071
2458113.2538  15.395  0.003 R  071
2458113.2547  15.401  0.003 R  071
2458113.2556  15.407  0.003 R  071
2458113.2565  15.403  0.003 R  071
2458113.2574  15.417  0.003 R  071
2458113.2584  15.429  0.003 R  071
2458113.2593  15.438  0.003 R  071
2458113.2620  15.499  0.003 R  071
2458113.2629  15.532  0.003 R  071
2458113.2638  15.577  0.003 R  071
2458113.2648  15.623  0.003 R  071
2458113.2657  15.609  0.003 R  071
2458113.2666  15.652  0.003 R  071
2458113.2675  15.685  0.003 R  071
2458113.2684  15.717  0.003 R  071
2458113.2693  15.753  0.003 R  071
2458113.2702  15.809  0.003 R  071
2458113.2711  15.837  0.003 R  071
2458113.2730  15.902  0.004 R  071
2458113.2739  15.927  0.004 R  071
2458113.2757  15.959  0.004 R  071
2458113.2775  15.956  0.004 R  071
2458113.2784  15.937  0.004 R  071
2458113.2793  15.926  0.004 R  071
2458113.2802  15.914  0.004 R  071
2458113.2812  15.871  0.004 R  071
2458113.2821  15.804  0.004 R  071
2458113.2830  15.788  0.004 R  071
2458113.2839  15.743  0.003 R  071
2458113.2848  15.720  0.003 R  071
2458113.2857  15.675  0.003 R  071
2458113.2867  15.667  0.003 R  071
2458113.2876  15.595  0.003 R  071
2458113.2885  15.553  0.003 R  071
2458113.2903  15.500  0.003 R  071
2458113.2912  15.479  0.003 R  071
2458113.2921  15.461  0.003 R  071
2458113.2930  15.438  0.003 R  071
2458113.2940  15.423  0.003 R  071
2458113.2949  15.399  0.003 R  071
2458113.2958  15.382  0.003 R  071
2458113.2967  15.369  0.003 R  071
2458113.2976  15.356  0.003 R  071
2458113.2985  15.355  0.003 R  071
2458113.2994  15.356  0.003 R  071
2458113.3004  15.347  0.003 R  071
2458113.3013  15.334  0.003 R  071
2458113.3031  15.331  0.003 R  071
2458113.3040  15.329  0.003 R  071
2458113.3049  15.334  0.003 R  071
2458113.3058  15.338  0.003 R  071
2458113.3076  15.354  0.003 R  071
2458113.3095  15.377  0.003 R  071
2458113.3104  15.388  0.003 R  071
2458113.3122  15.405  0.003 R  071
2458113.3131  15.408  0.003 R  071
2458113.3140  15.425  0.003 R  071
2458113.3149  15.433  0.003 R  071