2458138.2062   3.000  0.017 gp 071
2458138.2078   3.026  0.017 gp 071
2458138.2095   2.997  0.016 gp 071
2458138.2111   2.928  0.016 gp 071
2458138.2127   2.909  0.016 gp 071
2458138.2328   2.825  0.015 gp 071
2458138.2344   2.783  0.015 gp 071
2458138.2360   2.770  0.015 gp 071
2458138.2377   2.806  0.015 gp 071
2458138.2393   2.827  0.015 gp 071
2458138.2592   3.004  0.016 gp 071
2458138.2608   3.053  0.017 gp 071
2458138.2641   3.080  0.018 gp 071
2458138.2657   3.129  0.018 gp 071
2458138.2882   3.062  0.017 gp 071
2458138.2898   3.044  0.017 gp 071
2458138.2915   3.026  0.017 gp 071
2458138.2931   3.015  0.017 gp 071
2458138.3138   2.876  0.016 gp 071
2458138.3154   2.892  0.016 gp 071
2458138.3170   2.897  0.016 gp 071
2458138.3186   2.906  0.016 gp 071
2458138.3202   2.884  0.016 gp 071
2458138.2238   3.427  0.011 ip 071
2458138.2254   3.477  0.011 ip 071
2458138.2271   3.473  0.012 ip 071
2458138.2287   3.473  0.012 ip 071
2458138.2303   3.453  0.012 ip 071
2458138.2505   3.621  0.014 ip 071
2458138.2521   3.669  0.013 ip 071
2458138.2537   3.706  0.013 ip 071
2458138.2553   3.689  0.013 ip 071
2458138.2569   3.668  0.013 ip 071
2458138.2768   3.867  0.016 ip 071
2458138.2784   3.852  0.015 ip 071
2458138.2800   3.829  0.016 ip 071
2458138.2816   3.843  0.017 ip 071
2458138.2832   3.772  0.014 ip 071
2458138.3046   3.601  0.013 ip 071
2458138.3062   3.567  0.016 ip 071
2458138.3317   3.537  0.012 ip 071
2458138.3348   3.495  0.012 ip 071
2458138.3364   3.508  0.012 ip 071
2458138.3380   3.496  0.011 ip 071
2458138.2149   3.188  0.008 rp 071
2458138.2166   3.143  0.008 rp 071
2458138.2182   3.139  0.008 rp 071
2458138.2198   3.125  0.008 rp 071
2458138.2214   3.131  0.008 rp 071
2458138.2417   3.121  0.008 rp 071
2458138.2433   3.131  0.008 rp 071
2458138.2449   3.202  0.008 rp 071
2458138.2465   3.218  0.009 rp 071
2458138.2481   3.227  0.009 rp 071
2458138.2681   3.435  0.010 rp 071
2458138.2697   3.463  0.010 rp 071
2458138.2713   3.472  0.010 rp 071
2458138.2729   3.466  0.010 rp 071
2458138.2746   3.505  0.011 rp 071
2458138.2958   3.301  0.009 rp 071
2458138.2974   3.297  0.009 rp 071
2458138.2990   3.264  0.009 rp 071
2458138.3006   3.259  0.009 rp 071
2458138.3022   3.260  0.009 rp 071
2458138.3226   3.180  0.008 rp 071
2458138.3275   3.163  0.008 rp 071
2458138.3291   3.191  0.009 rp 071