au8_phot.tab     67 00:02:00      18.5       1.13
dh47_phot.tab    31 00:05:00      20.0       1.48
sc191_phot.tab   23 00:10:00      21.0       1.49
wm64_phot.tab    87 00:01:00      15.7       1.03
uj7_phot.tab   1647 multi instruments and dates
vf31_phot.tab   803 multi instruments and dates