2457396.4526   0.225  0.055 R  071
2457396.4566   0.174  0.053 R  071
2457396.4602   0.146  0.049 R  071
2457396.4639   0.178  0.049 R  071
2457396.4676   0.072  0.048 R  071
2457396.4713   0.038  0.046 R  071
2457396.4750  -0.092  0.041 R  071
2457396.4786  -0.112  0.043 R  071
2457396.4823  -0.203  0.039 R  071
2457396.5161   0.043  0.052 R  071
2457396.5197   0.111  0.047 R  071
2457396.5236   0.136  0.057 R  071
2457396.5275   0.071  0.057 R  071
2457396.5375   0.185  0.073 R  071
2457396.5474   0.169  0.082 R  071
2457396.5572  -0.105  0.047 R  071
2457396.5610  -0.010  0.045 R  071
2457396.5648  -0.047  0.038 R  071
2457396.5687  -0.173  0.033 R  071
2457396.5724  -0.270  0.030 R  071
2457396.5760  -0.351  0.030 R  071
2457396.5797  -0.345  0.029 R  071
2457396.5834  -0.229  0.033 R  071
2457396.5871  -0.038  0.043 R  071
2457396.5907   0.081  0.048 R  071
2457396.5944   0.089  0.047 R  071
2457396.5983   0.068  0.045 R  071
2457396.6022   0.053  0.045 R  071
2457396.6061   0.068  0.045 R  071
2457396.6098   0.039  0.041 R  071
2457396.6135   0.028  0.044 R  071