[
    {
        "CODIGO": "2021",
        "NOMBRE": "F_FVE_T80_01A.FR3"
    },
    {
        "CODIGO": "2022",
        "NOMBRE": "F_FVE_T80_01B.FR3"
    },
    {
        "CODIGO": "2023",
        "NOMBRE": "F_FVE_T80_01C.FR3"
    },
    {
        "CODIGO": "2024",
        "NOMBRE": "F_FVE_T80_01D.FR3"
    },
    {
        "CODIGO": "2024",
        "NOMBRE": "F_FVE_T80_01E.FR3"
    }
]
