000000000111111111110000111111100000
000000000111111111100000111110111111
000000000111111111010000111110011110
000000000111111110110000111101111110
000000000111111110010000111101011101
000000000111111101100000111100111100
000000000111111100110000111100011100
000000000111111011110000111011111011
000000000111111010100000111011011011
000000000111111001010000111010111010
000000000111111000000000111010011010
000000000111110110100000111001111010
000000000111110100110000111001011010
000000000111110011000000111000111010
000000000111110001010000111000011010
000000000111101111010000110111111010
000000000111101101000000110111011010
000000000111101010110000110110111011
000000000111101000100000110110011011
000000000111100110000000110101111100
000000000111100011010000110101011101
000000000111100000100000110100111110
000000000111011101100000110100100000
000000000111011010100000110100000001
000000000111010111100000110011100011
000000000111010100010000110011000101
000000000111010000110000110010100111
000000000111001101010000110010001001
000000000111001001110000110001101100
000000000111000110000000110001001111
000000000111000010010000110000110010
000000000110111110010000110000010101
000000000110111010010000101111111001
000000000110110110000000101111011101
000000000110110001110000101111000001
000000000110101101010000101110100101
000000000110101000110000101110001010
000000000110100100000000101101101111
000000000110011111100000101101010100
000000000110011010100000101100111001
000000000110010101100000101100011111
000000000110010000100000101100000110
000000000110001011100000101011101100
000000000110000110010000101011010011
000000000110000000110000101010111010
000000000101111011010000101010100010
000000000101110101110000101010001010
000000000101110000010000101001110010
000000000101101010100000101001011010
000000000101100100100000101001000011
000000000101011110110000101000101101
000000000101011000110000101000010110
000000000101010010100000101000000001
000000000101001100010000100111101011
000000000101000110000000100111010110
000000000100111111110000100111000001
000000000100111001010000100110101101
000000000100110010110000100110011001
000000000100101100010000100110000110
000000000100100101100000100101110011
000000000100011110110000100101100000
000000000100011000000000100101001110
000000000100010001000000100100111100
000000000100001010000000100100101011
000000000100000011000000100100011010
000000000011111100000000100100001010
000000000011110100110000100011111010
000000000011101101100000100011101011
000000000011100110010000100011011100
000000000011011111000000100011001101
000000000011010111100000100010111111
000000000011010000000000100010110001
000000000011001000100000100010100100
000000000011000001000000100010011000
000000000010111001100000100010001100
000000000010110001110000100010000000
000000000010101010000000100001110101
000000000010100010010000100001101010
000000000010011010100000100001100000
000000000010010010110000100001010110
000000000010001010110000100001001101
000000000010000011000000100001000101
000000000001111011000000100000111101
000000000001110011000000100000110101
000000000001101011000000100000101110
000000000001100011000000100000100111
000000000001011011000000100000100001
000000000001010010110000100000011100
000000000001001010110000100000010111
000000000001000010110000100000010010
000000000000111010100000100000001110
000000000000110010100000100000001010
000000000000101010010000100000001000
000000000000100010000000100000000101
000000000000011001110000100000000011
000000000000010001110000100000000010
000000000000001001100000100000000001
000000000000000001010000100000000001
000000001111111001010000100000000001
000000001111110001010000100000000001
000000001111101001000000100000000011
000000001111100000110000100000000100
000000001111011000110000100000000111
000000001111010000100000100000001001
000000001111001000010000100000001101
000000001111000000010000100000010001
000000001110111000000000100000010101
000000001110110000000000100000011010
000000001110101000000000100000011111
000000001110011111110000100000100101
000000001110010111110000100000101011
000000001110001111110000100000110010
000000001110000111110000100000111010
000000001101111111110000100001000010
000000001101111000000000100001001010
000000001101110000000000100001010011
000000001101101000010000100001011101
000000001101100000100000100001100111
000000001101011000110000100001110001
000000001101010001000000100001111100
000000001101001001010000100010001000
000000001101000001110000100010010100
000000001100111010000000100010100000
000000001100110010100000100010101101
000000001100101011000000100010111010
000000001100100011110000100011001000
000000001100011100010000100011010110
000000001100010101000000100011100101
000000001100011100010000011100101010
000000001100100011110000011100111000
000000001100101011000000011101000110
000000001100110010100000011101010011
000000001100111010000000011101100000
000000001101000001110000011101101100
000000001101001001010000011101111000
000000001101010001000000011110000100
000000001101011000110000011110001111
000000001101100000100000011110011001
000000001101101000010000011110100011
000000001101110000000000011110101101
000000001101111000000000011110110110
000000001101111111110000011110111110
000000001110000111110000011111000110
000000001110001111110000011111001110
000000001110010111110000011111010101
000000001110011111110000011111011011
000000001110101000000000011111100001
000000001110110000000000011111100110
000000001110111000000000011111101011
000000001111000000010000011111101111
000000001111001000010000011111110011
000000001111010000100000011111110111
000000001111011000110000011111111001
000000001111100000110000011111111100
000000001111101001000000011111111101
000000001111110001010000011111111111
000000001111111001010000011111111111
000000000000000001010000011111111111
000000000000001001100000011111111111
000000000000010001110000011111111110
000000000000011001110000011111111101
000000000000100010000000011111111011
000000000000101010010000011111111000
000000000000110010100000011111110110
000000000000111010100000011111110010
000000000001000010110000011111101110
000000000001001010110000011111101001
000000000001010010110000011111100100
000000000001011011000000011111011111
000000000001100011000000011111011001
000000000001101011000000011111010010
000000000001110011000000011111001011
000000000001111011000000011111000011
000000000010000011000000011110111011
000000000010001010110000011110110011
000000000010010010110000011110101010
000000000010011010100000011110100000
000000000010100010010000011110010110
000000000010101010000000011110001011
000000000010110001110000011110000000
000000000010111001100000011101110100
000000000011000001000000011101101000
000000000011001000100000011101011100
000000000011010000000000011101001111
000000000011010111100000011101000001
000000000011011111000000011100110011
000000000011100110010000011100100100
000000000011101101100000011100010101
000000000011110100110000011100000110
000000000011111100000000011011110110
000000000100000011000000011011100110
000000000100001010000000011011010101
000000000100010001000000011011000100
000000000100011000000000011010110010
000000000100011110110000011010100000
000000000100100101100000011010001101
000000000100101100010000011001111010
000000000100110010110000011001100111
000000000100111001010000011001010011
000000000100111111110000011000111111
000000000101000110000000011000101010
000000000101001100010000011000010101
000000000101010010100000010111111111
000000000101011000110000010111101010
000000000101011110110000010111010011
000000000101100100100000010110111101
000000000101101010100000010110100110
000000000101110000010000010110001110
000000000101110101110000010101110110
000000000101111011010000010101011110
000000000110000000110000010101000110
000000000110000110010000010100101101
000000000110001011100000010100010100
000000000110010000100000010011111010
000000000110010101100000010011100001
000000000110011010100000010011000111
000000000110011111100000010010101100
000000000110100100000000010010010001
000000000110101000110000010001110110
000000000110101101010000010001011011
000000000110110001110000010000111111
000000000110110110000000010000100011
000000000110111010010000010000000111
000000000110111110010000001111101011
000000000111000010010000001111001110
000000000111000110000000001110110001
000000000111001001110000001110010100
000000000111001101010000001101110111
000000000111010000110000001101011001
000000000111010100010000001100111011
000000000111010111100000001100011101
000000000111011010100000001011111111
000000000111011101100000001011100000
000000000111100000100000001011000010
000000000111100011010000001010100011
000000000111100110000000001010000100
000000000111101000100000001001100101
000000000111101010110000001001000101
000000000111101101000000001000100110
000000000111101111010000001000000110
000000000111110001010000000111100110
000000000111110011000000000111000110
000000000111110100110000000110100110
000000000111110110100000000110000110
000000000111111000000000000101100110
000000000111111001010000000101000110
000000000111111010100000000100100101
000000000111111011110000000100000101
000000000111111100110000000011100100
000000000111111101100000000011000100
000000000111111110010000000010100011
000000000111111110110000000010000010
000000000111111111010000000001100010
000000000111111111100000000001000001
000000000111111111110000000000100000
000000000111111111110000000000000000
