%!PS-Adobe
%
% draw tube hits
%
/inch { 72 mul } def
/marg { 0.5 inch } def
/wide { 7.5 inch } def
/high { 7.5 inch } def
/circ { 0 360 arc stroke } def   % (x y r)
/TubeR { 15 } def
% scale 0..1 to box with reasonable line width
marg marg translate
wide high scale
0.001 setlinewidth
% draw box around
newpath
0.5 setgray
0 0 moveto
0 1 lineto
1 1 lineto
1 0 lineto
0 0 lineto
0 setgray
stroke
% x0 x1 y0 y1 -> save drawing box
/setXYrange {
  /y1 exch def /y0 exch def /x1 exch def /x0 exch def
  % expand range by tube radius
  /x0 x0 TubeR sub def
  /y0 y0 TubeR sub def
  /x1 x1 TubeR add def
  /y1 y1 TubeR add def
  x1 x0 sub /xrange exch def
  y1 y0 sub /yrange exch def
  /range xrange def
  yrange xrange gt { /range yrange def } if
  (setXYrange ) print xrange = yrange = range =
} def
% x y r -> draw
/drawCirc {
  /hitR exch def 
  y0 sub range div exch
  x0 sub range div exch
  2 copy
  hitR range div  circ
  0.5 setgray TubeR range div circ 0 setgray
} def
% x0 y0 x1 y1 -> draw
/drawTrack {
    newpath
    y0 sub range div exch
    x0 sub range div exch
    moveto
    y0 sub range div exch
    x0 sub range div exch
    lineto
    stroke
} def
