000000000000000000000
000000000000000000000
000000000000000000000
000000000000000000000
000000000000000000000
000000000000000000000
000000000000001111111
000000000000001111111
000000011111111111111
000000011111111111111
000000011111111111111
000000011111111111110
000000011111111111110
000000011111111111110
000000011111111111110
000000011111111111110
000000011111101111101
111111111111101111101
111111111111101111101
111111111111101111101
111111111111101111101
111111111111101111100
111111111111101111100
111111111111101111100
111111111111101111100
111111111111011111100
111111111111011111100
111111111111011111011
111111111111011111011
111111111111011111011
111111111111011111011
111111111111011111011
000000000000000000000
000000000000000000000
000000000000000000000
000000000000000000000
000000000000000000000
000000000000000000000
000000000000001111111
000000000000001111111
000000000000001111111
000000011111111111111
000000011111111111111
000000011111111111111
000000011111111111110
000000011111111111110
000000011111111111110
000000011111111111110
000000011111111111110
000000011111111111110
000000011111111111101
000000011111101111101
000000011111101111101
000000011111101111101
000000011111101111101
000000011111101111100
111111111111101111100
111111111111101111100
111111111111101111100
111111111111101111100
111111111111011111100
111111111111011111011
111111111111011111011
111111111111011111011
000000000000000000000
000000000000000000000
000000000000000000000
000000000000000000000
000000000000000000000
000000000000000000000
000000000000000000000
000000000000001111111
000000000000001111111
000000000000001111111
000000000000001111111
000000011111111111111
000000011111111111111
000000011111111111110
000000011111111111110
000000011111111111110
000000011111111111110
000000011111111111110
000000011111111111110
000000011111111111101
000000011111111111101
000000011111111111101
000000011111101111101
000000011111101111101
000000011111101111101
000000011111101111101
000000011111101111100
000000011111101111100
000000011111101111100
000000011111101111100
000000011111101111100
000000011111101111100
000000000000000000000
000000000000000000000
000000000000000000000
000000000000000000000
000000000000000000000
000000000000000000000
000000000000000000000
000000000000001111111
000000000000001111111
000000000000001111111
000000000000001111111
000000000000001111111
000000000000001111111
000000011111111111111
000000011111111111110
000000011111111111110
000000011111111111110
000000011111111111110
000000011111111111110
000000011111111111110
000000011111111111110
000000011111111111110
000000011111111111101
000000011111111111101
000000011111111111101
000000011111111111101
000000011111111111101
000000011111101111101
000000011111101111101
000000011111101111100
000000011111101111100
000000011111101111100
000000000000000000000
000000000000000000000
000000000000000000000
000000000000000000000
000000000000000000000
000000000000000000000
000000000000000000000
000000000000000000000
000000000000001111111
000000000000001111111
000000000000001111111
000000000000001111111
000000000000001111111
000000000000001111111
000000000000001111111
000000000000001111111
000000000000001111110
000000011111111111110
000000011111111111110
000000011111111111110
000000011111111111110
000000011111111111110
000000011111111111110
000000011111111111110
000000011111111111110
000000011111111111101
000000011111111111101
000000011111111111101
000000011111111111101
000000011111111111101
000000011111111111101
000000011111111111101
000000000000000000000
000000000000000000000
000000000000000000000
000000000000000000000
000000000000000000000
000000000000000000000
000000000000000000000
000000000000000000000
000000000000000000000
000000000000001111111
000000000000001111111
000000000000001111111
000000000000001111111
000000000000001111111
000000000000001111111
000000000000001111111
000000000000001111111
000000000000001111111
000000000000001111111
000000000000001111110
000000000000001111110
000000000000001111110
000000000000001111110
000000000000001111110
000000011111111111110
000000011111111111110
000000011111111111110
000000011111111111110
000000011111111111101
000000011111111111101
000000011111111111101
000000011111111111101
000000000000000000000
000000000000000000000
000000000000000000000
000000000000000000000
000000000000000000000
000000000000000000000
000000000000000000000
000000000000000000000
000000000000000000000
000000000000000000000
000000000000000000000
000000000000001111111
000000000000001111111
000000000000001111111
000000000000001111111
000000000000001111111
000000000000001111111
000000000000001111111
000000000000001111111
000000000000001111111
000000000000001111111
000000000000001111111
000000000000001111110
000000000000001111110
000000000000001111110
000000000000001111110
000000100000001111110
000000100000001111110
000000100000001111110
000000100000001111110
000000100000001111110
000000100000001111110
000000000000000000000
000000000000000000000
000000000000000000000
000000000000000000000
000000000000000000000
000000000000000000000
000000000000000000000
000000000000000000000
000000000000000000000
000000000000000000000
000000000000000000000
000000000000000000000
000000000000000000000
000000000000001111111
000000000000001111111
000000000000001111111
000000000000001111111
000000000000001111111
000000000000001111111
000000100000001111111
000000100000001111111
000000100000001111111
000000100000001111111
000000100000001111111
000000100000001111111
000000100000001111111
000000100000001111111
000000100000001111110
000000100000001111110
000000100000001111110
000000100000001111110
000000100000001111110
000000000000000000000
000000000000000000000
000000000000000000000
000000000000000000000
000000000000000000000
000000000000000000000
000000000000000000000
000000000000000000000
000000000000000000000
000000000000000000000
000000000000000000000
000000000000000000000
000000000000000000000
000000000000000000000
000000000000000000000
000000100000000000000
000000100000000000000
000000100000001111111
000000100000001111111
000000100000001111111
000000100000001111111
000000100000001111111
000000100000001111111
000000100000001111111
000000100000001111111
000000100000001111111
000000100000001111111
000000100000001111111
000001000000001111111
000001000000001111111
000001000000001111111
000001000000001111111
000000000000000000000
000000000000000000000
000000000000000000000
000000000000000000000
000000000000000000000
000000000000000000000
000000000000000000000
000000000000000000000
000000000000000000000
000000000000000000000
000000000000000000000
000000000000000000000
000000100000000000000
000000100000000000000
000000100000000000000
000000100000000000000
000000100000000000000
000000100000000000000
000000100000000000000
000000100000000000000
000000100000000000000
000000100000000000000
000000100000000000000
000001000000000000000
000001000000001111111
000001000000001111111
000001000000001111111
000001000000001111111
000001000000001111111
000001000000001111111
000001000000001111111
000001000000001111111
000000000000000000000
000000000000000000000
000000000000000000000
000000000000000000000
000000000000000000000
000000000000000000000
000000000000000000000
000000000000000000000
000000000000000000000
000000000000000000000
000000100000000000000
000000100000000000000
000000100000000000000
000000100000000000000
000000100000000000000
000000100000000000000
000000100000000000000
000000100000000000000
000000100000000000000
000000100000000000000
000001000000000000000
000001000000000000000
000001000000000000000
000001000000000000000
000001000000000000000
000001000000000000000
000001000000010000000
000001000000010000000
000001000000010000000
000001100000010000000
000001100000010000000
000001100000010000000
000000000000000000000
000000000000000000000
000000000000000000000
000000000000000000000
000000000000000000000
000000000000000000000
000000000000000000000
000000000000000000000
000000000000000000000
000000100000000000000
000000100000000000000
000000100000000000000
000000100000000000000
000000100000000000000
000000100000000000000
000000100000000000000
000000100000000000000
000001000000000000000
000001000000000000000
000001000000010000000
000001000000010000000
000001000000010000000
000001000000010000000
000001000000010000000
000001000000010000000
000001100000010000000
000001100000010000000
000001100000010000000
000001100000010000000
000001100000010000000
000001100000010000000
000001100000010000000
000000000000000000000
000000000000000000000
000000000000000000000
000000000000000000000
000000000000000000000
000000000000000000000
000000000000000000000
000000000000000000000
000000100000000000000
000000100000000000000
000000100000000000000
000000100000000000000
000000100000000000000
000000100000000000000
000000100000000000000
000001000000010000000
000001000000010000000
000001000000010000000
000001000000010000000
000001000000010000000
000001000000010000000
000001000000010000000
000001100000010000000
000001100000010000000
000001100000010000000
000001100000010000000
000001100000010000000
000001100000010000000
000001100000100000000
000010000000100000000
000010000000100000000
000010000000100000000
000000000000000000000
000000000000000000000
000000000000000000000
000000000000000000000
000000000000000000000
000000000000000000000
000000000000000000000
000000100000000000000
000000100000000000000
000000100000000000000
000000100000000000000
000000100000000000000
000000100000010000000
000000100000010000000
000001000000010000000
000001000000010000000
000001000000010000000
000001000000010000000
000001000000010000000
000001000000010000000
000001100000010000000
000001100000010000000
000001100000010000000
000001100000100000000
000001100000100000000
000001100000100000000
000010000000100000000
000010000000100000000
000010000000100000000
000010000000100000000
000010000000100000000
000010000000100000000
000000000000000000000
000000000000000000000
000000000000000000000
000000000000000000000
000000000000000000000
000000000000000000000
000000000000000000000
000000100000000000000
000000100000000000000
000000100000000000000
000000100000010000000
000000100000010000000
000001000000010000000
000001000000010000000
000001000000010000000
000001000000010000000
000001000000010000000
000001000000010000000
000001100000010000000
000001100000010000000
000001100000100000000
000001100000100000000
000001100000100000000
000001100000100000000
000010000000100000000
000010000000100000000
000010000000100000001
000010000000100000001
000010000000100000001
000010000000110000001
000010100000110000001
000010100000110000001
000000000000000000000
000000000000000000000
000000000000000000000
000000000000000000000
000000000000000000000
000000000000000000000
000000100000000000000
000000100000000000000
000000100000000000000
000000100000010000000
000000100000010000000
000001000000010000000
000001000000010000000
000001000000010000000
000001000000010000000
000001000000010000000
000001000000010000000
000001100000100000000
000001100000100000000
000001100000100000001
000001100000100000001
000001100000100000001
000010000000100000001
000010000000100000001
000010000000100000001
000010000000110000001
000010000000110000001
000010100000110000001
000010100000110000001
000010100000110000001
000010100000110000001
000010100000110000001
