(kicad_sch (version 20230121) (generator eeschema)

  (uuid 9a430773-7346-4405-b1ad-c40b6142b6cb)

  (paper "A4")

  (lib_symbols
    (symbol "Splice_plate_1-rescue:S-M3-2ZI-Mezzanine_Board" (pin_names (offset 1.016)) (in_bom yes) (on_board yes)
      (property "Reference" "U" (at -3.81 0 0)
        (effects (font (size 1.27 1.27)))
      )
      (property "Value" "Mezzanine_Board_S-M3-2ZI" (at -3.81 0 0)
        (effects (font (size 1.27 1.27)) (justify left))
      )
      (property "Footprint" "" (at -3.81 0 0)
        (effects (font (size 1.27 1.27)) hide)
      )
      (property "Datasheet" "" (at -3.81 0 0)
        (effects (font (size 1.27 1.27)) hide)
      )
      (symbol "S-M3-2ZI-Mezzanine_Board_0_1"
        (circle (center 0 -3.81) (radius 1.8034)
          (stroke (width 0) (type solid))
          (fill (type background))
        )
      )
    )
  )


  (symbol (lib_id "Splice_plate_1-rescue:S-M3-2ZI-Mezzanine_Board") (at 121.92 71.12 0) (unit 1)
    (in_bom yes) (on_board yes) (dnp no)
    (uuid 00000000-0000-0000-0000-000064551838)
    (property "Reference" "U1" (at 124.4346 73.7616 0)
      (effects (font (size 1.27 1.27)) (justify left))
    )
    (property "Value" "KF2-M3-ET" (at 124.4346 76.073 0)
      (effects (font (size 1.27 1.27)) (justify left))
    )
    (property "Footprint" "KF2-M3-ET:KF2-M3-ET" (at 118.11 71.12 0)
      (effects (font (size 1.27 1.27)) hide)
    )
    (property "Datasheet" "https://www.mouser.com/datasheet/2/974/kdata-1901229.pdf" (at 118.11 71.12 0)
      (effects (font (size 1.27 1.27)) hide)
    )
    (property "CatNo" " 153-KF2-M3-ET " (at 121.92 71.12 0)
      (effects (font (size 1.27 1.27)) hide)
    )
    (property "Mfgr" "PEM" (at 121.92 71.12 0)
      (effects (font (size 1.27 1.27)) hide)
    )
    (property "MfgrNo" "KF2-M3-ET" (at 121.92 71.12 0)
      (effects (font (size 1.27 1.27)) hide)
    )
    (property "Vendor" "Mouser" (at 121.92 71.12 0)
      (effects (font (size 1.27 1.27)) hide)
    )
    (instances
      (project "Splice_plate_1"
        (path "/9a430773-7346-4405-b1ad-c40b6142b6cb"
          (reference "U1") (unit 1)
        )
      )
    )
  )

  (symbol (lib_id "Splice_plate_1-rescue:S-M3-2ZI-Mezzanine_Board") (at 121.92 82.55 0) (unit 1)
    (in_bom yes) (on_board yes) (dnp no)
    (uuid dd662815-2591-40b0-af34-9f5bd0711b43)
    (property "Reference" "U3" (at 124.4346 85.1916 0)
      (effects (font (size 1.27 1.27)) (justify left))
    )
    (property "Value" "KF2-M3-ET" (at 124.4346 87.503 0)
      (effects (font (size 1.27 1.27)) (justify left))
    )
    (property "Footprint" "KF2-M3-ET:KF2-M3-ET" (at 118.11 82.55 0)
      (effects (font (size 1.27 1.27)) hide)
    )
    (property "Datasheet" "https://www.mouser.com/datasheet/2/974/kdata-1901229.pdf" (at 118.11 82.55 0)
      (effects (font (size 1.27 1.27)) hide)
    )
    (property "CatNo" " 153-KF2-M3-ET " (at 121.92 82.55 0)
      (effects (font (size 1.27 1.27)) hide)
    )
    (property "Mfgr" "PEM" (at 121.92 82.55 0)
      (effects (font (size 1.27 1.27)) hide)
    )
    (property "MfgrNo" "KF2-M3-ET" (at 121.92 82.55 0)
      (effects (font (size 1.27 1.27)) hide)
    )
    (property "Vendor" "Mouser" (at 121.92 82.55 0)
      (effects (font (size 1.27 1.27)) hide)
    )
    (instances
      (project "Splice_plate_1"
        (path "/9a430773-7346-4405-b1ad-c40b6142b6cb"
          (reference "U3") (unit 1)
        )
      )
    )
  )

  (symbol (lib_id "Splice_plate_1-rescue:S-M3-2ZI-Mezzanine_Board") (at 121.92 88.265 0) (unit 1)
    (in_bom yes) (on_board yes) (dnp no)
    (uuid eea825dc-388e-4310-8b8b-8cd84b04041c)
    (property "Reference" "U4" (at 124.4346 90.9066 0)
      (effects (font (size 1.27 1.27)) (justify left))
    )
    (property "Value" "KF2-M3-ET" (at 124.4346 93.218 0)
      (effects (font (size 1.27 1.27)) (justify left))
    )
    (property "Footprint" "KF2-M3-ET:KF2-M3-ET" (at 118.11 88.265 0)
      (effects (font (size 1.27 1.27)) hide)
    )
    (property "Datasheet" "https://www.mouser.com/datasheet/2/974/kdata-1901229.pdf" (at 118.11 88.265 0)
      (effects (font (size 1.27 1.27)) hide)
    )
    (property "CatNo" " 153-KF2-M3-ET " (at 121.92 88.265 0)
      (effects (font (size 1.27 1.27)) hide)
    )
    (property "Mfgr" "PEM" (at 121.92 88.265 0)
      (effects (font (size 1.27 1.27)) hide)
    )
    (property "MfgrNo" "KF2-M3-ET" (at 121.92 88.265 0)
      (effects (font (size 1.27 1.27)) hide)
    )
    (property "Vendor" "Mouser" (at 121.92 88.265 0)
      (effects (font (size 1.27 1.27)) hide)
    )
    (instances
      (project "Splice_plate_1"
        (path "/9a430773-7346-4405-b1ad-c40b6142b6cb"
          (reference "U4") (unit 1)
        )
      )
    )
  )

  (symbol (lib_id "Splice_plate_1-rescue:S-M3-2ZI-Mezzanine_Board") (at 121.92 76.835 0) (unit 1)
    (in_bom yes) (on_board yes) (dnp no)
    (uuid f407ec87-8948-4a6d-b540-8ebdd4264ab0)
    (property "Reference" "U2" (at 124.4346 79.4766 0)
      (effects (font (size 1.27 1.27)) (justify left))
    )
    (property "Value" "KF2-M3-ET" (at 124.4346 81.788 0)
      (effects (font (size 1.27 1.27)) (justify left))
    )
    (property "Footprint" "KF2-M3-ET:KF2-M3-ET" (at 118.11 76.835 0)
      (effects (font (size 1.27 1.27)) hide)
    )
    (property "Datasheet" "https://www.mouser.com/datasheet/2/974/kdata-1901229.pdf" (at 118.11 76.835 0)
      (effects (font (size 1.27 1.27)) hide)
    )
    (property "CatNo" " 153-KF2-M3-ET " (at 121.92 76.835 0)
      (effects (font (size 1.27 1.27)) hide)
    )
    (property "Mfgr" "PEM" (at 121.92 76.835 0)
      (effects (font (size 1.27 1.27)) hide)
    )
    (property "MfgrNo" "KF2-M3-ET" (at 121.92 76.835 0)
      (effects (font (size 1.27 1.27)) hide)
    )
    (property "Vendor" "Mouser" (at 121.92 76.835 0)
      (effects (font (size 1.27 1.27)) hide)
    )
    (instances
      (project "Splice_plate_1"
        (path "/9a430773-7346-4405-b1ad-c40b6142b6cb"
          (reference "U2") (unit 1)
        )
      )
    )
  )

  (sheet_instances
    (path "/" (page "1"))
  )
)
