(module Iriso_Connector (layer F.Cu) (tedit 62473D1A)
  (descr "Molex Molex 0.30mm Pitch Easy-On BackFlip Type FFC/FPC, 502250-1791, 17 Circuits (http://www.molex.com/pdm_docs/sd/5022501791_sd.pdf), generated with kicad-footprint-generator")
  (tags "connector Molex  top entry")
  (attr smd)
  (fp_text reference REF** (at -2.99 0.25 90) (layer F.SilkS)
    (effects (font (size 1 1) (thickness 0.15)))
  )
  (fp_text value Iriso_Connector (at -0.07 4.72) (layer F.Fab)
    (effects (font (size 1 1) (thickness 0.15)))
  )
  (fp_line (start 7.11 -0.015) (end 7.11 2.425) (layer F.SilkS) (width 0.01))
  (fp_line (start 1.88 2.07) (end 5.33 2.07) (layer F.Fab) (width 0.1))
  (fp_line (start 5.33 2.07) (end 5.33 1.635) (layer F.Fab) (width 0.1))
  (fp_line (start 5.33 1.635) (end 5.03 1.635) (layer F.Fab) (width 0.1))
  (fp_line (start 5.03 1.635) (end 5.03 1.235) (layer F.Fab) (width 0.1))
  (fp_line (start 5.03 1.235) (end 5.33 1.235) (layer F.Fab) (width 0.1))
  (fp_line (start 5.33 1.235) (end 5.33 -1.46) (layer F.Fab) (width 0.1))
  (fp_line (start 5.33 -1.46) (end 5.03 -1.46) (layer F.Fab) (width 0.1))
  (fp_line (start 5.03 -1.46) (end 5.03 -1.21) (layer F.Fab) (width 0.1))
  (fp_line (start 5.03 -1.21) (end 1.88 -1.21) (layer F.Fab) (width 0.1))
  (fp_line (start 1.88 2.07) (end -1.57 2.07) (layer F.Fab) (width 0.1))
  (fp_line (start -1.57 2.07) (end -1.57 1.635) (layer F.Fab) (width 0.1))
  (fp_line (start -1.57 1.635) (end -1.27 1.635) (layer F.Fab) (width 0.1))
  (fp_line (start -1.27 1.635) (end -1.27 1.235) (layer F.Fab) (width 0.1))
  (fp_line (start -1.27 1.235) (end -1.57 1.235) (layer F.Fab) (width 0.1))
  (fp_line (start -1.57 1.235) (end -1.57 -1.46) (layer F.Fab) (width 0.1))
  (fp_line (start -1.57 -1.46) (end -1.27 -1.46) (layer F.Fab) (width 0.1))
  (fp_line (start -1.27 -1.46) (end -1.27 -1.21) (layer F.Fab) (width 0.1))
  (fp_line (start -1.27 -1.21) (end 1.88 -1.21) (layer F.Fab) (width 0.1))
  (fp_line (start -0.76 -1.21) (end -0.76 -2.12) (layer F.Fab) (width 0.1))
  (fp_line (start -0.76 -2.12) (end 4.52 -2.12) (layer F.Fab) (width 0.1))
  (fp_line (start 4.52 -2.12) (end 4.52 -1.21) (layer F.Fab) (width 0.1))
  (fp_line (start 4.94 2.18) (end 5.44 2.18) (layer F.SilkS) (width 0.12))
  (fp_line (start 5.44 2.18) (end 5.44 -1.57) (layer F.SilkS) (width 0.12))
  (fp_line (start 5.44 -1.57) (end 4.92 -1.57) (layer F.SilkS) (width 0.12))
  (fp_line (start 4.92 -1.57) (end 4.92 -1.32) (layer F.SilkS) (width 0.12))
  (fp_line (start 4.92 -1.32) (end 4.63 -1.32) (layer F.SilkS) (width 0.12))
  (fp_line (start 4.63 -1.32) (end 4.63 -2.23) (layer F.SilkS) (width 0.12))
  (fp_line (start 4.63 -2.23) (end 1.88 -2.23) (layer F.SilkS) (width 0.12))
  (fp_line (start -1.18 2.18) (end -1.68 2.18) (layer F.SilkS) (width 0.12))
  (fp_line (start -1.68 2.18) (end -1.68 -1.57) (layer F.SilkS) (width 0.12))
  (fp_line (start -1.68 -1.57) (end -1.16 -1.57) (layer F.SilkS) (width 0.12))
  (fp_line (start -1.16 -1.57) (end -1.16 -1.32) (layer F.SilkS) (width 0.12))
  (fp_line (start -1.16 -1.32) (end -0.87 -1.32) (layer F.SilkS) (width 0.12))
  (fp_line (start -0.87 -1.32) (end -0.87 -2.23) (layer F.SilkS) (width 0.12))
  (fp_line (start -0.87 -2.23) (end 1.88 -2.23) (layer F.SilkS) (width 0.12))
  (fp_line (start -0.67 2.632132) (end -0.52 2.42) (layer F.SilkS) (width 0.12))
  (fp_line (start -0.52 2.42) (end -0.37 2.632132) (layer F.SilkS) (width 0.12))
  (fp_line (start -0.37 2.632132) (end -0.67 2.632132) (layer F.SilkS) (width 0.12))
  (fp_line (start -0.82 2.07) (end -0.52 1.645736) (layer F.Fab) (width 0.1))
  (fp_line (start -0.52 1.645736) (end -0.22 2.07) (layer F.Fab) (width 0.1))
  (fp_line (start -2.14 2.66) (end 5.9 2.66) (layer F.CrtYd) (width 0.05))
  (fp_line (start 5.9 2.66) (end 5.9 -2.62) (layer F.CrtYd) (width 0.05))
  (fp_line (start 5.9 -2.62) (end -2.14 -2.62) (layer F.CrtYd) (width 0.05))
  (fp_line (start -2.14 -2.62) (end -2.14 2.66) (layer F.CrtYd) (width 0.05))
  (fp_text user %R (at 1.69 -3.4 180) (layer F.Fab)
    (effects (font (size 0.82 0.82) (thickness 0.12)))
  )
  (fp_text user "mp - pin1: 0.37mm" (at -3.96 -3.69) (layer F.SilkS)
    (effects (font (size 0.1 0.1) (thickness 0.025)))
  )
  (fp_text user "pin 1-3: 0.6mm" (at -3.96 -4.04) (layer F.SilkS)
    (effects (font (size 0.1 0.1) (thickness 0.025)))
  )
  (fp_text user "mp pins- 0.4 x 0.85 mm" (at -3.71 -3.34) (layer F.SilkS)
    (effects (font (size 0.1 0.1) (thickness 0.025)))
  )
  (fp_text user "spacing between rows- 2.15 mm" (at -3.76 -2.99) (layer F.SilkS)
    (effects (font (size 0.1 0.1) (thickness 0.025)))
  )
  (fp_text user "current footprint measurements" (at -4.06 -4.49) (layer F.SilkS)
    (effects (font (size 0.2 0.2) (thickness 0.045)))
  )
  (fp_text user "ends pin 1-2: 0.32 mm" (at -3.96 -2.71) (layer F.SilkS)
    (effects (font (size 0.1 0.1) (thickness 0.025)))
  )
  (pad MP smd rect (at 10.5 2.25 90) (size 0.85 0.4) (layers F.Cu F.Paste F.Mask))
  (pad MP smd rect (at 10.5 3.825 90) (size 0.85 0.4) (layers F.Cu F.Paste F.Mask))
  (pad 10 smd rect (at 9.68 1.135 90) (size 0.65 0.3) (layers F.Cu F.Paste F.Mask))
  (pad 8 smd rect (at 9.08 1.135 90) (size 0.65 0.3) (layers F.Cu F.Paste F.Mask))
  (pad 6 smd rect (at 8.48 1.135 90) (size 0.65 0.3) (layers F.Cu F.Paste F.Mask))
  (pad 4 smd rect (at 7.88 1.135 90) (size 0.65 0.3) (layers F.Cu F.Paste F.Mask))
  (pad 2 smd rect (at 7.28 1.135 90) (size 0.65 0.3) (layers F.Cu F.Paste F.Mask))
  (pad 11 smd rect (at 9.98 2.735 90) (size 0.8 0.26) (layers F.Cu F.Paste F.Mask))
  (pad 9 smd rect (at 9.38 2.735 90) (size 0.8 0.26) (layers F.Cu F.Paste F.Mask))
  (pad 7 smd rect (at 8.78 2.735 90) (size 0.8 0.26) (layers F.Cu F.Paste F.Mask))
  (pad 5 smd rect (at 8.18 2.735 90) (size 0.8 0.26) (layers F.Cu F.Paste F.Mask))
  (pad 3 smd rect (at 7.58 2.735 90) (size 0.8 0.26) (layers F.Cu F.Paste F.Mask))
  (pad 1 smd rect (at 6.98 2.735 90) (size 0.8 0.26) (layers F.Cu F.Paste F.Mask))
  (model ${KISYS3DMOD}/Connector_FFC-FPC.3dshapes/Molex_502250-1791_2Rows-17Pins-1MP_P0.60mm_Horizontal.wrl
    (at (xyz 0 0 0))
    (scale (xyz 1 1 1))
    (rotate (xyz 0 0 0))
  )
)
