EESchema Schematic File Version 4
EELAYER 30 0
EELAYER END
$Descr A4 11693 8268
encoding utf-8
Sheet 1 1
Title ""
Date ""
Rev ""
Comp ""
Comment1 ""
Comment2 ""
Comment3 ""
Comment4 ""
$EndDescr
NoConn ~ 4400 3200
NoConn ~ 4400 3100
NoConn ~ 4400 1800
$Comp
L power:GND #PWR05
U 1 1 6233113B
P 900 2050
F 0 "#PWR05" H 900 1800 50  0001 C CNN
F 1 "GND" H 905 1877 50  0000 C CNN
F 2 "" H 900 2050 50  0001 C CNN
F 3 "" H 900 2050 50  0001 C CNN
	1    900  2050
	1    0    0    -1  
$EndComp
Wire Wire Line
	900  1600 900  1700
$Comp
L power:+12V #PWR01
U 1 1 626CAB53
P 1800 1100
F 0 "#PWR01" H 1800 950 50  0001 C CNN
F 1 "+12V" H 1800 1250 50  0000 C CNN
F 2 "" H 1800 1100 50  0001 C CNN
F 3 "" H 1800 1100 50  0001 C CNN
	1    1800 1100
	1    0    0    -1  
$EndComp
$Comp
L Device:C C1
U 1 1 626E10D4
P 900 1850
F 0 "C1" H 650 1900 50  0000 L CNN
F 1 "1uF" H 650 1800 50  0000 L CNN
F 2 "Capacitor_SMD:C_0805_2012Metric_Pad1.18x1.45mm_HandSolder" H 938 1700 50  0001 C CNN
F 3 "~" H 900 1850 50  0001 C CNN
F 4 "1276-1026-1-ND" H 900 1850 50  0001 C CNN "Digikey_NO"
	1    900  1850
	1    0    0    -1  
$EndComp
$Comp
L Device:LED D1
U 1 1 627131A6
P 2200 1850
F 0 "D1" V 2300 1750 50  0000 R CNN
F 1 "LED" V 2200 1750 50  0000 R CNN
F 2 "LED_THT:LED_D3.0mm" H 2200 1850 50  0001 C CNN
F 3 "~" H 2200 1850 50  0001 C CNN
F 4 "732-5006-ND" H 2200 1850 50  0001 C CNN "Digikey_NO"
	1    2200 1850
	0    -1   -1   0   
$EndComp
$Comp
L Device:R_US R1
U 1 1 627151D1
P 2200 1500
F 0 "R1" H 2300 1550 50  0000 L CNN
F 1 "5.1K" H 2250 1450 50  0000 L CNN
F 2 "Resistor_SMD:R_1206_3216Metric_Pad1.30x1.75mm_HandSolder" V 2240 1490 50  0001 C CNN
F 3 "~" H 2200 1500 50  0001 C CNN
F 4 "RMCF1206JT5K10CT-ND" H 2200 1500 50  0001 C CNN "Digikey_NO"
	1    2200 1500
	1    0    0    -1  
$EndComp
$Comp
L power:GND #PWR04
U 1 1 62716063
P 2200 2100
F 0 "#PWR04" H 2200 1850 50  0001 C CNN
F 1 "GND" H 2205 1927 50  0000 C CNN
F 2 "" H 2200 2100 50  0001 C CNN
F 3 "" H 2200 2100 50  0001 C CNN
	1    2200 2100
	1    0    0    -1  
$EndComp
Wire Wire Line
	1800 1100 1800 1350
Wire Wire Line
	2200 2000 2200 2100
Wire Wire Line
	2200 1350 1800 1350
Connection ~ 1800 1350
Wire Wire Line
	1800 1350 1800 1650
Wire Wire Line
	1950 2500 1950 1650
Wire Wire Line
	1950 1650 1800 1650
Connection ~ 1800 1650
Wire Wire Line
	1800 1650 1800 1750
Wire Wire Line
	3050 4500 3050 4700
Connection ~ 3050 4500
Wire Wire Line
	3350 4500 3050 4500
Wire Wire Line
	3050 4350 3050 4500
Wire Wire Line
	3350 5300 3350 5150
$Comp
L power:GND #PWR019
U 1 1 62787AD7
P 3350 5300
F 0 "#PWR019" H 3350 5050 50  0001 C CNN
F 1 "GND" H 3355 5127 50  0000 C CNN
F 2 "" H 3350 5300 50  0001 C CNN
F 3 "" H 3350 5300 50  0001 C CNN
	1    3350 5300
	1    0    0    -1  
$EndComp
$Comp
L Device:LED D2
U 1 1 627743A3
P 3350 5000
F 0 "D2" V 3400 4800 50  0000 C CNN
F 1 "LED" V 3300 4800 50  0000 C CNN
F 2 "LED_THT:LED_D3.0mm" H 3350 5000 50  0001 C CNN
F 3 "~" H 3350 5000 50  0001 C CNN
F 4 "732-5006-ND" H 3350 5000 50  0001 C CNN "Digikey_NO"
	1    3350 5000
	0    -1   -1   0   
$EndComp
$Comp
L Device:R_US R12
U 1 1 62773DA3
P 3350 4650
F 0 "R12" H 3250 4600 50  0000 C CNN
F 1 "1.8K" H 3200 4700 50  0000 C CNN
F 2 "Resistor_SMD:R_1206_3216Metric_Pad1.30x1.75mm_HandSolder" V 3390 4640 50  0001 C CNN
F 3 "~" H 3350 4650 50  0001 C CNN
F 4 "A129813CT-ND" H 3350 4650 50  0001 C CNN "Digikey_NO"
	1    3350 4650
	-1   0    0    1   
$EndComp
$Comp
L power:+5V #PWR013
U 1 1 6261E2AE
P 3050 4350
F 0 "#PWR013" H 3050 4200 50  0001 C CNN
F 1 "+5V" H 3065 4523 50  0000 C CNN
F 2 "" H 3050 4350 50  0001 C CNN
F 3 "" H 3050 4350 50  0001 C CNN
	1    3050 4350
	1    0    0    -1  
$EndComp
$Comp
L power:GND #PWR016
U 1 1 6261CA7A
P 1900 5100
F 0 "#PWR016" H 1900 4850 50  0001 C CNN
F 1 "GND" H 1905 4927 50  0000 C CNN
F 2 "" H 1900 5100 50  0001 C CNN
F 3 "" H 1900 5100 50  0001 C CNN
	1    1900 5100
	1    0    0    -1  
$EndComp
$Comp
L power:GND #PWR017
U 1 1 6261C503
P 2400 5050
F 0 "#PWR017" H 2400 4800 50  0001 C CNN
F 1 "GND" H 2405 4877 50  0000 C CNN
F 2 "" H 2400 5050 50  0001 C CNN
F 3 "" H 2400 5050 50  0001 C CNN
	1    2400 5050
	1    0    0    -1  
$EndComp
$Comp
L power:GND #PWR018
U 1 1 6261C132
P 2900 5100
F 0 "#PWR018" H 2900 4850 50  0001 C CNN
F 1 "GND" H 2905 4927 50  0000 C CNN
F 2 "" H 2900 5100 50  0001 C CNN
F 3 "" H 2900 5100 50  0001 C CNN
	1    2900 5100
	1    0    0    -1  
$EndComp
$Comp
L Regulator_Linear:LM7805_TO220 U2
U 1 1 62304B70
P 2400 4700
F 0 "U2" H 2400 4942 50  0000 C CNN
F 1 "LM7805_TO220" H 2400 4851 50  0000 C CNN
F 2 "Package_TO_SOT_THT:TO-220-3_Vertical" H 2400 4925 50  0001 C CIN
F 3 "https://www.onsemi.cn/PowerSolutions/document/MC7800-D.PDF" H 2400 4650 50  0001 C CNN
F 4 "BA17805CP-E2CT-ND" H 2400 4700 50  0001 C CNN "Digikey_NO"
	1    2400 4700
	1    0    0    -1  
$EndComp
$Comp
L Device:C C3
U 1 1 626131D6
P 2900 4900
F 0 "C3" H 3015 4946 50  0000 L CNN
F 1 "0.1uF" H 3015 4855 50  0000 L CNN
F 2 "Capacitor_SMD:C_0805_2012Metric_Pad1.18x1.45mm_HandSolder" H 2938 4750 50  0001 C CNN
F 3 "~" H 2900 4900 50  0001 C CNN
F 4 "478-10836-1-ND" H 2900 4900 50  0001 C CNN "Digikey_NO"
	1    2900 4900
	1    0    0    -1  
$EndComp
$Comp
L Device:C C2
U 1 1 6261139A
P 1900 4900
F 0 "C2" H 1700 4950 50  0000 L CNN
F 1 "0.33uF" H 1550 4850 50  0000 L CNN
F 2 "Capacitor_SMD:C_0805_2012Metric_Pad1.18x1.45mm_HandSolder" H 1938 4750 50  0001 C CNN
F 3 "~" H 1900 4900 50  0001 C CNN
F 4 "1276-1797-1-ND" H 1900 4900 50  0001 C CNN "Digikey_NO"
	1    1900 4900
	1    0    0    -1  
$EndComp
$Comp
L power:+12V #PWR015
U 1 1 62610AA5
P 1700 4700
F 0 "#PWR015" H 1700 4550 50  0001 C CNN
F 1 "+12V" H 1715 4873 50  0000 C CNN
F 2 "" H 1700 4700 50  0001 C CNN
F 3 "" H 1700 4700 50  0001 C CNN
	1    1700 4700
	1    0    0    -1  
$EndComp
Text Notes 2200 4350 0    50   ~ 0
5V Regulator
Wire Wire Line
	3700 6900 3700 7000
Connection ~ 3400 6200
Wire Wire Line
	3400 6000 3400 6200
Wire Wire Line
	3400 6200 3400 6300
Wire Wire Line
	3700 6200 3400 6200
$Comp
L power:GND #PWR026
U 1 1 6279D17B
P 3700 7000
F 0 "#PWR026" H 3700 6750 50  0001 C CNN
F 1 "GND" H 3705 6827 50  0000 C CNN
F 2 "" H 3700 7000 50  0001 C CNN
F 3 "" H 3700 7000 50  0001 C CNN
	1    3700 7000
	1    0    0    -1  
$EndComp
$Comp
L Device:LED D3
U 1 1 6279C986
P 3700 6750
F 0 "D3" V 3800 6600 50  0000 C CNN
F 1 "LED" V 3700 6600 50  0000 C CNN
F 2 "LED_THT:LED_D3.0mm" H 3700 6750 50  0001 C CNN
F 3 "~" H 3700 6750 50  0001 C CNN
F 4 "732-5006-ND" H 3700 6750 50  0001 C CNN "Digikey_NO"
	1    3700 6750
	0    -1   -1   0   
$EndComp
$Comp
L Device:R_US R13
U 1 1 6279C2F3
P 3700 6350
F 0 "R13" H 3550 6300 50  0000 C CNN
F 1 "1K" H 3550 6400 50  0000 C CNN
F 2 "Resistor_SMD:R_0805_2012Metric_Pad1.20x1.40mm_HandSolder" V 3740 6340 50  0001 C CNN
F 3 "~" H 3700 6350 50  0001 C CNN
F 4 "RMCF0805JT1K00CT-ND" H 3700 6350 50  0001 C CNN "Digikey_NO"
	1    3700 6350
	-1   0    0    1   
$EndComp
Connection ~ 2850 6300
$Comp
L power:GND #PWR024
U 1 1 6266482D
P 1700 6750
F 0 "#PWR024" H 1700 6500 50  0001 C CNN
F 1 "GND" H 1705 6577 50  0000 C CNN
F 2 "" H 1700 6750 50  0001 C CNN
F 3 "" H 1700 6750 50  0001 C CNN
	1    1700 6750
	1    0    0    -1  
$EndComp
$Comp
L power:GND #PWR027
U 1 1 626644A6
P 2300 7100
F 0 "#PWR027" H 2300 6850 50  0001 C CNN
F 1 "GND" H 2305 6927 50  0000 C CNN
F 2 "" H 2300 7100 50  0001 C CNN
F 3 "" H 2300 7100 50  0001 C CNN
	1    2300 7100
	1    0    0    -1  
$EndComp
$Comp
L power:GND #PWR025
U 1 1 6266349F
P 3200 6750
F 0 "#PWR025" H 3200 6500 50  0001 C CNN
F 1 "GND" H 3205 6577 50  0000 C CNN
F 2 "" H 3200 6750 50  0001 C CNN
F 3 "" H 3200 6750 50  0001 C CNN
	1    3200 6750
	1    0    0    -1  
$EndComp
Connection ~ 2300 6750
Wire Wire Line
	2550 6750 2300 6750
Wire Wire Line
	2300 6600 2300 6750
$Comp
L Device:R_US R15
U 1 1 6265E9BD
P 2300 6900
F 0 "R15" H 2450 6950 50  0000 C CNN
F 1 "1.5K" H 2450 6850 50  0000 C CNN
F 2 "Resistor_SMD:R_0805_2012Metric_Pad1.20x1.40mm_HandSolder" V 2340 6890 50  0001 C CNN
F 3 "~" H 2300 6900 50  0001 C CNN
F 4 "A130135CT-ND" H 2300 6900 50  0001 C CNN "Digikey_NO"
	1    2300 6900
	1    0    0    -1  
$EndComp
Wire Wire Line
	2850 6300 2850 6750
Wire Wire Line
	2600 6300 2850 6300
$Comp
L Device:R_US R14
U 1 1 62636EFB
P 2700 6750
F 0 "R14" V 2500 6750 50  0000 C CNN
F 1 "1.2K" V 2600 6750 50  0000 C CNN
F 2 "Resistor_SMD:R_0805_2012Metric_Pad1.20x1.40mm_HandSolder" V 2740 6740 50  0001 C CNN
F 3 "~" H 2700 6750 50  0001 C CNN
F 4 "A126346CT-ND" H 2700 6750 50  0001 C CNN "Digikey_NO"
	1    2700 6750
	0    1    1    0   
$EndComp
$Comp
L Device:C C4
U 1 1 6262DD46
P 1700 6550
F 0 "C4" H 1450 6600 50  0000 L CNN
F 1 "0.1uF" H 1400 6500 50  0000 L CNN
F 2 "Capacitor_SMD:C_0805_2012Metric_Pad1.18x1.45mm_HandSolder" H 1738 6400 50  0001 C CNN
F 3 "~" H 1700 6550 50  0001 C CNN
F 4 "478-10836-1-ND" H 1700 6550 50  0001 C CNN "Digikey_NO"
	1    1700 6550
	1    0    0    -1  
$EndComp
$Comp
L Device:C C5
U 1 1 6262D5C6
P 3200 6550
F 0 "C5" H 3315 6596 50  0000 L CNN
F 1 "1uF" H 3315 6505 50  0000 L CNN
F 2 "Capacitor_SMD:C_0805_2012Metric_Pad1.18x1.45mm_HandSolder" H 3238 6400 50  0001 C CNN
F 3 "~" H 3200 6550 50  0001 C CNN
F 4 "1276-1026-1-ND" H 3200 6550 50  0001 C CNN "Digikey_NO"
	1    3200 6550
	1    0    0    -1  
$EndComp
$Comp
L power:+12V #PWR023
U 1 1 6262C351
P 1500 6300
F 0 "#PWR023" H 1500 6150 50  0001 C CNN
F 1 "+12V" H 1515 6473 50  0000 C CNN
F 2 "" H 1500 6300 50  0001 C CNN
F 3 "" H 1500 6300 50  0001 C CNN
	1    1500 6300
	1    0    0    -1  
$EndComp
Text Notes 1950 5800 0    50   ~ 0
Adjustable Regulator
$Comp
L Regulator_Linear:LM317L_SO8 U4
U 1 1 62307444
P 2300 6300
F 0 "U4" H 2300 6700 50  0000 C CNN
F 1 "LM317L_SO8" H 2300 6600 50  0000 C CNN
F 2 "Package_SO:SOIC-8_3.9x4.9mm_P1.27mm" H 2300 6500 50  0001 C CIN
F 3 "ti.com/lit/ds/symlink/lm317l.pdf?HQS=dis-dk-null-digikeymode-dsf-pf-null-wwe&ts=1652351949486&ref_url=https%253A%252F%252Fwww.ti.com%252Fgeneral%252Fdocs%252Fsuppproductinfo.tsp%253FdistId%253D10%2526gotoUrl%253Dhttps%253A%252F%252Fwww.ti.com%252Flit%252Fgpn%252Flm317l" H 2300 6100 50  0001 C CNN
F 4 "296-26092-5-ND" H 2300 6450 50  0000 C CNN "Digikey_NO"
	1    2300 6300
	1    0    0    -1  
$EndComp
Wire Wire Line
	9400 5800 9400 6000
Wire Wire Line
	9400 5350 9400 5500
Wire Wire Line
	9250 5350 9400 5350
$Comp
L power:GND #PWR033
U 1 1 626D6D06
P 9400 6000
F 0 "#PWR033" H 9400 5750 50  0001 C CNN
F 1 "GND" H 9405 5827 50  0000 C CNN
F 2 "" H 9400 6000 50  0001 C CNN
F 3 "" H 9400 6000 50  0001 C CNN
	1    9400 6000
	1    0    0    -1  
$EndComp
Wire Wire Line
	8750 6200 8750 6300
Wire Wire Line
	8200 5950 8050 5950
$Comp
L power:GND #PWR032
U 1 1 626B8085
P 8750 6300
F 0 "#PWR032" H 8750 6050 50  0001 C CNN
F 1 "GND" H 8755 6127 50  0000 C CNN
F 2 "" H 8750 6300 50  0001 C CNN
F 3 "" H 8750 6300 50  0001 C CNN
	1    8750 6300
	1    0    0    -1  
$EndComp
$Comp
L power:GND #PWR031
U 1 1 626B7AC9
P 8050 6100
F 0 "#PWR031" H 8050 5850 50  0001 C CNN
F 1 "GND" H 8055 5927 50  0000 C CNN
F 2 "" H 8050 6100 50  0001 C CNN
F 3 "" H 8050 6100 50  0001 C CNN
	1    8050 6100
	1    0    0    -1  
$EndComp
$Comp
L my_displays:ELW0501AB U5
U 1 1 6250D6D7
P 8750 5600
F 0 "U5" H 9900 5950 50  0000 L CNN
F 1 "ELW0501AB" H 9750 5850 50  0000 L CNN
F 2 "frontboard:Iriso_Connector_NEW" H 8750 5600 50  0001 C CNN
F 3 "" H 8750 5600 50  0001 C CNN
F 4 "OMIT" H 8750 5600 50  0001 C CNN "Digikey_NO"
	1    8750 5600
	1    0    0    -1  
$EndComp
$Comp
L Device:R_US R16
U 1 1 626D43BE
P 9400 5650
F 0 "R16" H 9468 5696 50  0000 L CNN
F 1 "3.9K" H 9468 5605 50  0000 L CNN
F 2 "Resistor_SMD:R_0805_2012Metric_Pad1.20x1.40mm_HandSolder" V 9440 5640 50  0001 C CNN
F 3 "~" H 9400 5650 50  0001 C CNN
F 4 "A126369CT-ND" H 9400 5650 50  0001 C CNN "Digikey_NO"
	1    9400 5650
	1    0    0    -1  
$EndComp
$Comp
L power:GND #PWR021
U 1 1 62541A01
P 10300 4250
F 0 "#PWR021" H 10300 4000 50  0001 C CNN
F 1 "GND" H 10305 4077 50  0000 C CNN
F 2 "" H 10300 4250 50  0001 C CNN
F 3 "" H 10300 4250 50  0001 C CNN
	1    10300 4250
	1    0    0    -1  
$EndComp
$Comp
L power:GND #PWR020
U 1 1 625670A5
P 10150 4250
F 0 "#PWR020" H 10150 4000 50  0001 C CNN
F 1 "GND" H 10155 4077 50  0000 C CNN
F 2 "" H 10150 4250 50  0001 C CNN
F 3 "" H 10150 4250 50  0001 C CNN
	1    10150 4250
	1    0    0    -1  
$EndComp
$Comp
L my_displays:OLED_breakout U3
U 1 1 623AA395
P 10200 3650
F 0 "U3" H 9750 4400 50  0000 C CNN
F 1 "OLED_breakout" H 9750 4300 50  0000 C CNN
F 2 "frontboard:DIP-10_W15.24mm" H 10200 3650 50  0001 C CNN
F 3 "" H 10200 3650 50  0001 C CNN
F 4 "1212-1062-ND" H 10200 3650 50  0001 C CNN "Digikey_NO"
	1    10200 3650
	1    0    0    -1  
$EndComp
$Comp
L Device:C C8
U 1 1 624B9A98
P 10900 3050
F 0 "C8" H 11015 3096 50  0000 L CNN
F 1 "1uF" H 11015 3005 50  0000 L CNN
F 2 "Capacitor_SMD:C_0805_2012Metric_Pad1.18x1.45mm_HandSolder" H 10938 2900 50  0001 C CNN
F 3 "~" H 10900 3050 50  0001 C CNN
F 4 "1276-1026-1-ND" H 10900 3050 50  0001 C CNN "Digikey_NO"
	1    10900 3050
	1    0    0    -1  
$EndComp
$Comp
L power:GND #PWR030
U 1 1 624BB7E1
P 10900 3300
F 0 "#PWR030" H 10900 3050 50  0001 C CNN
F 1 "GND" H 10905 3127 50  0000 C CNN
F 2 "" H 10900 3300 50  0001 C CNN
F 3 "" H 10900 3300 50  0001 C CNN
	1    10900 3300
	1    0    0    -1  
$EndComp
Wire Wire Line
	10900 3200 10900 3300
Wire Wire Line
	10900 2900 10200 2900
Wire Wire Line
	10200 2800 10200 2900
Connection ~ 10200 2900
Wire Wire Line
	10200 2900 10200 3050
$Comp
L power:GND #PWR012
U 1 1 623E328A
P 4800 3700
F 0 "#PWR012" H 4800 3450 50  0001 C CNN
F 1 "GND" H 4805 3527 50  0000 C CNN
F 2 "" H 4800 3700 50  0001 C CNN
F 3 "" H 4800 3700 50  0001 C CNN
	1    4800 3700
	1    0    0    -1  
$EndComp
$Comp
L Device:R_US R11
U 1 1 62380C95
P 4800 3550
F 0 "R11" H 4900 3600 50  0000 C CNN
F 1 "1.3K" H 4950 3500 50  0000 C CNN
F 2 "Resistor_SMD:R_0805_2012Metric_Pad1.20x1.40mm_HandSolder" V 4840 3540 50  0001 C CNN
F 3 "~" H 4800 3550 50  0001 C CNN
F 4 "RNCP0805FTD1K30CT-ND" H 4800 3550 50  0001 C CNN "Digikey_NO"
	1    4800 3550
	1    0    0    -1  
$EndComp
$Comp
L Device:R_US R6
U 1 1 62380827
P 4800 3050
F 0 "R6" H 4700 3000 50  0000 C CNN
F 1 "1K" H 4650 3100 50  0000 C CNN
F 2 "Resistor_SMD:R_0805_2012Metric_Pad1.20x1.40mm_HandSolder" V 4840 3040 50  0001 C CNN
F 3 "~" H 4800 3050 50  0001 C CNN
F 4 "RMCF0805JT1K00CT-ND" H 4800 3050 50  0001 C CNN "Digikey_NO"
	1    4800 3050
	-1   0    0    1   
$EndComp
$Comp
L Device:R_US R10
U 1 1 62427B51
P 5200 3450
F 0 "R10" H 5300 3500 50  0000 C CNN
F 1 "1.3K" H 5350 3400 50  0000 C CNN
F 2 "Resistor_SMD:R_0805_2012Metric_Pad1.20x1.40mm_HandSolder" V 5240 3440 50  0001 C CNN
F 3 "~" H 5200 3450 50  0001 C CNN
F 4 "RNCP0805FTD1K30CT-ND" H 5200 3450 50  0001 C CNN "Digikey_NO"
	1    5200 3450
	1    0    0    -1  
$EndComp
$Comp
L power:GND #PWR011
U 1 1 62428048
P 5200 3600
F 0 "#PWR011" H 5200 3350 50  0001 C CNN
F 1 "GND" H 5205 3427 50  0000 C CNN
F 2 "" H 5200 3600 50  0001 C CNN
F 3 "" H 5200 3600 50  0001 C CNN
	1    5200 3600
	1    0    0    -1  
$EndComp
$Comp
L Device:R_US R9
U 1 1 6241F838
P 5600 3350
F 0 "R9" H 5700 3400 50  0000 C CNN
F 1 "1.3K" H 5750 3300 50  0000 C CNN
F 2 "Resistor_SMD:R_0805_2012Metric_Pad1.20x1.40mm_HandSolder" V 5640 3340 50  0001 C CNN
F 3 "~" H 5600 3350 50  0001 C CNN
F 4 "RNCP0805FTD1K30CT-ND" H 5600 3350 50  0001 C CNN "Digikey_NO"
	1    5600 3350
	1    0    0    -1  
$EndComp
$Comp
L power:GND #PWR010
U 1 1 6241FF78
P 5600 3500
F 0 "#PWR010" H 5600 3250 50  0001 C CNN
F 1 "GND" H 5605 3327 50  0000 C CNN
F 2 "" H 5600 3500 50  0001 C CNN
F 3 "" H 5600 3500 50  0001 C CNN
	1    5600 3500
	1    0    0    -1  
$EndComp
$Comp
L power:GND #PWR09
U 1 1 624299AC
P 5950 3400
F 0 "#PWR09" H 5950 3150 50  0001 C CNN
F 1 "GND" H 5955 3227 50  0000 C CNN
F 2 "" H 5950 3400 50  0001 C CNN
F 3 "" H 5950 3400 50  0001 C CNN
	1    5950 3400
	1    0    0    -1  
$EndComp
$Comp
L Device:R_US R8
U 1 1 624291E6
P 5950 3250
F 0 "R8" H 6050 3300 50  0000 C CNN
F 1 "1.3K" H 6100 3200 50  0000 C CNN
F 2 "Resistor_SMD:R_0805_2012Metric_Pad1.20x1.40mm_HandSolder" V 5990 3240 50  0001 C CNN
F 3 "~" H 5950 3250 50  0001 C CNN
F 4 "RNCP0805FTD1K30CT-ND" H 5950 3250 50  0001 C CNN "Digikey_NO"
	1    5950 3250
	1    0    0    -1  
$EndComp
$Comp
L power:GND #PWR08
U 1 1 6242960A
P 6300 3300
F 0 "#PWR08" H 6300 3050 50  0001 C CNN
F 1 "GND" H 6305 3127 50  0000 C CNN
F 2 "" H 6300 3300 50  0001 C CNN
F 3 "" H 6300 3300 50  0001 C CNN
	1    6300 3300
	1    0    0    -1  
$EndComp
$Comp
L Device:R_US R7
U 1 1 62428D1A
P 6300 3150
F 0 "R7" H 6400 3200 50  0000 C CNN
F 1 "1.3K" H 6450 3100 50  0000 C CNN
F 2 "Resistor_SMD:R_0805_2012Metric_Pad1.20x1.40mm_HandSolder" V 6340 3140 50  0001 C CNN
F 3 "~" H 6300 3150 50  0001 C CNN
F 4 "RNCP0805FTD1K30CT-ND" H 6300 3150 50  0001 C CNN "Digikey_NO"
	1    6300 3150
	1    0    0    -1  
$EndComp
$Comp
L Device:R_US R5
U 1 1 624274C5
P 5200 2950
F 0 "R5" H 5100 2900 50  0000 C CNN
F 1 "1K" H 5050 3000 50  0000 C CNN
F 2 "Resistor_SMD:R_0805_2012Metric_Pad1.20x1.40mm_HandSolder" V 5240 2940 50  0001 C CNN
F 3 "~" H 5200 2950 50  0001 C CNN
F 4 "RMCF0805JT1K00CT-ND" H 5200 2950 50  0001 C CNN "Digikey_NO"
	1    5200 2950
	-1   0    0    1   
$EndComp
$Comp
L Device:R_US R4
U 1 1 6241EE4C
P 5600 2850
F 0 "R4" H 5500 2800 50  0000 C CNN
F 1 "1K" H 5450 2900 50  0000 C CNN
F 2 "Resistor_SMD:R_0805_2012Metric_Pad1.20x1.40mm_HandSolder" V 5640 2840 50  0001 C CNN
F 3 "~" H 5600 2850 50  0001 C CNN
F 4 "RMCF0805JT1K00CT-ND" H 5600 2850 50  0001 C CNN "Digikey_NO"
	1    5600 2850
	-1   0    0    1   
$EndComp
$Comp
L Device:R_US R3
U 1 1 62428871
P 5950 2750
F 0 "R3" H 5850 2700 50  0000 C CNN
F 1 "1K" H 5800 2800 50  0000 C CNN
F 2 "Resistor_SMD:R_0805_2012Metric_Pad1.20x1.40mm_HandSolder" V 5990 2740 50  0001 C CNN
F 3 "~" H 5950 2750 50  0001 C CNN
F 4 "RMCF0805JT1K00CT-ND" H 5950 2750 50  0001 C CNN "Digikey_NO"
	1    5950 2750
	-1   0    0    1   
$EndComp
$Comp
L Device:R_US R2
U 1 1 624283B1
P 6300 2650
F 0 "R2" H 6200 2600 50  0000 C CNN
F 1 "1K" H 6150 2700 50  0000 C CNN
F 2 "Resistor_SMD:R_0805_2012Metric_Pad1.20x1.40mm_HandSolder" V 6340 2640 50  0001 C CNN
F 3 "~" H 6300 2650 50  0001 C CNN
F 4 "RMCF0805JT1K00CT-ND" H 6300 2650 50  0001 C CNN "Digikey_NO"
	1    6300 2650
	-1   0    0    1   
$EndComp
$Comp
L my_displays:HCMS-2903 U1
U 1 1 622FF566
P 8000 1750
F 0 "U1" H 8750 1200 50  0000 C CNN
F 1 "HCMS-2903" H 8800 1050 50  0000 C CNN
F 2 "Package_DIP:DIP-12_W7.62mm" H 8000 1750 50  0001 C CNN
F 3 "https://docs.broadcom.com/doc/HCMS-29xx-Series-High-Performance-CMOS-5-x-7-Alphanumeric-Displays" H 8000 1750 50  0001 C CNN
F 4 "SA143000" H 8000 1750 50  0001 C CNN "Digikey_NO"
	1    8000 1750
	1    0    0    -1  
$EndComp
Wire Wire Line
	7250 1500 7250 1600
Wire Wire Line
	7250 1200 7850 1200
Wire Wire Line
	8750 1500 8750 1600
Wire Wire Line
	8150 1200 8750 1200
$Comp
L power:GND #PWR028
U 1 1 624A3605
P 7250 1600
F 0 "#PWR028" H 7250 1350 50  0001 C CNN
F 1 "GND" H 7255 1427 50  0000 C CNN
F 2 "" H 7250 1600 50  0001 C CNN
F 3 "" H 7250 1600 50  0001 C CNN
	1    7250 1600
	1    0    0    -1  
$EndComp
$Comp
L power:GND #PWR029
U 1 1 624A31F0
P 8750 1600
F 0 "#PWR029" H 8750 1350 50  0001 C CNN
F 1 "GND" H 8755 1427 50  0000 C CNN
F 2 "" H 8750 1600 50  0001 C CNN
F 3 "" H 8750 1600 50  0001 C CNN
	1    8750 1600
	1    0    0    -1  
$EndComp
Wire Wire Line
	7850 1200 7850 1350
Connection ~ 7850 1200
Wire Wire Line
	8150 1200 8150 1350
Connection ~ 8150 1200
$Comp
L Device:C C6
U 1 1 6249AB0C
P 7250 1350
F 0 "C6" H 7365 1396 50  0000 L CNN
F 1 "1uF" H 7365 1305 50  0000 L CNN
F 2 "Capacitor_SMD:C_0805_2012Metric_Pad1.18x1.45mm_HandSolder" H 7288 1200 50  0001 C CNN
F 3 "~" H 7250 1350 50  0001 C CNN
F 4 "1276-1026-1-ND" H 7250 1350 50  0001 C CNN "Digikey_NO"
	1    7250 1350
	1    0    0    -1  
$EndComp
$Comp
L Device:C C7
U 1 1 62499391
P 8750 1350
F 0 "C7" H 8865 1396 50  0000 L CNN
F 1 "1uF" H 8865 1305 50  0000 L CNN
F 2 "Capacitor_SMD:C_0805_2012Metric_Pad1.18x1.45mm_HandSolder" H 8788 1200 50  0001 C CNN
F 3 "~" H 8750 1350 50  0001 C CNN
F 4 "1276-1026-1-ND" H 8750 1350 50  0001 C CNN "Digikey_NO"
	1    8750 1350
	1    0    0    -1  
$EndComp
Wire Wire Line
	7850 1100 7850 1200
Wire Wire Line
	8150 1100 8150 1200
$Comp
L power:+5V #PWR02
U 1 1 626AB880
P 7850 1100
F 0 "#PWR02" H 7850 950 50  0001 C CNN
F 1 "+5V" H 7865 1273 50  0000 C CNN
F 2 "" H 7850 1100 50  0001 C CNN
F 3 "" H 7850 1100 50  0001 C CNN
	1    7850 1100
	1    0    0    -1  
$EndComp
$Comp
L power:+5V #PWR03
U 1 1 626AB18B
P 8150 1100
F 0 "#PWR03" H 8150 950 50  0001 C CNN
F 1 "+5V" H 8165 1273 50  0000 C CNN
F 2 "" H 8150 1100 50  0001 C CNN
F 3 "" H 8150 1100 50  0001 C CNN
	1    8150 1100
	1    0    0    -1  
$EndComp
Text Notes 9250 1250 0    50   ~ 0
not sure where to connect BL
Wire Wire Line
	7400 2600 7400 2950
$Comp
L power:GND #PWR06
U 1 1 625D95CB
P 7400 2950
F 0 "#PWR06" H 7400 2700 50  0001 C CNN
F 1 "GND" H 7405 2777 50  0000 C CNN
F 2 "" H 7400 2950 50  0001 C CNN
F 3 "" H 7400 2950 50  0001 C CNN
	1    7400 2950
	1    0    0    -1  
$EndComp
$Comp
L power:GND #PWR07
U 1 1 623BE326
P 8000 3000
F 0 "#PWR07" H 8000 2750 50  0001 C CNN
F 1 "GND" H 8005 2827 50  0000 C CNN
F 2 "" H 8000 3000 50  0001 C CNN
F 3 "" H 8000 3000 50  0001 C CNN
	1    8000 3000
	1    0    0    -1  
$EndComp
Text Notes 9350 1100 0    50   ~ 0
4-Character LED Display
NoConn ~ 7400 1800
Wire Wire Line
	7200 2300 7200 2500
Wire Wire Line
	7200 2500 7400 2500
Wire Wire Line
	10300 4150 10300 4250
Wire Wire Line
	10150 4150 10150 4250
Wire Wire Line
	4800 2900 4400 2900
Wire Wire Line
	5600 2700 4400 2700
Wire Wire Line
	8050 5950 8050 6100
Wire Wire Line
	4800 3200 4800 3300
Wire Wire Line
	4800 3300 4600 3300
Connection ~ 4800 3300
Wire Wire Line
	4800 3300 4800 3400
Wire Wire Line
	5200 3100 5200 3200
Connection ~ 5200 3200
Wire Wire Line
	5200 3200 5200 3300
Wire Wire Line
	5200 2800 4400 2800
Wire Wire Line
	5050 3200 5200 3200
Wire Wire Line
	5600 3000 5600 3100
Wire Wire Line
	5600 3100 5500 3100
Connection ~ 5600 3100
Wire Wire Line
	5600 3100 5600 3200
Wire Wire Line
	5950 2900 5950 3000
Wire Wire Line
	6300 2800 6300 2900
Wire Wire Line
	5950 2600 4400 2600
Wire Wire Line
	5950 3000 5850 3000
Connection ~ 5950 3000
Wire Wire Line
	5950 3000 5950 3100
Wire Wire Line
	6300 2500 4400 2500
Wire Wire Line
	6300 2900 6200 2900
Connection ~ 6300 2900
Wire Wire Line
	6300 2900 6300 3000
Wire Wire Line
	8600 2050 9200 2050
Wire Wire Line
	2500 2500 1950 2500
Wire Wire Line
	4400 1900 7400 1900
Wire Wire Line
	4400 2000 7400 2000
Wire Wire Line
	4400 2100 7400 2100
Wire Wire Line
	4400 2200 7400 2200
Wire Wire Line
	4400 2300 7200 2300
$Comp
L arduino_shieldsNCL:ARDUINO_SHIELD SHIELD1
U 1 1 622F73D2
P 3450 2400
F 0 "SHIELD1" H 3450 3487 60  0000 C CNN
F 1 "ARDUINO_SHIELD" H 3450 3381 60  0000 C CNN
F 2 "frontboard:ARDUINO_SHIELD" H 3450 2400 50  0001 C CNN
F 3 "http://suddendocs.samtec.com/catalog_english/ssa.pdf" H 3450 2400 50  0001 C CNN
F 4 "SAM1125-32-ND" H 3450 2400 50  0000 C CNN "Digikey_NO"
	1    3450 2400
	1    0    0    -1  
$EndComp
Wire Wire Line
	9200 2050 9200 750 
$Comp
L power:+12V #PWR036
U 1 1 625100B2
P 8950 4400
F 0 "#PWR036" H 8950 4250 50  0001 C CNN
F 1 "+12V" H 8965 4573 50  0000 C CNN
F 2 "" H 8950 4400 50  0001 C CNN
F 3 "" H 8950 4400 50  0001 C CNN
	1    8950 4400
	1    0    0    -1  
$EndComp
$Comp
L Device:C C9
U 1 1 6251417D
P 8150 4600
F 0 "C9" H 8265 4646 50  0000 L CNN
F 1 "1uF" H 8265 4555 50  0000 L CNN
F 2 "Capacitor_SMD:C_0805_2012Metric_Pad1.18x1.45mm_HandSolder" H 8188 4450 50  0001 C CNN
F 3 "~" H 8150 4600 50  0001 C CNN
F 4 "1276-1026-1-ND" H 8150 4600 50  0001 C CNN "Digikey_NO"
	1    8150 4600
	1    0    0    -1  
$EndComp
Wire Wire Line
	8550 4400 8550 4450
Wire Wire Line
	8150 4450 8550 4450
$Comp
L power:GND #PWR034
U 1 1 6251F849
P 8150 4850
F 0 "#PWR034" H 8150 4600 50  0001 C CNN
F 1 "GND" H 8155 4677 50  0000 C CNN
F 2 "" H 8150 4850 50  0001 C CNN
F 3 "" H 8150 4850 50  0001 C CNN
	1    8150 4850
	1    0    0    -1  
$EndComp
Connection ~ 8550 4450
Wire Wire Line
	8550 4450 8550 4800
Wire Wire Line
	8150 4750 8150 4850
$Comp
L Device:C C10
U 1 1 625427EA
P 9400 4650
F 0 "C10" H 9515 4696 50  0000 L CNN
F 1 "0.1uF" H 9515 4605 50  0000 L CNN
F 2 "Capacitor_SMD:C_0805_2012Metric_Pad1.18x1.45mm_HandSolder" H 9438 4500 50  0001 C CNN
F 3 "~" H 9400 4650 50  0001 C CNN
F 4 "478-10836-1-ND" H 9400 4650 50  0001 C CNN "Digikey_NO"
	1    9400 4650
	1    0    0    -1  
$EndComp
$Comp
L power:GND #PWR037
U 1 1 625431E2
P 9400 4900
F 0 "#PWR037" H 9400 4650 50  0001 C CNN
F 1 "GND" H 9405 4727 50  0000 C CNN
F 2 "" H 9400 4900 50  0001 C CNN
F 3 "" H 9400 4900 50  0001 C CNN
	1    9400 4900
	1    0    0    -1  
$EndComp
Wire Wire Line
	9400 4900 9400 4800
Wire Wire Line
	8950 4800 8950 4550
Wire Wire Line
	8750 4800 8750 4550
Wire Wire Line
	8750 4550 8950 4550
Connection ~ 8950 4550
Wire Wire Line
	9400 4500 8950 4500
Wire Wire Line
	8950 4400 8950 4500
Connection ~ 8950 4500
Wire Wire Line
	8950 4500 8950 4550
Wire Wire Line
	8200 5800 7900 5800
Wire Wire Line
	4600 3300 4600 5800
Wire Wire Line
	8200 5650 7700 5650
Wire Wire Line
	5050 3200 5050 5650
Wire Wire Line
	8200 5500 7500 5500
Wire Wire Line
	5500 3100 5500 5500
Wire Wire Line
	8200 5350 7100 5350
Wire Wire Line
	5850 3000 5850 5350
Wire Wire Line
	8200 5200 7300 5200
Wire Wire Line
	6200 2900 6200 5200
Wire Wire Line
	9700 3300 7100 3300
Wire Wire Line
	7100 3300 7100 5350
Connection ~ 7100 5350
Wire Wire Line
	7100 5350 5850 5350
Wire Wire Line
	9700 3450 7300 3450
Wire Wire Line
	7300 3450 7300 5200
Connection ~ 7300 5200
Wire Wire Line
	7300 5200 6200 5200
Wire Wire Line
	9700 3600 7500 3600
Wire Wire Line
	7500 3600 7500 5500
Connection ~ 7500 5500
Wire Wire Line
	7500 5500 5500 5500
Wire Wire Line
	9700 3750 7700 3750
Wire Wire Line
	7700 3750 7700 5650
Connection ~ 7700 5650
Wire Wire Line
	7700 5650 5050 5650
Wire Wire Line
	9700 3900 7900 3900
Wire Wire Line
	7900 3900 7900 5800
Connection ~ 7900 5800
Wire Wire Line
	7900 5800 4600 5800
Wire Wire Line
	2850 6300 3200 6300
Wire Wire Line
	3200 6400 3200 6300
Connection ~ 3200 6300
Wire Wire Line
	3200 6300 3400 6300
Wire Wire Line
	3200 6700 3200 6750
Wire Wire Line
	3700 6500 3700 6600
Wire Wire Line
	1500 6300 1700 6300
Wire Wire Line
	1700 6300 1700 6400
Connection ~ 1700 6300
Wire Wire Line
	1700 6700 1700 6750
Wire Wire Line
	2700 4700 2900 4700
Wire Wire Line
	1700 4700 1900 4700
Wire Wire Line
	2900 4700 2900 4750
Connection ~ 2900 4700
Wire Wire Line
	2900 4700 3050 4700
Wire Wire Line
	2900 5050 2900 5100
Wire Wire Line
	1900 4700 1900 4750
Connection ~ 1900 4700
Wire Wire Line
	1900 4700 2100 4700
Wire Wire Line
	1900 5050 1900 5100
Wire Wire Line
	2400 5000 2400 5050
Wire Wire Line
	3350 4800 3350 4850
Wire Wire Line
	8000 2950 8000 3000
Wire Wire Line
	2200 1650 2200 1700
Wire Wire Line
	900  2000 900  2050
Wire Wire Line
	2300 7050 2300 7100
$Comp
L Device:Jumper JP1
U 1 1 626E5D7F
P 1600 7350
F 0 "JP1" H 1600 7614 50  0000 C CNN
F 1 "Jumper" H 1600 7523 50  0000 C CNN
F 2 "Connector_PinHeader_2.54mm:PinHeader_1x02_P2.54mm_Vertical" H 1600 7350 50  0001 C CNN
F 3 "~" H 1600 7350 50  0001 C CNN
F 4 "609-68000-402-ND" H 1600 7350 50  0001 C CNN "Digikey_NO"
	1    1600 7350
	1    0    0    -1  
$EndComp
$Comp
L Device:R_US R17
U 1 1 626E7CC0
P 1950 6900
F 0 "R17" H 2100 6950 50  0000 C CNN
F 1 "6.2K" H 2100 6850 50  0000 C CNN
F 2 "Resistor_SMD:R_0805_2012Metric_Pad1.20x1.40mm_HandSolder" V 1990 6890 50  0001 C CNN
F 3 "~" H 1950 6900 50  0001 C CNN
F 4 "RMCF0805JT6K20CT-ND" H 1950 6900 50  0001 C CNN "Digikey_NO"
	1    1950 6900
	1    0    0    -1  
$EndComp
Wire Wire Line
	1700 6300 2000 6300
Wire Wire Line
	1950 7050 1950 7350
$Comp
L power:GND #PWR038
U 1 1 6270B3FC
P 1200 7450
F 0 "#PWR038" H 1200 7200 50  0001 C CNN
F 1 "GND" H 1205 7277 50  0000 C CNN
F 2 "" H 1200 7450 50  0001 C CNN
F 3 "" H 1200 7450 50  0001 C CNN
	1    1200 7450
	1    0    0    -1  
$EndComp
Wire Wire Line
	1300 7350 1200 7350
Wire Wire Line
	1200 7350 1200 7450
Wire Wire Line
	1950 7350 1900 7350
Wire Wire Line
	1950 6750 2300 6750
$Comp
L power:GND #PWR0101
U 1 1 6274A0A8
P 2350 2850
F 0 "#PWR0101" H 2350 2600 50  0001 C CNN
F 1 "GND" H 2355 2677 50  0000 C CNN
F 2 "" H 2350 2850 50  0001 C CNN
F 3 "" H 2350 2850 50  0001 C CNN
	1    2350 2850
	1    0    0    -1  
$EndComp
Wire Wire Line
	2500 2300 2350 2300
Wire Wire Line
	2350 2300 2350 2400
Wire Wire Line
	2500 2400 2350 2400
Connection ~ 2350 2400
Wire Wire Line
	2350 2400 2350 2850
$Comp
L power:GND #PWR0102
U 1 1 6275C2CD
P 4700 1650
F 0 "#PWR0102" H 4700 1400 50  0001 C CNN
F 1 "GND" H 4705 1477 50  0000 C CNN
F 2 "" H 4700 1650 50  0001 C CNN
F 3 "" H 4700 1650 50  0001 C CNN
	1    4700 1650
	1    0    0    -1  
$EndComp
Wire Wire Line
	4400 1700 4600 1700
Wire Wire Line
	4600 1700 4600 1650
Wire Wire Line
	4600 1650 4700 1650
Text Notes 2250 7500 0    50   ~ 0
Vout = 1.25V*(1+R15/R14) + Iadj*R15
Text Notes 5400 -650 0    50   ~ 0
test version saturday 4/30
Text Notes 4750 -400 0    50   ~ 0
added jumper and parallel resistor to adjustable regulator to source +3.3V as well as +2.8V
$Comp
L power:Vdrive #PWR0103
U 1 1 6275273D
P 10200 2800
F 0 "#PWR0103" H 10000 2650 50  0001 C CNN
F 1 "Vdrive" H 10215 2973 50  0000 C CNN
F 2 "" H 10200 2800 50  0001 C CNN
F 3 "" H 10200 2800 50  0001 C CNN
	1    10200 2800
	1    0    0    -1  
$EndComp
Text Notes 10350 2700 0    50   ~ 0
+3V3
$Comp
L power:Vdrive #PWR0104
U 1 1 627802BD
P 8550 4400
F 0 "#PWR0104" H 8350 4250 50  0001 C CNN
F 1 "Vdrive" H 8565 4573 50  0000 C CNN
F 2 "" H 8550 4400 50  0001 C CNN
F 3 "" H 8550 4400 50  0001 C CNN
	1    8550 4400
	1    0    0    -1  
$EndComp
Text Notes 8200 4300 0    50   ~ 0
+2V8
$Comp
L power:Vdrive #PWR0105
U 1 1 6278B0AF
P 3400 6000
F 0 "#PWR0105" H 3200 5850 50  0001 C CNN
F 1 "Vdrive" H 3415 6173 50  0000 C CNN
F 2 "" H 3400 6000 50  0001 C CNN
F 3 "" H 3400 6000 50  0001 C CNN
	1    3400 6000
	1    0    0    -1  
$EndComp
Text Notes 3550 6000 0    50   ~ 0
+2V8 jumper out, +3V3 jumper in
Wire Wire Line
	1650 1750 1800 1750
$Comp
L Connector:Barrel_Jack_Switch J1
U 1 1 622FA3F9
P 1350 1850
F 0 "J1" H 1350 2300 50  0000 C CNN
F 1 "Barrel_Jack" H 1350 2200 50  0000 C CNN
F 2 "Connector_BarrelJack:BarrelJack_Wuerth_6941xx301002" H 1400 1810 50  0001 C CNN
F 3 "we-online.com/katalog/datasheet/6941xx301002.pdf" H 1400 1810 50  0001 C CNN
F 4 "732-5930-ND" H 1350 2100 50  0000 C CNN "Digikey_NO"
	1    1350 1850
	1    0    0    -1  
$EndComp
Wire Wire Line
	1650 1850 1750 1850
Wire Wire Line
	1750 1850 1750 1950
Wire Wire Line
	1750 1950 1650 1950
$Comp
L power:GND #PWR0106
U 1 1 627D5B42
P 1750 2050
F 0 "#PWR0106" H 1750 1800 50  0001 C CNN
F 1 "GND" H 1755 1877 50  0000 C CNN
F 2 "" H 1750 2050 50  0001 C CNN
F 3 "" H 1750 2050 50  0001 C CNN
	1    1750 2050
	1    0    0    -1  
$EndComp
Wire Wire Line
	1750 1950 1750 2050
Connection ~ 1750 1950
$Comp
L power:+12V #PWR0107
U 1 1 627DEC75
P 900 1600
F 0 "#PWR0107" H 900 1450 50  0001 C CNN
F 1 "+12V" H 900 1750 50  0000 C CNN
F 2 "" H 900 1600 50  0001 C CNN
F 3 "" H 900 1600 50  0001 C CNN
	1    900  1600
	1    0    0    -1  
$EndComp
Wire Wire Line
	600  750  600  2700
Wire Wire Line
	600  2700 2500 2700
Wire Wire Line
	600  750  9200 750 
$EndSCHEMATC
