(module SSOP-4_4.45x2.65mm_P1.27mm (layer F.Cu) (tedit 5C1171C1)
  (descr https://www.panasonic-electric-works.com/cps/rde/xbcr/pew_eu_en/technical_information_photomos_en.pdf)
  (tags "SSOP4 APV21 AQY22")
  (attr smd)
  (fp_text reference REF** (at 0 -2.54) (layer F.SilkS)
    (effects (font (size 1 1) (thickness 0.15)))
  )
  (fp_text value SSOP-4_4.45x2.65mm_P1.27mm (at -0.01 2.54) (layer F.Fab)
    (effects (font (size 1 1) (thickness 0.15)))
  )
  (fp_line (start 2.35 1.45) (end 2.35 1.25) (layer F.SilkS) (width 0.12))
  (fp_line (start -2.35 1.45) (end 2.35 1.45) (layer F.SilkS) (width 0.12))
  (fp_line (start -2.35 1.25) (end -2.35 1.45) (layer F.SilkS) (width 0.12))
  (fp_line (start -2.35 -1.25) (end -2.8 -1.25) (layer F.SilkS) (width 0.12))
  (fp_line (start -2.35 -1.45) (end -2.35 -1.25) (layer F.SilkS) (width 0.12))
  (fp_line (start 2.35 -1.45) (end -2.35 -1.45) (layer F.SilkS) (width 0.12))
  (fp_line (start 2.35 -1.25) (end 2.35 -1.45) (layer F.SilkS) (width 0.12))
  (fp_text user %R (at 0 0) (layer F.Fab)
    (effects (font (size 1 1) (thickness 0.15)))
  )
  (fp_line (start -2.225 -0.6625) (end -1.5625 -1.325) (layer F.Fab) (width 0.1))
  (fp_line (start 2.225 -1.325) (end 2.225 1.325) (layer F.Fab) (width 0.1))
  (fp_line (start -2.225 1.325) (end 2.225 1.325) (layer F.Fab) (width 0.1))
  (fp_line (start -2.88 1.58) (end 2.88 1.58) (layer F.CrtYd) (width 0.05))
  (fp_line (start -2.225 -0.6625) (end -2.225 1.325) (layer F.Fab) (width 0.1))
  (fp_line (start -1.5625 -1.325) (end 2.225 -1.325) (layer F.Fab) (width 0.1))
  (fp_line (start 2.88 -1.58) (end 2.88 1.58) (layer F.CrtYd) (width 0.05))
  (fp_line (start -2.88 -1.58) (end -2.88 1.58) (layer F.CrtYd) (width 0.05))
  (fp_line (start -2.88 -1.58) (end 2.88 -1.58) (layer F.CrtYd) (width 0.05))
  (pad 1 smd roundrect (at -3.175 -0.635) (size 1.5 0.6) (layers F.Cu F.Paste F.Mask) (roundrect_rratio 0.25))
  (pad 2 smd roundrect (at -3.175 0.635) (size 1.5 0.6) (layers F.Cu F.Paste F.Mask) (roundrect_rratio 0.25))
  (pad 3 smd roundrect (at 3.175 0.635) (size 1.5 0.6) (layers F.Cu F.Paste F.Mask) (roundrect_rratio 0.25))
  (pad 4 smd roundrect (at 3.175 -0.635) (size 1.5 0.6) (layers F.Cu F.Paste F.Mask) (roundrect_rratio 0.25))
  (model ${KISYS3DMOD}/OptoDevice.3dshapes/Panasonic_APV-AQY_SSOP-4_4.45x2.65mm_P1.27mm.wrl
    (at (xyz 0 0 0))
    (scale (xyz 1 1 1))
    (rotate (xyz 0 0 0))
  )
)
