PCBNEW-LibModule-V1  2023-11-29 20:11:09
# encoding utf-8
Units mm
$INDEX
SODFL1006X40N
$EndINDEX
$MODULE SODFL1006X40N
Po 0 0 0 15 65679add 00000000 ~~
Li SODFL1006X40N
Cd SOD-923 CASE 514AB
Kw Schottky Diode
Sc 0
At SMD
AR 
Op 0 0 0
T0 0 0 1.27 1.27 0 0.254 N V 21 N "D**"
T1 0 0 1.27 1.27 0 0.254 N I 21 N "SODFL1006X40N"
DS -0.905 -0.475 0.905 -0.475 0.05 24
DS 0.905 -0.475 0.905 0.475 0.05 24
DS 0.905 0.475 -0.905 0.475 0.05 24
DS -0.905 0.475 -0.905 -0.475 0.05 24
DS -0.4 -0.3 0.4 -0.3 0.1 24
DS 0.4 -0.3 0.4 0.3 0.1 24
DS 0.4 0.3 -0.4 0.3 0.1 24
DS -0.4 0.3 -0.4 -0.3 0.1 24
DS -0.4 -0.045 -0.145 -0.3 0.1 24
DS -0.755 -0.3 0.4 -0.3 0.2 21
DS -0.4 0.3 0.4 0.3 0.2 21
$PAD
Po -0.5 0
Sh "1" R 0.32 0.51 0 0 900
At SMD N 00888000
Ne 0 ""
$EndPAD
$PAD
Po 0.5 0
Sh "2" R 0.32 0.51 0 0 900
At SMD N 00888000
Ne 0 ""
$EndPAD
$EndMODULE SODFL1006X40N
$EndLIBRARY
