(module Si591 (layer F.Cu) (tedit 5E849FA6)
  (fp_text reference Y1 (at -3.302 -5.08) (layer F.SilkS)
    (effects (font (size 1 1) (thickness 0.15)))
  )
  (fp_text value DNP (at 0.03 -22.3) (layer F.Fab)
    (effects (font (size 1 1) (thickness 0.15)))
  )
  (fp_line (start 4.1 3.6) (end 4.1 -3.7) (layer F.SilkS) (width 0.15))
  (fp_line (start -3.175 3.6) (end 4.1 3.6) (layer F.SilkS) (width 0.15))
  (fp_line (start -4.1 -3.7) (end -4.1 2.667) (layer F.SilkS) (width 0.15))
  (fp_line (start 4.1 -3.7) (end -4.1 -3.7) (layer F.SilkS) (width 0.15))
  (fp_line (start -3.2004 3.5814) (end -4.0894 2.6924) (layer F.SilkS) (width 0.15))
  (pad 1 smd rect (at -2.54 1.575) (size 1.7 2.15) (layers F.Cu F.Paste F.Mask))
  (pad 2 smd rect (at 0 1.575) (size 1.7 2.15) (layers F.Cu F.Paste F.Mask))
  (pad 3 smd rect (at 2.54 1.575) (size 1.7 2.15) (layers F.Cu F.Paste F.Mask))
  (pad 4 smd rect (at 2.54 -1.575) (size 1.7 2.15) (layers F.Cu F.Paste F.Mask))
  (pad 5 smd rect (at 0 -1.575) (size 1.7 2.15) (layers F.Cu F.Paste F.Mask))
  (pad 6 smd rect (at -2.54 -1.575) (size 1.7 2.15) (layers F.Cu F.Paste F.Mask))
  (model ${KIPRJMOD}/mod/Oscillator.pretty/mod_3D/Si59X.step
    (offset (xyz -3.5 -2.5 0.02))
    (scale (xyz 1 1 1))
    (rotate (xyz 0 0 0))
  )
)
