(kicad_symbol_lib (version 20220914) (generator kicad_symbol_editor)
  (symbol "81-088-1" (pin_names (offset 1.016)) (in_bom yes) (on_board yes)
    (property "Reference" "S" (at 0 -6.4262 0)
      (effects (font (size 1.524 1.524)) hide)
    )
    (property "Value" "81-088-1" (at 0 6.4262 0)
      (effects (font (size 1.524 1.524)) hide)
    )
    (property "Footprint" "" (at 0 -0.254 0)
      (effects (font (size 1.27 1.27)) hide)
    )
    (property "Datasheet" "" (at 0 -0.254 0)
      (effects (font (size 1.27 1.27)) hide)
    )
    (symbol "81-088-1_0_0"
      (polyline
        (pts
          (xy 0.5334 1.2954)
          (xy 0.762 1.4732)
          (xy 0.9398 1.7272)
          (xy 0.9906 2.032)
          (xy 0.9398 2.3368)
          (xy 0.762 2.6416)
          (xy 0.635 2.7432)
          (xy 0.3302 2.8702)
          (xy 0 2.8702)
          (xy -0.2794 2.7432)
          (xy -0.508 2.54)
          (xy -0.635 2.2606)
          (xy -0.6604 1.905)
          (xy -0.4826 1.905)
          (xy -0.4826 2.159)
          (xy -0.4064 2.3622)
          (xy -0.2032 2.5908)
          (xy 0.0762 2.6924)
          (xy 0.3556 2.667)
          (xy 0.635 2.5146)
          (xy 0.7112 2.413)
          (xy 0.8382 2.1336)
          (xy 0.7874 1.8288)
          (xy 0.5842 1.5748)
          (xy 0.5334 1.524)
          (xy 0.3302 1.4224)
          (xy 0.2032 1.3716)
          (xy 0.1778 1.3716)
          (xy -0.1016 1.4478)
          (xy -0.3302 1.651)
          (xy -0.4826 1.905)
          (xy -0.6604 1.905)
          (xy -0.5842 1.7018)
          (xy -0.3556 1.4224)
          (xy -0.1016 1.2446)
          (xy 0.2286 1.1938)
          (xy 0.5334 1.2954)
        )
        (stroke (width 0.0254) (type solid))
        (fill (type outline))
      )
      (polyline
        (pts
          (xy 0.4064 -2.7686)
          (xy 0.6096 -2.6924)
          (xy 0.7874 -2.54)
          (xy 0.9144 -2.3114)
          (xy 1.016 -1.9812)
          (xy 0.9652 -1.7526)
          (xy 0.7874 -1.4478)
          (xy 0.6604 -1.3208)
          (xy 0.4826 -1.2192)
          (xy 0.2032 -1.1938)
          (xy -0.127 -1.2192)
          (xy -0.4064 -1.397)
          (xy -0.6096 -1.6764)
          (xy -0.6604 -1.9304)
          (xy -0.6604 -1.9812)
          (xy -0.4826 -1.9812)
          (xy -0.4318 -1.7526)
          (xy -0.3302 -1.5748)
          (xy -0.1016 -1.397)
          (xy 0.2286 -1.3462)
          (xy 0.3302 -1.3716)
          (xy 0.5842 -1.4986)
          (xy 0.762 -1.7272)
          (xy 0.8382 -1.9812)
          (xy 0.7874 -2.1844)
          (xy 0.6604 -2.3876)
          (xy 0.4826 -2.5654)
          (xy 0.2032 -2.6162)
          (xy 0.127 -2.6162)
          (xy -0.1016 -2.5654)
          (xy -0.2794 -2.4638)
          (xy -0.4064 -2.2606)
          (xy -0.4572 -2.1844)
          (xy -0.4826 -1.9812)
          (xy -0.6604 -1.9812)
          (xy -0.6096 -2.2606)
          (xy -0.4064 -2.5908)
          (xy -0.3302 -2.6416)
          (xy -0.1016 -2.7686)
          (xy 0.1778 -2.794)
          (xy 0.4064 -2.7686)
        )
        (stroke (width 0.0254) (type solid))
        (fill (type outline))
      )
      (polyline
        (pts
          (xy 1.8542 -3.1242)
          (xy 4.9784 -3.1242)
          (xy 4.9784 -1.8542)
          (xy 1.8542 -1.8542)
          (xy 1.8542 -0.5842)
          (xy 4.9784 -0.5842)
          (xy 4.9784 0.6858)
          (xy 1.8542 0.6858)
          (xy 1.8542 1.9558)
          (xy 4.9784 1.9558)
          (xy 4.9784 3.2258)
          (xy 1.8542 3.2258)
          (xy 1.8542 4.2418)
          (xy -5.588 4.2418)
          (xy -5.8674 4.0386)
          (xy -6.0706 3.8608)
          (xy -6.2738 3.4544)
          (xy -6.2992 3.2258)
          (xy -6.3246 2.8448)
          (xy -6.3754 2.3622)
          (xy -6.4008 1.778)
          (xy -6.4516 1.143)
          (xy -6.5024 0.4572)
          (xy -6.5024 0.1016)
          (xy -6.5532 -0.5334)
          (xy -6.5786 -1.0922)
          (xy -6.6294 -1.5748)
          (xy -6.6548 -1.9304)
          (xy -6.6802 -2.1844)
          (xy -6.7056 -2.2606)
          (xy -6.7818 -2.3114)
          (xy -6.9596 -2.4892)
          (xy -7.0358 -2.7432)
          (xy -7.0358 -2.8956)
          (xy -6.858 -2.8956)
          (xy -6.8326 -2.667)
          (xy -6.6802 -2.4892)
          (xy -6.5786 -2.3876)
          (xy -6.5278 -2.3114)
          (xy -6.5024 -2.2098)
          (xy -6.477 -2.032)
          (xy -6.4516 -1.778)
          (xy -6.4262 -1.4224)
          (xy -6.4008 -0.9652)
          (xy -6.3754 -0.3556)
          (xy -6.3246 0.381)
          (xy -6.2992 0.7112)
          (xy -6.2738 1.3716)
          (xy -6.223 1.9812)
          (xy -6.1976 2.5146)
          (xy -6.1468 2.9464)
          (xy -6.1214 3.2512)
          (xy -6.096 3.4036)
          (xy -5.9944 3.6576)
          (xy -5.7404 3.9116)
          (xy -5.6896 3.937)
          (xy -5.6134 3.9624)
          (xy -5.5118 3.9878)
          (xy -5.3594 4.0132)
          (xy -5.1816 4.0386)
          (xy -4.9022 4.0386)
          (xy -4.5466 4.064)
          (xy 1.6764 4.064)
          (xy 1.6764 2.9972)
          (xy 1.6256 2.794)
          (xy 1.6002 2.7178)
          (xy 1.5748 2.7178)
          (xy 1.4732 2.8194)
          (xy 1.3716 3.0226)
          (xy 1.3462 3.2512)
          (xy 1.3462 3.2766)
          (xy 1.3208 3.429)
          (xy 1.27 3.5306)
          (xy 1.1684 3.6068)
          (xy 0.9906 3.6576)
          (xy 0.7112 3.7084)
          (xy 0.3302 3.7084)
          (xy -0.1778 3.7338)
          (xy -1.778 3.7338)
          (xy -2.2352 3.7084)
          (xy -2.5654 3.683)
          (xy -2.794 3.6068)
          (xy -2.9464 3.5052)
          (xy -3.0226 3.3274)
          (xy -3.048 3.0734)
          (xy -3.0734 2.7432)
          (xy -3.0734 1.524)
          (xy -3.1242 1.2446)
          (xy -3.2004 1.0922)
          (xy -3.3528 0.9906)
          (xy -3.5814 0.9652)
          (xy -4.4196 0.9652)
          (xy -4.4196 2.7178)
          (xy -5.1562 2.7178)
          (xy -5.3594 2.6924)
          (xy -5.4356 2.6924)
          (xy -5.4356 2.6416)
          (xy -5.461 2.4384)
          (xy -5.461 2.1082)
          (xy -5.4864 1.6764)
          (xy -5.5372 1.1684)
          (xy -5.5626 0.5842)
          (xy -5.588 -0.0254)
          (xy -5.6388 -0.635)
          (xy -5.6642 -1.2192)
          (xy -5.6896 -1.778)
          (xy -5.7404 -2.2352)
          (xy -5.7404 -2.6416)
          (xy -5.7658 -2.8956)
          (xy -5.7658 -3.0226)
          (xy -5.7912 -3.175)
          (xy -5.842 -3.2766)
          (xy -6.1976 -3.2766)
          (xy -6.5532 -3.2004)
          (xy -6.7564 -3.0988)
          (xy -6.7818 -3.0734)
          (xy -6.858 -2.8956)
          (xy -7.0358 -2.8956)
          (xy -7.0104 -3.0226)
          (xy -6.8834 -3.2258)
          (xy -6.7818 -3.302)
          (xy -6.5024 -3.3782)
          (xy -6.1722 -3.429)
          (xy -5.588 -3.4798)
          (xy -5.6134 -3.1496)
          (xy -5.588 -3.048)
          (xy -5.588 -2.7686)
          (xy -5.5626 -2.3622)
          (xy -5.5372 -1.8542)
          (xy -5.5118 -1.2954)
          (xy -5.4864 -0.6858)
          (xy -5.4356 -0.0762)
          (xy -5.4102 0.5334)
          (xy -5.3594 1.0668)
          (xy -5.334 1.524)
          (xy -5.3086 1.8796)
          (xy -5.3086 2.1082)
          (xy -5.2578 2.54)
          (xy -4.572 2.54)
          (xy -4.572 -3.4544)
          (xy -4.5466 -3.8354)
          (xy -4.5466 -4.064)
          (xy -4.4196 -4.064)
          (xy -4.4196 0.7366)
          (xy -3.937 0.762)
          (xy -3.4798 0.762)
          (xy -3.7084 0.4572)
          (xy -3.7592 0.381)
          (xy -3.9116 0.2286)
          (xy -4.0132 0.1778)
          (xy -4.0386 0.1016)
          (xy -4.0386 -0.1524)
          (xy -4.064 -0.508)
          (xy -4.064 -1.6002)
          (xy -4.0386 -2.159)
          (xy -4.0386 -2.6162)
          (xy -4.0386 -2.6416)
          (xy -3.9116 -2.6416)
          (xy -3.9116 -1.0414)
          (xy -3.8862 -0.6604)
          (xy -3.8862 -0.4064)
          (xy -3.8608 -0.254)
          (xy -3.81 -0.1778)
          (xy -3.7084 -0.0762)
          (xy -3.683 0.0254)
          (xy -3.683 0.0508)
          (xy -3.6322 0.1778)
          (xy -3.5052 0.4064)
          (xy -2.8956 1.1684)
          (xy -2.8956 2.5654)
          (xy -2.8702 2.921)
          (xy -2.8448 3.175)
          (xy -2.8194 3.3274)
          (xy -2.7686 3.429)
          (xy -2.7178 3.4544)
          (xy -2.6416 3.5052)
          (xy -2.4892 3.5306)
          (xy -2.2352 3.5306)
          (xy -1.905 3.556)
          (xy 0.3556 3.556)
          (xy 0.6858 3.5306)
          (xy 0.9144 3.5052)
          (xy 1.0668 3.429)
          (xy 1.143 3.3528)
          (xy 1.1684 3.2512)
          (xy 1.1684 3.1242)
          (xy 1.2192 2.8956)
          (xy 1.4224 2.6162)
          (xy 1.6764 2.3876)
          (xy 1.6764 2.1082)
          (xy 1.8542 2.1082)
          (xy 1.8542 3.048)
          (xy 4.826 3.048)
          (xy 4.826 2.1082)
          (xy 1.8542 2.1082)
          (xy 1.6764 2.1082)
          (xy 1.6764 0.0762)
          (xy -0.2794 0.1016)
          (xy -1.9558 0.1016)
          (xy -2.1082 0.0762)
          (xy -2.1844 0.0508)
          (xy -2.1844 -0.0254)
          (xy -2.1082 -0.0508)
          (xy -1.9558 -0.0762)
          (xy -1.7272 -0.0762)
          (xy -1.3716 -0.1016)
          (xy -0.889 -0.1016)
          (xy -0.254 -0.0762)
          (xy 1.6764 -0.0762)
          (xy 1.6764 -0.4318)
          (xy 1.8542 -0.4318)
          (xy 1.8542 0.508)
          (xy 4.826 0.508)
          (xy 4.826 -0.4318)
          (xy 1.8542 -0.4318)
          (xy 1.6764 -0.4318)
          (xy 1.6764 -2.0066)
          (xy 1.651 -2.2352)
          (xy 1.6256 -2.3876)
          (xy 1.5748 -2.4638)
          (xy 1.524 -2.4892)
          (xy 1.4986 -2.4892)
          (xy 1.3462 -2.6416)
          (xy 1.2192 -2.8702)
          (xy 1.1684 -3.1242)
          (xy 1.1176 -3.2766)
          (xy 0.9906 -3.429)
          (xy 0.9652 -3.429)
          (xy 0.889 -3.4798)
          (xy 0.7366 -3.5052)
          (xy 0.5334 -3.5306)
          (xy 0.2286 -3.5306)
          (xy -0.1778 -3.556)
          (xy -2.6924 -3.556)
          (xy -3.048 -3.5306)
          (xy -3.302 -3.5306)
          (xy -3.4798 -3.5052)
          (xy -3.6068 -3.4798)
          (xy -3.683 -3.429)
          (xy -3.7846 -3.3274)
          (xy -3.8354 -3.2512)
          (xy -3.8608 -3.1242)
          (xy -3.8862 -2.921)
          (xy -3.9116 -2.6416)
          (xy -4.0386 -2.6416)
          (xy -4.0132 -2.9718)
          (xy -4.0132 -3.2004)
          (xy -3.9624 -3.3528)
          (xy -3.937 -3.4544)
          (xy -3.8862 -3.5306)
          (xy -3.8608 -3.5306)
          (xy -3.81 -3.5814)
          (xy -3.7084 -3.6068)
          (xy -3.556 -3.6322)
          (xy -3.3528 -3.6576)
          (xy -3.048 -3.6576)
          (xy -2.6162 -3.683)
          (xy -0.2032 -3.683)
          (xy 0.2794 -3.6576)
          (xy 0.6604 -3.6322)
          (xy 0.9398 -3.6068)
          (xy 1.1176 -3.556)
          (xy 1.2192 -3.4798)
          (xy 1.2954 -3.3528)
          (xy 1.3462 -3.2258)
          (xy 1.3716 -3.048)
          (xy 1.397 -2.9972)
          (xy 1.4478 -2.794)
          (xy 1.5494 -2.667)
          (xy 1.5748 -2.667)
          (xy 1.6256 -2.6924)
          (xy 1.651 -2.794)
          (xy 1.651 -2.9718)
          (xy 1.8542 -2.9718)
          (xy 1.8542 -2.032)
          (xy 4.826 -2.032)
          (xy 4.826 -2.9718)
          (xy 1.8542 -2.9718)
          (xy 1.651 -2.9718)
          (xy 1.6764 -2.9972)
          (xy 1.6764 -4.064)
          (xy -4.4196 -4.064)
          (xy -4.5466 -4.064)
          (xy -4.5466 -4.0894)
          (xy -4.5212 -4.1656)
          (xy -4.4196 -4.191)
          (xy -4.1656 -4.191)
          (xy -3.7846 -4.2164)
          (xy -2.032 -4.2164)
          (xy -1.3208 -4.2418)
          (xy 1.8542 -4.2418)
          (xy 1.8542 -3.1242)
        )
        (stroke (width 0.0254) (type solid))
        (fill (type outline))
      )
      (text "1" (at 5.842 2.54 0)
        (effects (font (size 1.27 1.27)))
      )
      (text "2" (at 5.842 0 0)
        (effects (font (size 1.27 1.27)))
      )
      (text "3" (at 5.842 -2.54 0)
        (effects (font (size 1.27 1.27)))
      )
    )
  )
)
