ISO-10303-21;
HEADER;
/* Generated by software containing ST-Developer
 * from STEP Tools, Inc. (www.steptools.com) 
 */

FILE_DESCRIPTION(
/* description */ (''),
/* implementation_level */ '2;1');

FILE_NAME(
/* name */ 'D:\\6089-xxx_CM_2xVU13P\\Inventor\\cover_standoff.stp',
/* time_stamp */ '2020-03-30T16:15:18-04:00',
/* author */ ('Charlie'),
/* organization */ (''),
/* preprocessor_version */ 'ST-DEVELOPER v18',
/* originating_system */ 'Autodesk Inventor 2020',
/* authorisation */ '');

FILE_SCHEMA (('AUTOMOTIVE_DESIGN { 1 0 10303 214 3 1 1 }'));
ENDSEC;

DATA;
#10=MECHANICAL_DESIGN_GEOMETRIC_PRESENTATION_REPRESENTATION('',(#13),#342);
#11=SHAPE_REPRESENTATION_RELATIONSHIP('SRR','None',#349,#12);
#12=ADVANCED_BREP_SHAPE_REPRESENTATION('',(#14),#341);
#13=STYLED_ITEM('',(#358),#14);
#14=MANIFOLD_SOLID_BREP('Solid1',#193);
#15=FACE_BOUND('',#39,.T.);
#16=FACE_BOUND('',#47,.T.);
#17=FACE_BOUND('',#48,.T.);
#18=FACE_BOUND('',#50,.T.);
#19=FACE_BOUND('',#51,.T.);
#20=PLANE('',#217);
#21=PLANE('',#226);
#22=PLANE('',#227);
#23=PLANE('',#228);
#24=PLANE('',#229);
#25=PLANE('',#230);
#26=PLANE('',#231);
#27=FACE_OUTER_BOUND('',#37,.T.);
#28=FACE_OUTER_BOUND('',#38,.T.);
#29=FACE_OUTER_BOUND('',#40,.T.);
#30=FACE_OUTER_BOUND('',#41,.T.);
#31=FACE_OUTER_BOUND('',#42,.T.);
#32=FACE_OUTER_BOUND('',#43,.T.);
#33=FACE_OUTER_BOUND('',#44,.T.);
#34=FACE_OUTER_BOUND('',#45,.T.);
#35=FACE_OUTER_BOUND('',#46,.T.);
#36=FACE_OUTER_BOUND('',#49,.T.);
#37=EDGE_LOOP('',(#132,#133,#134,#135,#136));
#38=EDGE_LOOP('',(#137,#138));
#39=EDGE_LOOP('',(#139));
#40=EDGE_LOOP('',(#140,#141,#142,#143,#144,#145));
#41=EDGE_LOOP('',(#146,#147,#148,#149));
#42=EDGE_LOOP('',(#150,#151,#152,#153));
#43=EDGE_LOOP('',(#154,#155,#156,#157));
#44=EDGE_LOOP('',(#158,#159,#160,#161));
#45=EDGE_LOOP('',(#162,#163,#164,#165));
#46=EDGE_LOOP('',(#166,#167,#168,#169));
#47=EDGE_LOOP('',(#170));
#48=EDGE_LOOP('',(#171));
#49=EDGE_LOOP('',(#172,#173,#174,#175));
#50=EDGE_LOOP('',(#176,#177));
#51=EDGE_LOOP('',(#178,#179));
#52=LINE('',#294,#67);
#53=LINE('',#308,#68);
#54=LINE('',#311,#69);
#55=LINE('',#316,#70);
#56=LINE('',#318,#71);
#57=LINE('',#320,#72);
#58=LINE('',#321,#73);
#59=LINE('',#324,#74);
#60=LINE('',#326,#75);
#61=LINE('',#327,#76);
#62=LINE('',#330,#77);
#63=LINE('',#332,#78);
#64=LINE('',#333,#79);
#65=LINE('',#335,#80);
#66=LINE('',#336,#81);
#67=VECTOR('',#240,1.0065);
#68=VECTOR('',#257,2.5);
#69=VECTOR('',#260,1.45);
#70=VECTOR('',#265,10.);
#71=VECTOR('',#266,10.);
#72=VECTOR('',#267,10.);
#73=VECTOR('',#268,10.);
#74=VECTOR('',#271,10.);
#75=VECTOR('',#272,10.);
#76=VECTOR('',#273,10.);
#77=VECTOR('',#276,10.);
#78=VECTOR('',#277,10.);
#79=VECTOR('',#278,10.);
#80=VECTOR('',#281,10.);
#81=VECTOR('',#282,10.);
#82=CIRCLE('',#214,1.0065);
#83=CIRCLE('',#215,1.0065);
#84=CIRCLE('',#216,1.0065);
#85=CIRCLE('',#218,2.5);
#86=CIRCLE('',#219,2.5);
#87=CIRCLE('',#220,1.45);
#88=CIRCLE('',#222,2.5);
#89=CIRCLE('',#223,2.5);
#90=CIRCLE('',#225,1.45);
#91=VERTEX_POINT('',#289);
#92=VERTEX_POINT('',#290);
#93=VERTEX_POINT('',#293);
#94=VERTEX_POINT('',#297);
#95=VERTEX_POINT('',#298);
#96=VERTEX_POINT('',#301);
#97=VERTEX_POINT('',#304);
#98=VERTEX_POINT('',#305);
#99=VERTEX_POINT('',#310);
#100=VERTEX_POINT('',#314);
#101=VERTEX_POINT('',#315);
#102=VERTEX_POINT('',#317);
#103=VERTEX_POINT('',#319);
#104=VERTEX_POINT('',#323);
#105=VERTEX_POINT('',#325);
#106=VERTEX_POINT('',#329);
#107=VERTEX_POINT('',#331);
#108=EDGE_CURVE('',#91,#92,#82,.T.);
#109=EDGE_CURVE('',#92,#91,#83,.T.);
#110=EDGE_CURVE('',#92,#93,#52,.T.);
#111=EDGE_CURVE('',#93,#93,#84,.T.);
#112=EDGE_CURVE('',#94,#95,#85,.T.);
#113=EDGE_CURVE('',#95,#94,#86,.T.);
#114=EDGE_CURVE('',#96,#96,#87,.T.);
#115=EDGE_CURVE('',#97,#98,#88,.T.);
#116=EDGE_CURVE('',#98,#97,#89,.T.);
#117=EDGE_CURVE('',#98,#95,#53,.T.);
#118=EDGE_CURVE('',#96,#99,#54,.T.);
#119=EDGE_CURVE('',#99,#99,#90,.T.);
#120=EDGE_CURVE('',#100,#101,#55,.T.);
#121=EDGE_CURVE('',#100,#102,#56,.T.);
#122=EDGE_CURVE('',#103,#102,#57,.T.);
#123=EDGE_CURVE('',#101,#103,#58,.T.);
#124=EDGE_CURVE('',#101,#104,#59,.T.);
#125=EDGE_CURVE('',#105,#103,#60,.T.);
#126=EDGE_CURVE('',#104,#105,#61,.T.);
#127=EDGE_CURVE('',#104,#106,#62,.T.);
#128=EDGE_CURVE('',#107,#105,#63,.T.);
#129=EDGE_CURVE('',#106,#107,#64,.T.);
#130=EDGE_CURVE('',#106,#100,#65,.T.);
#131=EDGE_CURVE('',#102,#107,#66,.T.);
#132=ORIENTED_EDGE('',*,*,#108,.F.);
#133=ORIENTED_EDGE('',*,*,#109,.F.);
#134=ORIENTED_EDGE('',*,*,#110,.T.);
#135=ORIENTED_EDGE('',*,*,#111,.F.);
#136=ORIENTED_EDGE('',*,*,#110,.F.);
#137=ORIENTED_EDGE('',*,*,#112,.T.);
#138=ORIENTED_EDGE('',*,*,#113,.T.);
#139=ORIENTED_EDGE('',*,*,#114,.F.);
#140=ORIENTED_EDGE('',*,*,#115,.F.);
#141=ORIENTED_EDGE('',*,*,#116,.F.);
#142=ORIENTED_EDGE('',*,*,#117,.T.);
#143=ORIENTED_EDGE('',*,*,#112,.F.);
#144=ORIENTED_EDGE('',*,*,#113,.F.);
#145=ORIENTED_EDGE('',*,*,#117,.F.);
#146=ORIENTED_EDGE('',*,*,#114,.T.);
#147=ORIENTED_EDGE('',*,*,#118,.T.);
#148=ORIENTED_EDGE('',*,*,#119,.F.);
#149=ORIENTED_EDGE('',*,*,#118,.F.);
#150=ORIENTED_EDGE('',*,*,#120,.F.);
#151=ORIENTED_EDGE('',*,*,#121,.T.);
#152=ORIENTED_EDGE('',*,*,#122,.F.);
#153=ORIENTED_EDGE('',*,*,#123,.F.);
#154=ORIENTED_EDGE('',*,*,#124,.F.);
#155=ORIENTED_EDGE('',*,*,#123,.T.);
#156=ORIENTED_EDGE('',*,*,#125,.F.);
#157=ORIENTED_EDGE('',*,*,#126,.F.);
#158=ORIENTED_EDGE('',*,*,#127,.F.);
#159=ORIENTED_EDGE('',*,*,#126,.T.);
#160=ORIENTED_EDGE('',*,*,#128,.F.);
#161=ORIENTED_EDGE('',*,*,#129,.F.);
#162=ORIENTED_EDGE('',*,*,#130,.F.);
#163=ORIENTED_EDGE('',*,*,#129,.T.);
#164=ORIENTED_EDGE('',*,*,#131,.F.);
#165=ORIENTED_EDGE('',*,*,#121,.F.);
#166=ORIENTED_EDGE('',*,*,#130,.T.);
#167=ORIENTED_EDGE('',*,*,#120,.T.);
#168=ORIENTED_EDGE('',*,*,#124,.T.);
#169=ORIENTED_EDGE('',*,*,#127,.T.);
#170=ORIENTED_EDGE('',*,*,#111,.T.);
#171=ORIENTED_EDGE('',*,*,#119,.T.);
#172=ORIENTED_EDGE('',*,*,#131,.T.);
#173=ORIENTED_EDGE('',*,*,#128,.T.);
#174=ORIENTED_EDGE('',*,*,#125,.T.);
#175=ORIENTED_EDGE('',*,*,#122,.T.);
#176=ORIENTED_EDGE('',*,*,#108,.T.);
#177=ORIENTED_EDGE('',*,*,#109,.T.);
#178=ORIENTED_EDGE('',*,*,#115,.T.);
#179=ORIENTED_EDGE('',*,*,#116,.T.);
#180=CYLINDRICAL_SURFACE('',#213,1.0065);
#181=CYLINDRICAL_SURFACE('',#221,2.5);
#182=CYLINDRICAL_SURFACE('',#224,1.45);
#183=ADVANCED_FACE('',(#27),#180,.F.);
#184=ADVANCED_FACE('',(#28,#15),#20,.T.);
#185=ADVANCED_FACE('',(#29),#181,.F.);
#186=ADVANCED_FACE('',(#30),#182,.F.);
#187=ADVANCED_FACE('',(#31),#21,.T.);
#188=ADVANCED_FACE('',(#32),#22,.T.);
#189=ADVANCED_FACE('',(#33),#23,.T.);
#190=ADVANCED_FACE('',(#34),#24,.T.);
#191=ADVANCED_FACE('',(#35,#16,#17),#25,.T.);
#192=ADVANCED_FACE('',(#36,#18,#19),#26,.T.);
#193=CLOSED_SHELL('',(#183,#184,#185,#186,#187,#188,#189,#190,#191,#192));
#194=DERIVED_UNIT_ELEMENT(#196,1.);
#195=DERIVED_UNIT_ELEMENT(#344,3.);
#196=(
MASS_UNIT()
NAMED_UNIT(*)
SI_UNIT($,.GRAM.)
);
#197=DERIVED_UNIT((#194,#195));
#198=MEASURE_REPRESENTATION_ITEM('density measure',
POSITIVE_RATIO_MEASURE(1.),#197);
#199=PROPERTY_DEFINITION_REPRESENTATION(#204,#201);
#200=PROPERTY_DEFINITION_REPRESENTATION(#205,#202);
#201=REPRESENTATION('material name',(#203),#341);
#202=REPRESENTATION('density',(#198),#341);
#203=DESCRIPTIVE_REPRESENTATION_ITEM('Generic','Generic');
#204=PROPERTY_DEFINITION('material property','material name',#351);
#205=PROPERTY_DEFINITION('material property','density of part',#351);
#206=DATE_TIME_ROLE('creation_date');
#207=APPLIED_DATE_AND_TIME_ASSIGNMENT(#208,#206,(#351));
#208=DATE_AND_TIME(#209,#210);
#209=CALENDAR_DATE(2019,3,3);
#210=LOCAL_TIME(22,40,36.,#211);
#211=COORDINATED_UNIVERSAL_TIME_OFFSET(0,0,.BEHIND.);
#212=AXIS2_PLACEMENT_3D('placement',#287,#232,#233);
#213=AXIS2_PLACEMENT_3D('',#288,#234,#235);
#214=AXIS2_PLACEMENT_3D('',#291,#236,#237);
#215=AXIS2_PLACEMENT_3D('',#292,#238,#239);
#216=AXIS2_PLACEMENT_3D('',#295,#241,#242);
#217=AXIS2_PLACEMENT_3D('',#296,#243,#244);
#218=AXIS2_PLACEMENT_3D('',#299,#245,#246);
#219=AXIS2_PLACEMENT_3D('',#300,#247,#248);
#220=AXIS2_PLACEMENT_3D('',#302,#249,#250);
#221=AXIS2_PLACEMENT_3D('',#303,#251,#252);
#222=AXIS2_PLACEMENT_3D('',#306,#253,#254);
#223=AXIS2_PLACEMENT_3D('',#307,#255,#256);
#224=AXIS2_PLACEMENT_3D('',#309,#258,#259);
#225=AXIS2_PLACEMENT_3D('',#312,#261,#262);
#226=AXIS2_PLACEMENT_3D('',#313,#263,#264);
#227=AXIS2_PLACEMENT_3D('',#322,#269,#270);
#228=AXIS2_PLACEMENT_3D('',#328,#274,#275);
#229=AXIS2_PLACEMENT_3D('',#334,#279,#280);
#230=AXIS2_PLACEMENT_3D('',#337,#283,#284);
#231=AXIS2_PLACEMENT_3D('',#338,#285,#286);
#232=DIRECTION('axis',(0.,0.,1.));
#233=DIRECTION('refdir',(1.,0.,0.));
#234=DIRECTION('center_axis',(0.,1.,0.));
#235=DIRECTION('ref_axis',(-1.,0.,0.));
#236=DIRECTION('center_axis',(0.,-1.,0.));
#237=DIRECTION('ref_axis',(-1.,0.,0.));
#238=DIRECTION('center_axis',(0.,-1.,0.));
#239=DIRECTION('ref_axis',(-1.,0.,0.));
#240=DIRECTION('',(0.,-1.,0.));
#241=DIRECTION('center_axis',(0.,1.,0.));
#242=DIRECTION('ref_axis',(-1.,0.,0.));
#243=DIRECTION('center_axis',(0.,1.,0.));
#244=DIRECTION('ref_axis',(-1.,0.,0.));
#245=DIRECTION('center_axis',(0.,1.,0.));
#246=DIRECTION('ref_axis',(-1.,0.,0.));
#247=DIRECTION('center_axis',(0.,1.,0.));
#248=DIRECTION('ref_axis',(-1.,0.,0.));
#249=DIRECTION('center_axis',(0.,1.,0.));
#250=DIRECTION('ref_axis',(-1.,0.,0.));
#251=DIRECTION('center_axis',(0.,1.,0.));
#252=DIRECTION('ref_axis',(-1.,0.,0.));
#253=DIRECTION('center_axis',(0.,-1.,0.));
#254=DIRECTION('ref_axis',(-1.,0.,0.));
#255=DIRECTION('center_axis',(0.,-1.,0.));
#256=DIRECTION('ref_axis',(-1.,0.,0.));
#257=DIRECTION('',(0.,-1.,0.));
#258=DIRECTION('center_axis',(0.,1.,0.));
#259=DIRECTION('ref_axis',(-1.,0.,0.));
#260=DIRECTION('',(0.,-1.,0.));
#261=DIRECTION('center_axis',(0.,1.,0.));
#262=DIRECTION('ref_axis',(-1.,0.,0.));
#263=DIRECTION('center_axis',(-1.,0.,3.33066907387547E-16));
#264=DIRECTION('ref_axis',(3.33066907387547E-16,0.,1.));
#265=DIRECTION('',(-3.33066907387547E-16,0.,-1.));
#266=DIRECTION('',(0.,1.,0.));
#267=DIRECTION('',(3.33066907387547E-16,0.,1.));
#268=DIRECTION('',(0.,1.,0.));
#269=DIRECTION('center_axis',(0.,0.,-1.));
#270=DIRECTION('ref_axis',(-1.,0.,0.));
#271=DIRECTION('',(1.,0.,0.));
#272=DIRECTION('',(-1.,0.,0.));
#273=DIRECTION('',(0.,1.,0.));
#274=DIRECTION('center_axis',(1.,0.,-3.33066907387547E-16));
#275=DIRECTION('ref_axis',(-3.33066907387547E-16,0.,-1.));
#276=DIRECTION('',(3.33066907387547E-16,0.,1.));
#277=DIRECTION('',(-3.33066907387547E-16,0.,-1.));
#278=DIRECTION('',(0.,1.,0.));
#279=DIRECTION('center_axis',(0.,0.,1.));
#280=DIRECTION('ref_axis',(1.,0.,0.));
#281=DIRECTION('',(-1.,0.,0.));
#282=DIRECTION('',(1.,0.,0.));
#283=DIRECTION('center_axis',(0.,-1.,0.));
#284=DIRECTION('ref_axis',(0.,0.,-1.));
#285=DIRECTION('center_axis',(0.,1.,0.));
#286=DIRECTION('ref_axis',(0.,0.,1.));
#287=CARTESIAN_POINT('',(0.,0.,0.));
#288=CARTESIAN_POINT('Origin',(-3.,-9.0415945787923,-8.));
#289=CARTESIAN_POINT('',(-4.0065,3.,-8.));
#290=CARTESIAN_POINT('',(-1.9935,3.,-8.));
#291=CARTESIAN_POINT('Origin',(-3.,3.,-8.));
#292=CARTESIAN_POINT('Origin',(-3.,3.,-8.));
#293=CARTESIAN_POINT('',(-1.9935,0.,-8.));
#294=CARTESIAN_POINT('',(-1.9935,-9.0415945787923,-8.));
#295=CARTESIAN_POINT('Origin',(-3.,0.,-8.));
#296=CARTESIAN_POINT('Origin',(-3.,0.4,-3.));
#297=CARTESIAN_POINT('',(-5.5,0.4,-3.));
#298=CARTESIAN_POINT('',(-0.500000000000002,0.4,-3.));
#299=CARTESIAN_POINT('Origin',(-3.,0.4,-3.));
#300=CARTESIAN_POINT('Origin',(-3.,0.4,-3.));
#301=CARTESIAN_POINT('',(-1.55,0.4,-3.));
#302=CARTESIAN_POINT('Origin',(-3.,0.4,-3.));
#303=CARTESIAN_POINT('Origin',(-3.,1.7,-3.));
#304=CARTESIAN_POINT('',(-5.5,3.,-3.));
#305=CARTESIAN_POINT('',(-0.500000000000002,3.,-3.));
#306=CARTESIAN_POINT('Origin',(-3.,3.,-3.));
#307=CARTESIAN_POINT('Origin',(-3.,3.,-3.));
#308=CARTESIAN_POINT('',(-0.500000000000002,1.7,-3.));
#309=CARTESIAN_POINT('Origin',(-3.,-9.0415945787923,-3.));
#310=CARTESIAN_POINT('',(-1.55,0.,-3.));
#311=CARTESIAN_POINT('',(-1.55,-9.0415945787923,-3.));
#312=CARTESIAN_POINT('Origin',(-3.,0.,-3.));
#313=CARTESIAN_POINT('Origin',(-6.,0.,-10.));
#314=CARTESIAN_POINT('',(-6.,0.,0.));
#315=CARTESIAN_POINT('',(-6.,0.,-10.));
#316=CARTESIAN_POINT('',(-6.,0.,0.));
#317=CARTESIAN_POINT('',(-6.,3.,0.));
#318=CARTESIAN_POINT('',(-6.,0.,0.));
#319=CARTESIAN_POINT('',(-6.,3.,-10.));
#320=CARTESIAN_POINT('',(-6.,3.,0.));
#321=CARTESIAN_POINT('',(-6.,0.,-10.));
#322=CARTESIAN_POINT('Origin',(-3.33066907387547E-15,0.,-10.));
#323=CARTESIAN_POINT('',(-3.33066907387547E-15,0.,-10.));
#324=CARTESIAN_POINT('',(-6.,0.,-10.));
#325=CARTESIAN_POINT('',(-3.33066907387547E-15,3.,-10.));
#326=CARTESIAN_POINT('',(-6.,3.,-10.));
#327=CARTESIAN_POINT('',(-3.33066907387547E-15,0.,-10.));
#328=CARTESIAN_POINT('Origin',(4.93038065763132E-31,0.,0.));
#329=CARTESIAN_POINT('',(0.,0.,0.));
#330=CARTESIAN_POINT('',(-3.33066907387547E-15,0.,-10.));
#331=CARTESIAN_POINT('',(0.,3.,0.));
#332=CARTESIAN_POINT('',(-3.33066907387547E-15,3.,-10.));
#333=CARTESIAN_POINT('',(0.,0.,0.));
#334=CARTESIAN_POINT('Origin',(-6.,0.,0.));
#335=CARTESIAN_POINT('',(0.,0.,0.));
#336=CARTESIAN_POINT('',(0.,3.,0.));
#337=CARTESIAN_POINT('Origin',(-3.,0.,-5.));
#338=CARTESIAN_POINT('Origin',(-3.,3.,-5.));
#339=UNCERTAINTY_MEASURE_WITH_UNIT(LENGTH_MEASURE(0.01),#343,
'DISTANCE_ACCURACY_VALUE',
'Maximum model space distance between geometric entities at asserted c
onnectivities');
#340=UNCERTAINTY_MEASURE_WITH_UNIT(LENGTH_MEASURE(0.01),#343,
'DISTANCE_ACCURACY_VALUE',
'Maximum model space distance between geometric entities at asserted c
onnectivities');
#341=(
GEOMETRIC_REPRESENTATION_CONTEXT(3)
GLOBAL_UNCERTAINTY_ASSIGNED_CONTEXT((#339))
GLOBAL_UNIT_ASSIGNED_CONTEXT((#343,#345,#346))
REPRESENTATION_CONTEXT('','3D')
);
#342=(
GEOMETRIC_REPRESENTATION_CONTEXT(3)
GLOBAL_UNCERTAINTY_ASSIGNED_CONTEXT((#340))
GLOBAL_UNIT_ASSIGNED_CONTEXT((#343,#345,#346))
REPRESENTATION_CONTEXT('','3D')
);
#343=(
LENGTH_UNIT()
NAMED_UNIT(*)
SI_UNIT(.MILLI.,.METRE.)
);
#344=(
LENGTH_UNIT()
NAMED_UNIT(*)
SI_UNIT(.CENTI.,.METRE.)
);
#345=(
NAMED_UNIT(*)
PLANE_ANGLE_UNIT()
SI_UNIT($,.RADIAN.)
);
#346=(
NAMED_UNIT(*)
SI_UNIT($,.STERADIAN.)
SOLID_ANGLE_UNIT()
);
#347=SHAPE_DEFINITION_REPRESENTATION(#348,#349);
#348=PRODUCT_DEFINITION_SHAPE('',$,#351);
#349=SHAPE_REPRESENTATION('',(#212),#341);
#350=PRODUCT_DEFINITION_CONTEXT('part definition',#355,'design');
#351=PRODUCT_DEFINITION('cover_standoff','cover_standoff',#352,#350);
#352=PRODUCT_DEFINITION_FORMATION('',$,#357);
#353=PRODUCT_RELATED_PRODUCT_CATEGORY('cover_standoff','cover_standoff',
(#357));
#354=APPLICATION_PROTOCOL_DEFINITION('international standard',
'automotive_design',2009,#355);
#355=APPLICATION_CONTEXT(
'Core Data for Automotive Mechanical Design Process');
#356=PRODUCT_CONTEXT('part definition',#355,'mechanical');
#357=PRODUCT('cover_standoff','cover_standoff',$,(#356));
#358=PRESENTATION_STYLE_ASSIGNMENT((#359));
#359=SURFACE_STYLE_USAGE(.BOTH.,#362);
#360=SURFACE_STYLE_RENDERING_WITH_PROPERTIES($,#366,(#361));
#361=SURFACE_STYLE_TRANSPARENT(0.);
#362=SURFACE_SIDE_STYLE('',(#363,#360));
#363=SURFACE_STYLE_FILL_AREA(#364);
#364=FILL_AREA_STYLE('',(#365));
#365=FILL_AREA_STYLE_COLOUR('',#366);
#366=COLOUR_RGB('',0.749019607843137,0.749019607843137,0.749019607843137);
ENDSEC;
END-ISO-10303-21;
