G04 #@! TF.GenerationSoftware,KiCad,Pcbnew,7.0.8*
G04 #@! TF.CreationDate,2024-03-01T18:25:40-05:00*
G04 #@! TF.ProjectId,carrier,63617272-6965-4722-9e6b-696361645f70,rev?*
G04 #@! TF.SameCoordinates,PX795bdf0PY16b59940*
G04 #@! TF.FileFunction,Other,Comment*
%FSLAX46Y46*%
G04 Gerber Fmt 4.6, Leading zero omitted, Abs format (unit mm)*
G04 Created by KiCad (PCBNEW 7.0.8) date 2024-03-01 18:25:40*
%MOMM*%
%LPD*%
G01*
G04 APERTURE LIST*
%ADD10C,0.002000*%
G04 #@! TA.AperFunction,Profile*
%ADD11C,0.152400*%
G04 #@! TD*
G04 APERTURE END LIST*
D10*
X261920553Y184298167D02*
X261926601Y184292119D01*
X261926601Y184292119D02*
X261932648Y184273977D01*
X261932648Y184273977D02*
X261932648Y184261881D01*
X261932648Y184261881D02*
X261926601Y184243738D01*
X261926601Y184243738D02*
X261914505Y184231643D01*
X261914505Y184231643D02*
X261902410Y184225596D01*
X261902410Y184225596D02*
X261878220Y184219548D01*
X261878220Y184219548D02*
X261860077Y184219548D01*
X261860077Y184219548D02*
X261835886Y184225596D01*
X261835886Y184225596D02*
X261823791Y184231643D01*
X261823791Y184231643D02*
X261811696Y184243738D01*
X261811696Y184243738D02*
X261805648Y184261881D01*
X261805648Y184261881D02*
X261805648Y184273977D01*
X261805648Y184273977D02*
X261811696Y184292119D01*
X261811696Y184292119D02*
X261817743Y184298167D01*
X261932648Y184370738D02*
X261926601Y184358643D01*
X261926601Y184358643D02*
X261920553Y184352596D01*
X261920553Y184352596D02*
X261908458Y184346548D01*
X261908458Y184346548D02*
X261872172Y184346548D01*
X261872172Y184346548D02*
X261860077Y184352596D01*
X261860077Y184352596D02*
X261854029Y184358643D01*
X261854029Y184358643D02*
X261847981Y184370738D01*
X261847981Y184370738D02*
X261847981Y184388881D01*
X261847981Y184388881D02*
X261854029Y184400977D01*
X261854029Y184400977D02*
X261860077Y184407024D01*
X261860077Y184407024D02*
X261872172Y184413072D01*
X261872172Y184413072D02*
X261908458Y184413072D01*
X261908458Y184413072D02*
X261920553Y184407024D01*
X261920553Y184407024D02*
X261926601Y184400977D01*
X261926601Y184400977D02*
X261932648Y184388881D01*
X261932648Y184388881D02*
X261932648Y184370738D01*
X261847981Y184467501D02*
X261974981Y184467501D01*
X261854029Y184467501D02*
X261847981Y184479596D01*
X261847981Y184479596D02*
X261847981Y184503786D01*
X261847981Y184503786D02*
X261854029Y184515882D01*
X261854029Y184515882D02*
X261860077Y184521929D01*
X261860077Y184521929D02*
X261872172Y184527977D01*
X261872172Y184527977D02*
X261908458Y184527977D01*
X261908458Y184527977D02*
X261920553Y184521929D01*
X261920553Y184521929D02*
X261926601Y184515882D01*
X261926601Y184515882D02*
X261932648Y184503786D01*
X261932648Y184503786D02*
X261932648Y184479596D01*
X261932648Y184479596D02*
X261926601Y184467501D01*
X261847981Y184570310D02*
X261932648Y184600548D01*
X261847981Y184630787D02*
X261932648Y184600548D01*
X261932648Y184600548D02*
X261962886Y184588453D01*
X261962886Y184588453D02*
X261968934Y184582406D01*
X261968934Y184582406D02*
X261974981Y184570310D01*
X261932648Y184679168D02*
X261847981Y184679168D01*
X261872172Y184679168D02*
X261860077Y184685215D01*
X261860077Y184685215D02*
X261854029Y184691263D01*
X261854029Y184691263D02*
X261847981Y184703358D01*
X261847981Y184703358D02*
X261847981Y184715453D01*
X261932648Y184757787D02*
X261847981Y184757787D01*
X261805648Y184757787D02*
X261811696Y184751739D01*
X261811696Y184751739D02*
X261817743Y184757787D01*
X261817743Y184757787D02*
X261811696Y184763834D01*
X261811696Y184763834D02*
X261805648Y184757787D01*
X261805648Y184757787D02*
X261817743Y184757787D01*
X261847981Y184872691D02*
X261950791Y184872691D01*
X261950791Y184872691D02*
X261962886Y184866644D01*
X261962886Y184866644D02*
X261968934Y184860596D01*
X261968934Y184860596D02*
X261974981Y184848501D01*
X261974981Y184848501D02*
X261974981Y184830358D01*
X261974981Y184830358D02*
X261968934Y184818263D01*
X261926601Y184872691D02*
X261932648Y184860596D01*
X261932648Y184860596D02*
X261932648Y184836405D01*
X261932648Y184836405D02*
X261926601Y184824310D01*
X261926601Y184824310D02*
X261920553Y184818263D01*
X261920553Y184818263D02*
X261908458Y184812215D01*
X261908458Y184812215D02*
X261872172Y184812215D01*
X261872172Y184812215D02*
X261860077Y184818263D01*
X261860077Y184818263D02*
X261854029Y184824310D01*
X261854029Y184824310D02*
X261847981Y184836405D01*
X261847981Y184836405D02*
X261847981Y184860596D01*
X261847981Y184860596D02*
X261854029Y184872691D01*
X261932648Y184933168D02*
X261805648Y184933168D01*
X261932648Y184987596D02*
X261866124Y184987596D01*
X261866124Y184987596D02*
X261854029Y184981549D01*
X261854029Y184981549D02*
X261847981Y184969453D01*
X261847981Y184969453D02*
X261847981Y184951310D01*
X261847981Y184951310D02*
X261854029Y184939215D01*
X261854029Y184939215D02*
X261860077Y184933168D01*
X261847981Y185029930D02*
X261847981Y185078311D01*
X261805648Y185048073D02*
X261914505Y185048073D01*
X261914505Y185048073D02*
X261926601Y185054120D01*
X261926601Y185054120D02*
X261932648Y185066215D01*
X261932648Y185066215D02*
X261932648Y185078311D01*
X261817743Y185211358D02*
X261811696Y185217406D01*
X261811696Y185217406D02*
X261805648Y185229501D01*
X261805648Y185229501D02*
X261805648Y185259739D01*
X261805648Y185259739D02*
X261811696Y185271834D01*
X261811696Y185271834D02*
X261817743Y185277882D01*
X261817743Y185277882D02*
X261829839Y185283929D01*
X261829839Y185283929D02*
X261841934Y185283929D01*
X261841934Y185283929D02*
X261860077Y185277882D01*
X261860077Y185277882D02*
X261932648Y185205310D01*
X261932648Y185205310D02*
X261932648Y185283929D01*
X261805648Y185362548D02*
X261805648Y185374643D01*
X261805648Y185374643D02*
X261811696Y185386739D01*
X261811696Y185386739D02*
X261817743Y185392786D01*
X261817743Y185392786D02*
X261829839Y185398834D01*
X261829839Y185398834D02*
X261854029Y185404881D01*
X261854029Y185404881D02*
X261884267Y185404881D01*
X261884267Y185404881D02*
X261908458Y185398834D01*
X261908458Y185398834D02*
X261920553Y185392786D01*
X261920553Y185392786D02*
X261926601Y185386739D01*
X261926601Y185386739D02*
X261932648Y185374643D01*
X261932648Y185374643D02*
X261932648Y185362548D01*
X261932648Y185362548D02*
X261926601Y185350453D01*
X261926601Y185350453D02*
X261920553Y185344405D01*
X261920553Y185344405D02*
X261908458Y185338358D01*
X261908458Y185338358D02*
X261884267Y185332310D01*
X261884267Y185332310D02*
X261854029Y185332310D01*
X261854029Y185332310D02*
X261829839Y185338358D01*
X261829839Y185338358D02*
X261817743Y185344405D01*
X261817743Y185344405D02*
X261811696Y185350453D01*
X261811696Y185350453D02*
X261805648Y185362548D01*
X261932648Y185525833D02*
X261932648Y185453262D01*
X261932648Y185489548D02*
X261805648Y185489548D01*
X261805648Y185489548D02*
X261823791Y185477452D01*
X261823791Y185477452D02*
X261835886Y185465357D01*
X261835886Y185465357D02*
X261841934Y185453262D01*
X261805648Y185634690D02*
X261805648Y185610500D01*
X261805648Y185610500D02*
X261811696Y185598404D01*
X261811696Y185598404D02*
X261817743Y185592357D01*
X261817743Y185592357D02*
X261835886Y185580262D01*
X261835886Y185580262D02*
X261860077Y185574214D01*
X261860077Y185574214D02*
X261908458Y185574214D01*
X261908458Y185574214D02*
X261920553Y185580262D01*
X261920553Y185580262D02*
X261926601Y185586309D01*
X261926601Y185586309D02*
X261932648Y185598404D01*
X261932648Y185598404D02*
X261932648Y185622595D01*
X261932648Y185622595D02*
X261926601Y185634690D01*
X261926601Y185634690D02*
X261920553Y185640738D01*
X261920553Y185640738D02*
X261908458Y185646785D01*
X261908458Y185646785D02*
X261878220Y185646785D01*
X261878220Y185646785D02*
X261866124Y185640738D01*
X261866124Y185640738D02*
X261860077Y185634690D01*
X261860077Y185634690D02*
X261854029Y185622595D01*
X261854029Y185622595D02*
X261854029Y185598404D01*
X261854029Y185598404D02*
X261860077Y185586309D01*
X261860077Y185586309D02*
X261866124Y185580262D01*
X261866124Y185580262D02*
X261878220Y185574214D01*
X261896362Y185791928D02*
X261896362Y185852404D01*
X261932648Y185779833D02*
X261805648Y185822166D01*
X261805648Y185822166D02*
X261932648Y185864499D01*
X261926601Y185961261D02*
X261932648Y185949166D01*
X261932648Y185949166D02*
X261932648Y185924975D01*
X261932648Y185924975D02*
X261926601Y185912880D01*
X261926601Y185912880D02*
X261920553Y185906833D01*
X261920553Y185906833D02*
X261908458Y185900785D01*
X261908458Y185900785D02*
X261872172Y185900785D01*
X261872172Y185900785D02*
X261860077Y185906833D01*
X261860077Y185906833D02*
X261854029Y185912880D01*
X261854029Y185912880D02*
X261847981Y185924975D01*
X261847981Y185924975D02*
X261847981Y185949166D01*
X261847981Y185949166D02*
X261854029Y185961261D01*
X261926601Y186070118D02*
X261932648Y186058023D01*
X261932648Y186058023D02*
X261932648Y186033832D01*
X261932648Y186033832D02*
X261926601Y186021737D01*
X261926601Y186021737D02*
X261920553Y186015690D01*
X261920553Y186015690D02*
X261908458Y186009642D01*
X261908458Y186009642D02*
X261872172Y186009642D01*
X261872172Y186009642D02*
X261860077Y186015690D01*
X261860077Y186015690D02*
X261854029Y186021737D01*
X261854029Y186021737D02*
X261847981Y186033832D01*
X261847981Y186033832D02*
X261847981Y186058023D01*
X261847981Y186058023D02*
X261854029Y186070118D01*
X261926601Y186172928D02*
X261932648Y186160832D01*
X261932648Y186160832D02*
X261932648Y186136642D01*
X261932648Y186136642D02*
X261926601Y186124547D01*
X261926601Y186124547D02*
X261914505Y186118499D01*
X261914505Y186118499D02*
X261866124Y186118499D01*
X261866124Y186118499D02*
X261854029Y186124547D01*
X261854029Y186124547D02*
X261847981Y186136642D01*
X261847981Y186136642D02*
X261847981Y186160832D01*
X261847981Y186160832D02*
X261854029Y186172928D01*
X261854029Y186172928D02*
X261866124Y186178975D01*
X261866124Y186178975D02*
X261878220Y186178975D01*
X261878220Y186178975D02*
X261890315Y186118499D01*
X261932648Y186251546D02*
X261926601Y186239451D01*
X261926601Y186239451D02*
X261914505Y186233404D01*
X261914505Y186233404D02*
X261805648Y186233404D01*
X261926601Y186348309D02*
X261932648Y186336213D01*
X261932648Y186336213D02*
X261932648Y186312023D01*
X261932648Y186312023D02*
X261926601Y186299928D01*
X261926601Y186299928D02*
X261914505Y186293880D01*
X261914505Y186293880D02*
X261866124Y186293880D01*
X261866124Y186293880D02*
X261854029Y186299928D01*
X261854029Y186299928D02*
X261847981Y186312023D01*
X261847981Y186312023D02*
X261847981Y186336213D01*
X261847981Y186336213D02*
X261854029Y186348309D01*
X261854029Y186348309D02*
X261866124Y186354356D01*
X261866124Y186354356D02*
X261878220Y186354356D01*
X261878220Y186354356D02*
X261890315Y186293880D01*
X261932648Y186408785D02*
X261847981Y186408785D01*
X261872172Y186408785D02*
X261860077Y186414832D01*
X261860077Y186414832D02*
X261854029Y186420880D01*
X261854029Y186420880D02*
X261847981Y186432975D01*
X261847981Y186432975D02*
X261847981Y186445070D01*
X261932648Y186541832D02*
X261866124Y186541832D01*
X261866124Y186541832D02*
X261854029Y186535785D01*
X261854029Y186535785D02*
X261847981Y186523689D01*
X261847981Y186523689D02*
X261847981Y186499499D01*
X261847981Y186499499D02*
X261854029Y186487404D01*
X261926601Y186541832D02*
X261932648Y186529737D01*
X261932648Y186529737D02*
X261932648Y186499499D01*
X261932648Y186499499D02*
X261926601Y186487404D01*
X261926601Y186487404D02*
X261914505Y186481356D01*
X261914505Y186481356D02*
X261902410Y186481356D01*
X261902410Y186481356D02*
X261890315Y186487404D01*
X261890315Y186487404D02*
X261884267Y186499499D01*
X261884267Y186499499D02*
X261884267Y186529737D01*
X261884267Y186529737D02*
X261878220Y186541832D01*
X261847981Y186584166D02*
X261847981Y186632547D01*
X261805648Y186602309D02*
X261914505Y186602309D01*
X261914505Y186602309D02*
X261926601Y186608356D01*
X261926601Y186608356D02*
X261932648Y186620451D01*
X261932648Y186620451D02*
X261932648Y186632547D01*
X261926601Y186723261D02*
X261932648Y186711165D01*
X261932648Y186711165D02*
X261932648Y186686975D01*
X261932648Y186686975D02*
X261926601Y186674880D01*
X261926601Y186674880D02*
X261914505Y186668832D01*
X261914505Y186668832D02*
X261866124Y186668832D01*
X261866124Y186668832D02*
X261854029Y186674880D01*
X261854029Y186674880D02*
X261847981Y186686975D01*
X261847981Y186686975D02*
X261847981Y186711165D01*
X261847981Y186711165D02*
X261854029Y186723261D01*
X261854029Y186723261D02*
X261866124Y186729308D01*
X261866124Y186729308D02*
X261878220Y186729308D01*
X261878220Y186729308D02*
X261890315Y186668832D01*
X261932648Y186838165D02*
X261805648Y186838165D01*
X261926601Y186838165D02*
X261932648Y186826070D01*
X261932648Y186826070D02*
X261932648Y186801879D01*
X261932648Y186801879D02*
X261926601Y186789784D01*
X261926601Y186789784D02*
X261920553Y186783737D01*
X261920553Y186783737D02*
X261908458Y186777689D01*
X261908458Y186777689D02*
X261872172Y186777689D01*
X261872172Y186777689D02*
X261860077Y186783737D01*
X261860077Y186783737D02*
X261854029Y186789784D01*
X261854029Y186789784D02*
X261847981Y186801879D01*
X261847981Y186801879D02*
X261847981Y186826070D01*
X261847981Y186826070D02*
X261854029Y186838165D01*
X261932648Y186995404D02*
X261805648Y186995404D01*
X261805648Y186995404D02*
X261805648Y187025642D01*
X261805648Y187025642D02*
X261811696Y187043785D01*
X261811696Y187043785D02*
X261823791Y187055880D01*
X261823791Y187055880D02*
X261835886Y187061927D01*
X261835886Y187061927D02*
X261860077Y187067975D01*
X261860077Y187067975D02*
X261878220Y187067975D01*
X261878220Y187067975D02*
X261902410Y187061927D01*
X261902410Y187061927D02*
X261914505Y187055880D01*
X261914505Y187055880D02*
X261926601Y187043785D01*
X261926601Y187043785D02*
X261932648Y187025642D01*
X261932648Y187025642D02*
X261932648Y186995404D01*
X261926601Y187170785D02*
X261932648Y187158689D01*
X261932648Y187158689D02*
X261932648Y187134499D01*
X261932648Y187134499D02*
X261926601Y187122404D01*
X261926601Y187122404D02*
X261914505Y187116356D01*
X261914505Y187116356D02*
X261866124Y187116356D01*
X261866124Y187116356D02*
X261854029Y187122404D01*
X261854029Y187122404D02*
X261847981Y187134499D01*
X261847981Y187134499D02*
X261847981Y187158689D01*
X261847981Y187158689D02*
X261854029Y187170785D01*
X261854029Y187170785D02*
X261866124Y187176832D01*
X261866124Y187176832D02*
X261878220Y187176832D01*
X261878220Y187176832D02*
X261890315Y187116356D01*
X261926601Y187225213D02*
X261932648Y187237308D01*
X261932648Y187237308D02*
X261932648Y187261499D01*
X261932648Y187261499D02*
X261926601Y187273594D01*
X261926601Y187273594D02*
X261914505Y187279642D01*
X261914505Y187279642D02*
X261908458Y187279642D01*
X261908458Y187279642D02*
X261896362Y187273594D01*
X261896362Y187273594D02*
X261890315Y187261499D01*
X261890315Y187261499D02*
X261890315Y187243356D01*
X261890315Y187243356D02*
X261884267Y187231261D01*
X261884267Y187231261D02*
X261872172Y187225213D01*
X261872172Y187225213D02*
X261866124Y187225213D01*
X261866124Y187225213D02*
X261854029Y187231261D01*
X261854029Y187231261D02*
X261847981Y187243356D01*
X261847981Y187243356D02*
X261847981Y187261499D01*
X261847981Y187261499D02*
X261854029Y187273594D01*
X261932648Y187334071D02*
X261847981Y187334071D01*
X261805648Y187334071D02*
X261811696Y187328023D01*
X261811696Y187328023D02*
X261817743Y187334071D01*
X261817743Y187334071D02*
X261811696Y187340118D01*
X261811696Y187340118D02*
X261805648Y187334071D01*
X261805648Y187334071D02*
X261817743Y187334071D01*
X261847981Y187448975D02*
X261950791Y187448975D01*
X261950791Y187448975D02*
X261962886Y187442928D01*
X261962886Y187442928D02*
X261968934Y187436880D01*
X261968934Y187436880D02*
X261974981Y187424785D01*
X261974981Y187424785D02*
X261974981Y187406642D01*
X261974981Y187406642D02*
X261968934Y187394547D01*
X261926601Y187448975D02*
X261932648Y187436880D01*
X261932648Y187436880D02*
X261932648Y187412689D01*
X261932648Y187412689D02*
X261926601Y187400594D01*
X261926601Y187400594D02*
X261920553Y187394547D01*
X261920553Y187394547D02*
X261908458Y187388499D01*
X261908458Y187388499D02*
X261872172Y187388499D01*
X261872172Y187388499D02*
X261860077Y187394547D01*
X261860077Y187394547D02*
X261854029Y187400594D01*
X261854029Y187400594D02*
X261847981Y187412689D01*
X261847981Y187412689D02*
X261847981Y187436880D01*
X261847981Y187436880D02*
X261854029Y187448975D01*
X261847981Y187509452D02*
X261932648Y187509452D01*
X261860077Y187509452D02*
X261854029Y187515499D01*
X261854029Y187515499D02*
X261847981Y187527594D01*
X261847981Y187527594D02*
X261847981Y187545737D01*
X261847981Y187545737D02*
X261854029Y187557833D01*
X261854029Y187557833D02*
X261866124Y187563880D01*
X261866124Y187563880D02*
X261932648Y187563880D01*
X261926601Y187618309D02*
X261932648Y187630404D01*
X261932648Y187630404D02*
X261932648Y187654595D01*
X261932648Y187654595D02*
X261926601Y187666690D01*
X261926601Y187666690D02*
X261914505Y187672738D01*
X261914505Y187672738D02*
X261908458Y187672738D01*
X261908458Y187672738D02*
X261896362Y187666690D01*
X261896362Y187666690D02*
X261890315Y187654595D01*
X261890315Y187654595D02*
X261890315Y187636452D01*
X261890315Y187636452D02*
X261884267Y187624357D01*
X261884267Y187624357D02*
X261872172Y187618309D01*
X261872172Y187618309D02*
X261866124Y187618309D01*
X261866124Y187618309D02*
X261854029Y187624357D01*
X261854029Y187624357D02*
X261847981Y187636452D01*
X261847981Y187636452D02*
X261847981Y187654595D01*
X261847981Y187654595D02*
X261854029Y187666690D01*
X261920553Y187727167D02*
X261926601Y187733214D01*
X261926601Y187733214D02*
X261932648Y187727167D01*
X261932648Y187727167D02*
X261926601Y187721119D01*
X261926601Y187721119D02*
X261920553Y187727167D01*
X261920553Y187727167D02*
X261932648Y187727167D01*
X261896362Y187878357D02*
X261896362Y187938833D01*
X261932648Y187866262D02*
X261805648Y187908595D01*
X261805648Y187908595D02*
X261932648Y187950928D01*
X261932648Y188011404D02*
X261926601Y187999309D01*
X261926601Y187999309D02*
X261914505Y187993262D01*
X261914505Y187993262D02*
X261805648Y187993262D01*
X261932648Y188077928D02*
X261926601Y188065833D01*
X261926601Y188065833D02*
X261914505Y188059786D01*
X261914505Y188059786D02*
X261805648Y188059786D01*
X261932648Y188223072D02*
X261847981Y188223072D01*
X261872172Y188223072D02*
X261860077Y188229119D01*
X261860077Y188229119D02*
X261854029Y188235167D01*
X261854029Y188235167D02*
X261847981Y188247262D01*
X261847981Y188247262D02*
X261847981Y188259357D01*
X261932648Y188301691D02*
X261847981Y188301691D01*
X261805648Y188301691D02*
X261811696Y188295643D01*
X261811696Y188295643D02*
X261817743Y188301691D01*
X261817743Y188301691D02*
X261811696Y188307738D01*
X261811696Y188307738D02*
X261805648Y188301691D01*
X261805648Y188301691D02*
X261817743Y188301691D01*
X261847981Y188416595D02*
X261950791Y188416595D01*
X261950791Y188416595D02*
X261962886Y188410548D01*
X261962886Y188410548D02*
X261968934Y188404500D01*
X261968934Y188404500D02*
X261974981Y188392405D01*
X261974981Y188392405D02*
X261974981Y188374262D01*
X261974981Y188374262D02*
X261968934Y188362167D01*
X261926601Y188416595D02*
X261932648Y188404500D01*
X261932648Y188404500D02*
X261932648Y188380309D01*
X261932648Y188380309D02*
X261926601Y188368214D01*
X261926601Y188368214D02*
X261920553Y188362167D01*
X261920553Y188362167D02*
X261908458Y188356119D01*
X261908458Y188356119D02*
X261872172Y188356119D01*
X261872172Y188356119D02*
X261860077Y188362167D01*
X261860077Y188362167D02*
X261854029Y188368214D01*
X261854029Y188368214D02*
X261847981Y188380309D01*
X261847981Y188380309D02*
X261847981Y188404500D01*
X261847981Y188404500D02*
X261854029Y188416595D01*
X261932648Y188477072D02*
X261805648Y188477072D01*
X261932648Y188531500D02*
X261866124Y188531500D01*
X261866124Y188531500D02*
X261854029Y188525453D01*
X261854029Y188525453D02*
X261847981Y188513357D01*
X261847981Y188513357D02*
X261847981Y188495214D01*
X261847981Y188495214D02*
X261854029Y188483119D01*
X261854029Y188483119D02*
X261860077Y188477072D01*
X261847981Y188573834D02*
X261847981Y188622215D01*
X261805648Y188591977D02*
X261914505Y188591977D01*
X261914505Y188591977D02*
X261926601Y188598024D01*
X261926601Y188598024D02*
X261932648Y188610119D01*
X261932648Y188610119D02*
X261932648Y188622215D01*
X261926601Y188658500D02*
X261932648Y188670595D01*
X261932648Y188670595D02*
X261932648Y188694786D01*
X261932648Y188694786D02*
X261926601Y188706881D01*
X261926601Y188706881D02*
X261914505Y188712929D01*
X261914505Y188712929D02*
X261908458Y188712929D01*
X261908458Y188712929D02*
X261896362Y188706881D01*
X261896362Y188706881D02*
X261890315Y188694786D01*
X261890315Y188694786D02*
X261890315Y188676643D01*
X261890315Y188676643D02*
X261884267Y188664548D01*
X261884267Y188664548D02*
X261872172Y188658500D01*
X261872172Y188658500D02*
X261866124Y188658500D01*
X261866124Y188658500D02*
X261854029Y188664548D01*
X261854029Y188664548D02*
X261847981Y188676643D01*
X261847981Y188676643D02*
X261847981Y188694786D01*
X261847981Y188694786D02*
X261854029Y188706881D01*
X261932648Y188864120D02*
X261847981Y188864120D01*
X261872172Y188864120D02*
X261860077Y188870167D01*
X261860077Y188870167D02*
X261854029Y188876215D01*
X261854029Y188876215D02*
X261847981Y188888310D01*
X261847981Y188888310D02*
X261847981Y188900405D01*
X261926601Y188991120D02*
X261932648Y188979024D01*
X261932648Y188979024D02*
X261932648Y188954834D01*
X261932648Y188954834D02*
X261926601Y188942739D01*
X261926601Y188942739D02*
X261914505Y188936691D01*
X261914505Y188936691D02*
X261866124Y188936691D01*
X261866124Y188936691D02*
X261854029Y188942739D01*
X261854029Y188942739D02*
X261847981Y188954834D01*
X261847981Y188954834D02*
X261847981Y188979024D01*
X261847981Y188979024D02*
X261854029Y188991120D01*
X261854029Y188991120D02*
X261866124Y188997167D01*
X261866124Y188997167D02*
X261878220Y188997167D01*
X261878220Y188997167D02*
X261890315Y188936691D01*
X261926601Y189045548D02*
X261932648Y189057643D01*
X261932648Y189057643D02*
X261932648Y189081834D01*
X261932648Y189081834D02*
X261926601Y189093929D01*
X261926601Y189093929D02*
X261914505Y189099977D01*
X261914505Y189099977D02*
X261908458Y189099977D01*
X261908458Y189099977D02*
X261896362Y189093929D01*
X261896362Y189093929D02*
X261890315Y189081834D01*
X261890315Y189081834D02*
X261890315Y189063691D01*
X261890315Y189063691D02*
X261884267Y189051596D01*
X261884267Y189051596D02*
X261872172Y189045548D01*
X261872172Y189045548D02*
X261866124Y189045548D01*
X261866124Y189045548D02*
X261854029Y189051596D01*
X261854029Y189051596D02*
X261847981Y189063691D01*
X261847981Y189063691D02*
X261847981Y189081834D01*
X261847981Y189081834D02*
X261854029Y189093929D01*
X261926601Y189202787D02*
X261932648Y189190691D01*
X261932648Y189190691D02*
X261932648Y189166501D01*
X261932648Y189166501D02*
X261926601Y189154406D01*
X261926601Y189154406D02*
X261914505Y189148358D01*
X261914505Y189148358D02*
X261866124Y189148358D01*
X261866124Y189148358D02*
X261854029Y189154406D01*
X261854029Y189154406D02*
X261847981Y189166501D01*
X261847981Y189166501D02*
X261847981Y189190691D01*
X261847981Y189190691D02*
X261854029Y189202787D01*
X261854029Y189202787D02*
X261866124Y189208834D01*
X261866124Y189208834D02*
X261878220Y189208834D01*
X261878220Y189208834D02*
X261890315Y189148358D01*
X261932648Y189263263D02*
X261847981Y189263263D01*
X261872172Y189263263D02*
X261860077Y189269310D01*
X261860077Y189269310D02*
X261854029Y189275358D01*
X261854029Y189275358D02*
X261847981Y189287453D01*
X261847981Y189287453D02*
X261847981Y189299548D01*
X261847981Y189329786D02*
X261932648Y189360024D01*
X261932648Y189360024D02*
X261847981Y189390263D01*
X261926601Y189487025D02*
X261932648Y189474929D01*
X261932648Y189474929D02*
X261932648Y189450739D01*
X261932648Y189450739D02*
X261926601Y189438644D01*
X261926601Y189438644D02*
X261914505Y189432596D01*
X261914505Y189432596D02*
X261866124Y189432596D01*
X261866124Y189432596D02*
X261854029Y189438644D01*
X261854029Y189438644D02*
X261847981Y189450739D01*
X261847981Y189450739D02*
X261847981Y189474929D01*
X261847981Y189474929D02*
X261854029Y189487025D01*
X261854029Y189487025D02*
X261866124Y189493072D01*
X261866124Y189493072D02*
X261878220Y189493072D01*
X261878220Y189493072D02*
X261890315Y189432596D01*
X261932648Y189601929D02*
X261805648Y189601929D01*
X261926601Y189601929D02*
X261932648Y189589834D01*
X261932648Y189589834D02*
X261932648Y189565643D01*
X261932648Y189565643D02*
X261926601Y189553548D01*
X261926601Y189553548D02*
X261920553Y189547501D01*
X261920553Y189547501D02*
X261908458Y189541453D01*
X261908458Y189541453D02*
X261872172Y189541453D01*
X261872172Y189541453D02*
X261860077Y189547501D01*
X261860077Y189547501D02*
X261854029Y189553548D01*
X261854029Y189553548D02*
X261847981Y189565643D01*
X261847981Y189565643D02*
X261847981Y189589834D01*
X261847981Y189589834D02*
X261854029Y189601929D01*
X261920553Y189662406D02*
X261926601Y189668453D01*
X261926601Y189668453D02*
X261932648Y189662406D01*
X261932648Y189662406D02*
X261926601Y189656358D01*
X261926601Y189656358D02*
X261920553Y189662406D01*
X261920553Y189662406D02*
X261932648Y189662406D01*
X252370166Y188167447D02*
X252364118Y188161399D01*
X252364118Y188161399D02*
X252345976Y188155352D01*
X252345976Y188155352D02*
X252333880Y188155352D01*
X252333880Y188155352D02*
X252315737Y188161399D01*
X252315737Y188161399D02*
X252303642Y188173495D01*
X252303642Y188173495D02*
X252297595Y188185590D01*
X252297595Y188185590D02*
X252291547Y188209780D01*
X252291547Y188209780D02*
X252291547Y188227923D01*
X252291547Y188227923D02*
X252297595Y188252114D01*
X252297595Y188252114D02*
X252303642Y188264209D01*
X252303642Y188264209D02*
X252315737Y188276304D01*
X252315737Y188276304D02*
X252333880Y188282352D01*
X252333880Y188282352D02*
X252345976Y188282352D01*
X252345976Y188282352D02*
X252364118Y188276304D01*
X252364118Y188276304D02*
X252370166Y188270257D01*
X252442737Y188155352D02*
X252430642Y188161399D01*
X252430642Y188161399D02*
X252424595Y188167447D01*
X252424595Y188167447D02*
X252418547Y188179542D01*
X252418547Y188179542D02*
X252418547Y188215828D01*
X252418547Y188215828D02*
X252424595Y188227923D01*
X252424595Y188227923D02*
X252430642Y188233971D01*
X252430642Y188233971D02*
X252442737Y188240019D01*
X252442737Y188240019D02*
X252460880Y188240019D01*
X252460880Y188240019D02*
X252472976Y188233971D01*
X252472976Y188233971D02*
X252479023Y188227923D01*
X252479023Y188227923D02*
X252485071Y188215828D01*
X252485071Y188215828D02*
X252485071Y188179542D01*
X252485071Y188179542D02*
X252479023Y188167447D01*
X252479023Y188167447D02*
X252472976Y188161399D01*
X252472976Y188161399D02*
X252460880Y188155352D01*
X252460880Y188155352D02*
X252442737Y188155352D01*
X252539500Y188240019D02*
X252539500Y188113019D01*
X252539500Y188233971D02*
X252551595Y188240019D01*
X252551595Y188240019D02*
X252575785Y188240019D01*
X252575785Y188240019D02*
X252587881Y188233971D01*
X252587881Y188233971D02*
X252593928Y188227923D01*
X252593928Y188227923D02*
X252599976Y188215828D01*
X252599976Y188215828D02*
X252599976Y188179542D01*
X252599976Y188179542D02*
X252593928Y188167447D01*
X252593928Y188167447D02*
X252587881Y188161399D01*
X252587881Y188161399D02*
X252575785Y188155352D01*
X252575785Y188155352D02*
X252551595Y188155352D01*
X252551595Y188155352D02*
X252539500Y188161399D01*
X252642309Y188240019D02*
X252672547Y188155352D01*
X252702786Y188240019D02*
X252672547Y188155352D01*
X252672547Y188155352D02*
X252660452Y188125114D01*
X252660452Y188125114D02*
X252654405Y188119066D01*
X252654405Y188119066D02*
X252642309Y188113019D01*
X252751167Y188155352D02*
X252751167Y188240019D01*
X252751167Y188215828D02*
X252757214Y188227923D01*
X252757214Y188227923D02*
X252763262Y188233971D01*
X252763262Y188233971D02*
X252775357Y188240019D01*
X252775357Y188240019D02*
X252787452Y188240019D01*
X252829786Y188155352D02*
X252829786Y188240019D01*
X252829786Y188282352D02*
X252823738Y188276304D01*
X252823738Y188276304D02*
X252829786Y188270257D01*
X252829786Y188270257D02*
X252835833Y188276304D01*
X252835833Y188276304D02*
X252829786Y188282352D01*
X252829786Y188282352D02*
X252829786Y188270257D01*
X252944690Y188240019D02*
X252944690Y188137209D01*
X252944690Y188137209D02*
X252938643Y188125114D01*
X252938643Y188125114D02*
X252932595Y188119066D01*
X252932595Y188119066D02*
X252920500Y188113019D01*
X252920500Y188113019D02*
X252902357Y188113019D01*
X252902357Y188113019D02*
X252890262Y188119066D01*
X252944690Y188161399D02*
X252932595Y188155352D01*
X252932595Y188155352D02*
X252908404Y188155352D01*
X252908404Y188155352D02*
X252896309Y188161399D01*
X252896309Y188161399D02*
X252890262Y188167447D01*
X252890262Y188167447D02*
X252884214Y188179542D01*
X252884214Y188179542D02*
X252884214Y188215828D01*
X252884214Y188215828D02*
X252890262Y188227923D01*
X252890262Y188227923D02*
X252896309Y188233971D01*
X252896309Y188233971D02*
X252908404Y188240019D01*
X252908404Y188240019D02*
X252932595Y188240019D01*
X252932595Y188240019D02*
X252944690Y188233971D01*
X253005167Y188155352D02*
X253005167Y188282352D01*
X253059595Y188155352D02*
X253059595Y188221876D01*
X253059595Y188221876D02*
X253053548Y188233971D01*
X253053548Y188233971D02*
X253041452Y188240019D01*
X253041452Y188240019D02*
X253023309Y188240019D01*
X253023309Y188240019D02*
X253011214Y188233971D01*
X253011214Y188233971D02*
X253005167Y188227923D01*
X253101929Y188240019D02*
X253150310Y188240019D01*
X253120072Y188282352D02*
X253120072Y188173495D01*
X253120072Y188173495D02*
X253126119Y188161399D01*
X253126119Y188161399D02*
X253138214Y188155352D01*
X253138214Y188155352D02*
X253150310Y188155352D01*
X253283357Y188270257D02*
X253289405Y188276304D01*
X253289405Y188276304D02*
X253301500Y188282352D01*
X253301500Y188282352D02*
X253331738Y188282352D01*
X253331738Y188282352D02*
X253343833Y188276304D01*
X253343833Y188276304D02*
X253349881Y188270257D01*
X253349881Y188270257D02*
X253355928Y188258161D01*
X253355928Y188258161D02*
X253355928Y188246066D01*
X253355928Y188246066D02*
X253349881Y188227923D01*
X253349881Y188227923D02*
X253277309Y188155352D01*
X253277309Y188155352D02*
X253355928Y188155352D01*
X253434547Y188282352D02*
X253446642Y188282352D01*
X253446642Y188282352D02*
X253458738Y188276304D01*
X253458738Y188276304D02*
X253464785Y188270257D01*
X253464785Y188270257D02*
X253470833Y188258161D01*
X253470833Y188258161D02*
X253476880Y188233971D01*
X253476880Y188233971D02*
X253476880Y188203733D01*
X253476880Y188203733D02*
X253470833Y188179542D01*
X253470833Y188179542D02*
X253464785Y188167447D01*
X253464785Y188167447D02*
X253458738Y188161399D01*
X253458738Y188161399D02*
X253446642Y188155352D01*
X253446642Y188155352D02*
X253434547Y188155352D01*
X253434547Y188155352D02*
X253422452Y188161399D01*
X253422452Y188161399D02*
X253416404Y188167447D01*
X253416404Y188167447D02*
X253410357Y188179542D01*
X253410357Y188179542D02*
X253404309Y188203733D01*
X253404309Y188203733D02*
X253404309Y188233971D01*
X253404309Y188233971D02*
X253410357Y188258161D01*
X253410357Y188258161D02*
X253416404Y188270257D01*
X253416404Y188270257D02*
X253422452Y188276304D01*
X253422452Y188276304D02*
X253434547Y188282352D01*
X253597832Y188155352D02*
X253525261Y188155352D01*
X253561547Y188155352D02*
X253561547Y188282352D01*
X253561547Y188282352D02*
X253549451Y188264209D01*
X253549451Y188264209D02*
X253537356Y188252114D01*
X253537356Y188252114D02*
X253525261Y188246066D01*
X253706689Y188282352D02*
X253682499Y188282352D01*
X253682499Y188282352D02*
X253670403Y188276304D01*
X253670403Y188276304D02*
X253664356Y188270257D01*
X253664356Y188270257D02*
X253652261Y188252114D01*
X253652261Y188252114D02*
X253646213Y188227923D01*
X253646213Y188227923D02*
X253646213Y188179542D01*
X253646213Y188179542D02*
X253652261Y188167447D01*
X253652261Y188167447D02*
X253658308Y188161399D01*
X253658308Y188161399D02*
X253670403Y188155352D01*
X253670403Y188155352D02*
X253694594Y188155352D01*
X253694594Y188155352D02*
X253706689Y188161399D01*
X253706689Y188161399D02*
X253712737Y188167447D01*
X253712737Y188167447D02*
X253718784Y188179542D01*
X253718784Y188179542D02*
X253718784Y188209780D01*
X253718784Y188209780D02*
X253712737Y188221876D01*
X253712737Y188221876D02*
X253706689Y188227923D01*
X253706689Y188227923D02*
X253694594Y188233971D01*
X253694594Y188233971D02*
X253670403Y188233971D01*
X253670403Y188233971D02*
X253658308Y188227923D01*
X253658308Y188227923D02*
X253652261Y188221876D01*
X253652261Y188221876D02*
X253646213Y188209780D01*
X253863927Y188191638D02*
X253924403Y188191638D01*
X253851832Y188155352D02*
X253894165Y188282352D01*
X253894165Y188282352D02*
X253936498Y188155352D01*
X254033260Y188161399D02*
X254021165Y188155352D01*
X254021165Y188155352D02*
X253996974Y188155352D01*
X253996974Y188155352D02*
X253984879Y188161399D01*
X253984879Y188161399D02*
X253978832Y188167447D01*
X253978832Y188167447D02*
X253972784Y188179542D01*
X253972784Y188179542D02*
X253972784Y188215828D01*
X253972784Y188215828D02*
X253978832Y188227923D01*
X253978832Y188227923D02*
X253984879Y188233971D01*
X253984879Y188233971D02*
X253996974Y188240019D01*
X253996974Y188240019D02*
X254021165Y188240019D01*
X254021165Y188240019D02*
X254033260Y188233971D01*
X254142117Y188161399D02*
X254130022Y188155352D01*
X254130022Y188155352D02*
X254105831Y188155352D01*
X254105831Y188155352D02*
X254093736Y188161399D01*
X254093736Y188161399D02*
X254087689Y188167447D01*
X254087689Y188167447D02*
X254081641Y188179542D01*
X254081641Y188179542D02*
X254081641Y188215828D01*
X254081641Y188215828D02*
X254087689Y188227923D01*
X254087689Y188227923D02*
X254093736Y188233971D01*
X254093736Y188233971D02*
X254105831Y188240019D01*
X254105831Y188240019D02*
X254130022Y188240019D01*
X254130022Y188240019D02*
X254142117Y188233971D01*
X254244927Y188161399D02*
X254232831Y188155352D01*
X254232831Y188155352D02*
X254208641Y188155352D01*
X254208641Y188155352D02*
X254196546Y188161399D01*
X254196546Y188161399D02*
X254190498Y188173495D01*
X254190498Y188173495D02*
X254190498Y188221876D01*
X254190498Y188221876D02*
X254196546Y188233971D01*
X254196546Y188233971D02*
X254208641Y188240019D01*
X254208641Y188240019D02*
X254232831Y188240019D01*
X254232831Y188240019D02*
X254244927Y188233971D01*
X254244927Y188233971D02*
X254250974Y188221876D01*
X254250974Y188221876D02*
X254250974Y188209780D01*
X254250974Y188209780D02*
X254190498Y188197685D01*
X254323545Y188155352D02*
X254311450Y188161399D01*
X254311450Y188161399D02*
X254305403Y188173495D01*
X254305403Y188173495D02*
X254305403Y188282352D01*
X254420308Y188161399D02*
X254408212Y188155352D01*
X254408212Y188155352D02*
X254384022Y188155352D01*
X254384022Y188155352D02*
X254371927Y188161399D01*
X254371927Y188161399D02*
X254365879Y188173495D01*
X254365879Y188173495D02*
X254365879Y188221876D01*
X254365879Y188221876D02*
X254371927Y188233971D01*
X254371927Y188233971D02*
X254384022Y188240019D01*
X254384022Y188240019D02*
X254408212Y188240019D01*
X254408212Y188240019D02*
X254420308Y188233971D01*
X254420308Y188233971D02*
X254426355Y188221876D01*
X254426355Y188221876D02*
X254426355Y188209780D01*
X254426355Y188209780D02*
X254365879Y188197685D01*
X254480784Y188155352D02*
X254480784Y188240019D01*
X254480784Y188215828D02*
X254486831Y188227923D01*
X254486831Y188227923D02*
X254492879Y188233971D01*
X254492879Y188233971D02*
X254504974Y188240019D01*
X254504974Y188240019D02*
X254517069Y188240019D01*
X254613831Y188155352D02*
X254613831Y188221876D01*
X254613831Y188221876D02*
X254607784Y188233971D01*
X254607784Y188233971D02*
X254595688Y188240019D01*
X254595688Y188240019D02*
X254571498Y188240019D01*
X254571498Y188240019D02*
X254559403Y188233971D01*
X254613831Y188161399D02*
X254601736Y188155352D01*
X254601736Y188155352D02*
X254571498Y188155352D01*
X254571498Y188155352D02*
X254559403Y188161399D01*
X254559403Y188161399D02*
X254553355Y188173495D01*
X254553355Y188173495D02*
X254553355Y188185590D01*
X254553355Y188185590D02*
X254559403Y188197685D01*
X254559403Y188197685D02*
X254571498Y188203733D01*
X254571498Y188203733D02*
X254601736Y188203733D01*
X254601736Y188203733D02*
X254613831Y188209780D01*
X254656165Y188240019D02*
X254704546Y188240019D01*
X254674308Y188282352D02*
X254674308Y188173495D01*
X254674308Y188173495D02*
X254680355Y188161399D01*
X254680355Y188161399D02*
X254692450Y188155352D01*
X254692450Y188155352D02*
X254704546Y188155352D01*
X254795260Y188161399D02*
X254783164Y188155352D01*
X254783164Y188155352D02*
X254758974Y188155352D01*
X254758974Y188155352D02*
X254746879Y188161399D01*
X254746879Y188161399D02*
X254740831Y188173495D01*
X254740831Y188173495D02*
X254740831Y188221876D01*
X254740831Y188221876D02*
X254746879Y188233971D01*
X254746879Y188233971D02*
X254758974Y188240019D01*
X254758974Y188240019D02*
X254783164Y188240019D01*
X254783164Y188240019D02*
X254795260Y188233971D01*
X254795260Y188233971D02*
X254801307Y188221876D01*
X254801307Y188221876D02*
X254801307Y188209780D01*
X254801307Y188209780D02*
X254740831Y188197685D01*
X254910164Y188155352D02*
X254910164Y188282352D01*
X254910164Y188161399D02*
X254898069Y188155352D01*
X254898069Y188155352D02*
X254873878Y188155352D01*
X254873878Y188155352D02*
X254861783Y188161399D01*
X254861783Y188161399D02*
X254855736Y188167447D01*
X254855736Y188167447D02*
X254849688Y188179542D01*
X254849688Y188179542D02*
X254849688Y188215828D01*
X254849688Y188215828D02*
X254855736Y188227923D01*
X254855736Y188227923D02*
X254861783Y188233971D01*
X254861783Y188233971D02*
X254873878Y188240019D01*
X254873878Y188240019D02*
X254898069Y188240019D01*
X254898069Y188240019D02*
X254910164Y188233971D01*
X255067403Y188155352D02*
X255067403Y188282352D01*
X255067403Y188282352D02*
X255097641Y188282352D01*
X255097641Y188282352D02*
X255115784Y188276304D01*
X255115784Y188276304D02*
X255127879Y188264209D01*
X255127879Y188264209D02*
X255133926Y188252114D01*
X255133926Y188252114D02*
X255139974Y188227923D01*
X255139974Y188227923D02*
X255139974Y188209780D01*
X255139974Y188209780D02*
X255133926Y188185590D01*
X255133926Y188185590D02*
X255127879Y188173495D01*
X255127879Y188173495D02*
X255115784Y188161399D01*
X255115784Y188161399D02*
X255097641Y188155352D01*
X255097641Y188155352D02*
X255067403Y188155352D01*
X255242784Y188161399D02*
X255230688Y188155352D01*
X255230688Y188155352D02*
X255206498Y188155352D01*
X255206498Y188155352D02*
X255194403Y188161399D01*
X255194403Y188161399D02*
X255188355Y188173495D01*
X255188355Y188173495D02*
X255188355Y188221876D01*
X255188355Y188221876D02*
X255194403Y188233971D01*
X255194403Y188233971D02*
X255206498Y188240019D01*
X255206498Y188240019D02*
X255230688Y188240019D01*
X255230688Y188240019D02*
X255242784Y188233971D01*
X255242784Y188233971D02*
X255248831Y188221876D01*
X255248831Y188221876D02*
X255248831Y188209780D01*
X255248831Y188209780D02*
X255188355Y188197685D01*
X255297212Y188161399D02*
X255309307Y188155352D01*
X255309307Y188155352D02*
X255333498Y188155352D01*
X255333498Y188155352D02*
X255345593Y188161399D01*
X255345593Y188161399D02*
X255351641Y188173495D01*
X255351641Y188173495D02*
X255351641Y188179542D01*
X255351641Y188179542D02*
X255345593Y188191638D01*
X255345593Y188191638D02*
X255333498Y188197685D01*
X255333498Y188197685D02*
X255315355Y188197685D01*
X255315355Y188197685D02*
X255303260Y188203733D01*
X255303260Y188203733D02*
X255297212Y188215828D01*
X255297212Y188215828D02*
X255297212Y188221876D01*
X255297212Y188221876D02*
X255303260Y188233971D01*
X255303260Y188233971D02*
X255315355Y188240019D01*
X255315355Y188240019D02*
X255333498Y188240019D01*
X255333498Y188240019D02*
X255345593Y188233971D01*
X255406070Y188155352D02*
X255406070Y188240019D01*
X255406070Y188282352D02*
X255400022Y188276304D01*
X255400022Y188276304D02*
X255406070Y188270257D01*
X255406070Y188270257D02*
X255412117Y188276304D01*
X255412117Y188276304D02*
X255406070Y188282352D01*
X255406070Y188282352D02*
X255406070Y188270257D01*
X255520974Y188240019D02*
X255520974Y188137209D01*
X255520974Y188137209D02*
X255514927Y188125114D01*
X255514927Y188125114D02*
X255508879Y188119066D01*
X255508879Y188119066D02*
X255496784Y188113019D01*
X255496784Y188113019D02*
X255478641Y188113019D01*
X255478641Y188113019D02*
X255466546Y188119066D01*
X255520974Y188161399D02*
X255508879Y188155352D01*
X255508879Y188155352D02*
X255484688Y188155352D01*
X255484688Y188155352D02*
X255472593Y188161399D01*
X255472593Y188161399D02*
X255466546Y188167447D01*
X255466546Y188167447D02*
X255460498Y188179542D01*
X255460498Y188179542D02*
X255460498Y188215828D01*
X255460498Y188215828D02*
X255466546Y188227923D01*
X255466546Y188227923D02*
X255472593Y188233971D01*
X255472593Y188233971D02*
X255484688Y188240019D01*
X255484688Y188240019D02*
X255508879Y188240019D01*
X255508879Y188240019D02*
X255520974Y188233971D01*
X255581451Y188240019D02*
X255581451Y188155352D01*
X255581451Y188227923D02*
X255587498Y188233971D01*
X255587498Y188233971D02*
X255599593Y188240019D01*
X255599593Y188240019D02*
X255617736Y188240019D01*
X255617736Y188240019D02*
X255629832Y188233971D01*
X255629832Y188233971D02*
X255635879Y188221876D01*
X255635879Y188221876D02*
X255635879Y188155352D01*
X255690308Y188161399D02*
X255702403Y188155352D01*
X255702403Y188155352D02*
X255726594Y188155352D01*
X255726594Y188155352D02*
X255738689Y188161399D01*
X255738689Y188161399D02*
X255744737Y188173495D01*
X255744737Y188173495D02*
X255744737Y188179542D01*
X255744737Y188179542D02*
X255738689Y188191638D01*
X255738689Y188191638D02*
X255726594Y188197685D01*
X255726594Y188197685D02*
X255708451Y188197685D01*
X255708451Y188197685D02*
X255696356Y188203733D01*
X255696356Y188203733D02*
X255690308Y188215828D01*
X255690308Y188215828D02*
X255690308Y188221876D01*
X255690308Y188221876D02*
X255696356Y188233971D01*
X255696356Y188233971D02*
X255708451Y188240019D01*
X255708451Y188240019D02*
X255726594Y188240019D01*
X255726594Y188240019D02*
X255738689Y188233971D01*
X255799166Y188167447D02*
X255805213Y188161399D01*
X255805213Y188161399D02*
X255799166Y188155352D01*
X255799166Y188155352D02*
X255793118Y188161399D01*
X255793118Y188161399D02*
X255799166Y188167447D01*
X255799166Y188167447D02*
X255799166Y188155352D01*
X255950356Y188191638D02*
X256010832Y188191638D01*
X255938261Y188155352D02*
X255980594Y188282352D01*
X255980594Y188282352D02*
X256022927Y188155352D01*
X256083403Y188155352D02*
X256071308Y188161399D01*
X256071308Y188161399D02*
X256065261Y188173495D01*
X256065261Y188173495D02*
X256065261Y188282352D01*
X256149927Y188155352D02*
X256137832Y188161399D01*
X256137832Y188161399D02*
X256131785Y188173495D01*
X256131785Y188173495D02*
X256131785Y188282352D01*
X256295071Y188155352D02*
X256295071Y188240019D01*
X256295071Y188215828D02*
X256301118Y188227923D01*
X256301118Y188227923D02*
X256307166Y188233971D01*
X256307166Y188233971D02*
X256319261Y188240019D01*
X256319261Y188240019D02*
X256331356Y188240019D01*
X256373690Y188155352D02*
X256373690Y188240019D01*
X256373690Y188282352D02*
X256367642Y188276304D01*
X256367642Y188276304D02*
X256373690Y188270257D01*
X256373690Y188270257D02*
X256379737Y188276304D01*
X256379737Y188276304D02*
X256373690Y188282352D01*
X256373690Y188282352D02*
X256373690Y188270257D01*
X256488594Y188240019D02*
X256488594Y188137209D01*
X256488594Y188137209D02*
X256482547Y188125114D01*
X256482547Y188125114D02*
X256476499Y188119066D01*
X256476499Y188119066D02*
X256464404Y188113019D01*
X256464404Y188113019D02*
X256446261Y188113019D01*
X256446261Y188113019D02*
X256434166Y188119066D01*
X256488594Y188161399D02*
X256476499Y188155352D01*
X256476499Y188155352D02*
X256452308Y188155352D01*
X256452308Y188155352D02*
X256440213Y188161399D01*
X256440213Y188161399D02*
X256434166Y188167447D01*
X256434166Y188167447D02*
X256428118Y188179542D01*
X256428118Y188179542D02*
X256428118Y188215828D01*
X256428118Y188215828D02*
X256434166Y188227923D01*
X256434166Y188227923D02*
X256440213Y188233971D01*
X256440213Y188233971D02*
X256452308Y188240019D01*
X256452308Y188240019D02*
X256476499Y188240019D01*
X256476499Y188240019D02*
X256488594Y188233971D01*
X256549071Y188155352D02*
X256549071Y188282352D01*
X256603499Y188155352D02*
X256603499Y188221876D01*
X256603499Y188221876D02*
X256597452Y188233971D01*
X256597452Y188233971D02*
X256585356Y188240019D01*
X256585356Y188240019D02*
X256567213Y188240019D01*
X256567213Y188240019D02*
X256555118Y188233971D01*
X256555118Y188233971D02*
X256549071Y188227923D01*
X256645833Y188240019D02*
X256694214Y188240019D01*
X256663976Y188282352D02*
X256663976Y188173495D01*
X256663976Y188173495D02*
X256670023Y188161399D01*
X256670023Y188161399D02*
X256682118Y188155352D01*
X256682118Y188155352D02*
X256694214Y188155352D01*
X256730499Y188161399D02*
X256742594Y188155352D01*
X256742594Y188155352D02*
X256766785Y188155352D01*
X256766785Y188155352D02*
X256778880Y188161399D01*
X256778880Y188161399D02*
X256784928Y188173495D01*
X256784928Y188173495D02*
X256784928Y188179542D01*
X256784928Y188179542D02*
X256778880Y188191638D01*
X256778880Y188191638D02*
X256766785Y188197685D01*
X256766785Y188197685D02*
X256748642Y188197685D01*
X256748642Y188197685D02*
X256736547Y188203733D01*
X256736547Y188203733D02*
X256730499Y188215828D01*
X256730499Y188215828D02*
X256730499Y188221876D01*
X256730499Y188221876D02*
X256736547Y188233971D01*
X256736547Y188233971D02*
X256748642Y188240019D01*
X256748642Y188240019D02*
X256766785Y188240019D01*
X256766785Y188240019D02*
X256778880Y188233971D01*
X256936119Y188155352D02*
X256936119Y188240019D01*
X256936119Y188215828D02*
X256942166Y188227923D01*
X256942166Y188227923D02*
X256948214Y188233971D01*
X256948214Y188233971D02*
X256960309Y188240019D01*
X256960309Y188240019D02*
X256972404Y188240019D01*
X257063119Y188161399D02*
X257051023Y188155352D01*
X257051023Y188155352D02*
X257026833Y188155352D01*
X257026833Y188155352D02*
X257014738Y188161399D01*
X257014738Y188161399D02*
X257008690Y188173495D01*
X257008690Y188173495D02*
X257008690Y188221876D01*
X257008690Y188221876D02*
X257014738Y188233971D01*
X257014738Y188233971D02*
X257026833Y188240019D01*
X257026833Y188240019D02*
X257051023Y188240019D01*
X257051023Y188240019D02*
X257063119Y188233971D01*
X257063119Y188233971D02*
X257069166Y188221876D01*
X257069166Y188221876D02*
X257069166Y188209780D01*
X257069166Y188209780D02*
X257008690Y188197685D01*
X257117547Y188161399D02*
X257129642Y188155352D01*
X257129642Y188155352D02*
X257153833Y188155352D01*
X257153833Y188155352D02*
X257165928Y188161399D01*
X257165928Y188161399D02*
X257171976Y188173495D01*
X257171976Y188173495D02*
X257171976Y188179542D01*
X257171976Y188179542D02*
X257165928Y188191638D01*
X257165928Y188191638D02*
X257153833Y188197685D01*
X257153833Y188197685D02*
X257135690Y188197685D01*
X257135690Y188197685D02*
X257123595Y188203733D01*
X257123595Y188203733D02*
X257117547Y188215828D01*
X257117547Y188215828D02*
X257117547Y188221876D01*
X257117547Y188221876D02*
X257123595Y188233971D01*
X257123595Y188233971D02*
X257135690Y188240019D01*
X257135690Y188240019D02*
X257153833Y188240019D01*
X257153833Y188240019D02*
X257165928Y188233971D01*
X257274786Y188161399D02*
X257262690Y188155352D01*
X257262690Y188155352D02*
X257238500Y188155352D01*
X257238500Y188155352D02*
X257226405Y188161399D01*
X257226405Y188161399D02*
X257220357Y188173495D01*
X257220357Y188173495D02*
X257220357Y188221876D01*
X257220357Y188221876D02*
X257226405Y188233971D01*
X257226405Y188233971D02*
X257238500Y188240019D01*
X257238500Y188240019D02*
X257262690Y188240019D01*
X257262690Y188240019D02*
X257274786Y188233971D01*
X257274786Y188233971D02*
X257280833Y188221876D01*
X257280833Y188221876D02*
X257280833Y188209780D01*
X257280833Y188209780D02*
X257220357Y188197685D01*
X257335262Y188155352D02*
X257335262Y188240019D01*
X257335262Y188215828D02*
X257341309Y188227923D01*
X257341309Y188227923D02*
X257347357Y188233971D01*
X257347357Y188233971D02*
X257359452Y188240019D01*
X257359452Y188240019D02*
X257371547Y188240019D01*
X257401785Y188240019D02*
X257432023Y188155352D01*
X257432023Y188155352D02*
X257462262Y188240019D01*
X257559024Y188161399D02*
X257546928Y188155352D01*
X257546928Y188155352D02*
X257522738Y188155352D01*
X257522738Y188155352D02*
X257510643Y188161399D01*
X257510643Y188161399D02*
X257504595Y188173495D01*
X257504595Y188173495D02*
X257504595Y188221876D01*
X257504595Y188221876D02*
X257510643Y188233971D01*
X257510643Y188233971D02*
X257522738Y188240019D01*
X257522738Y188240019D02*
X257546928Y188240019D01*
X257546928Y188240019D02*
X257559024Y188233971D01*
X257559024Y188233971D02*
X257565071Y188221876D01*
X257565071Y188221876D02*
X257565071Y188209780D01*
X257565071Y188209780D02*
X257504595Y188197685D01*
X257673928Y188155352D02*
X257673928Y188282352D01*
X257673928Y188161399D02*
X257661833Y188155352D01*
X257661833Y188155352D02*
X257637642Y188155352D01*
X257637642Y188155352D02*
X257625547Y188161399D01*
X257625547Y188161399D02*
X257619500Y188167447D01*
X257619500Y188167447D02*
X257613452Y188179542D01*
X257613452Y188179542D02*
X257613452Y188215828D01*
X257613452Y188215828D02*
X257619500Y188227923D01*
X257619500Y188227923D02*
X257625547Y188233971D01*
X257625547Y188233971D02*
X257637642Y188240019D01*
X257637642Y188240019D02*
X257661833Y188240019D01*
X257661833Y188240019D02*
X257673928Y188233971D01*
X257734405Y188167447D02*
X257740452Y188161399D01*
X257740452Y188161399D02*
X257734405Y188155352D01*
X257734405Y188155352D02*
X257728357Y188161399D01*
X257728357Y188161399D02*
X257734405Y188167447D01*
X257734405Y188167447D02*
X257734405Y188155352D01*
X230170553Y215794167D02*
X230176601Y215788119D01*
X230176601Y215788119D02*
X230182648Y215769977D01*
X230182648Y215769977D02*
X230182648Y215757881D01*
X230182648Y215757881D02*
X230176601Y215739738D01*
X230176601Y215739738D02*
X230164505Y215727643D01*
X230164505Y215727643D02*
X230152410Y215721596D01*
X230152410Y215721596D02*
X230128220Y215715548D01*
X230128220Y215715548D02*
X230110077Y215715548D01*
X230110077Y215715548D02*
X230085886Y215721596D01*
X230085886Y215721596D02*
X230073791Y215727643D01*
X230073791Y215727643D02*
X230061696Y215739738D01*
X230061696Y215739738D02*
X230055648Y215757881D01*
X230055648Y215757881D02*
X230055648Y215769977D01*
X230055648Y215769977D02*
X230061696Y215788119D01*
X230061696Y215788119D02*
X230067743Y215794167D01*
X230182648Y215866738D02*
X230176601Y215854643D01*
X230176601Y215854643D02*
X230170553Y215848596D01*
X230170553Y215848596D02*
X230158458Y215842548D01*
X230158458Y215842548D02*
X230122172Y215842548D01*
X230122172Y215842548D02*
X230110077Y215848596D01*
X230110077Y215848596D02*
X230104029Y215854643D01*
X230104029Y215854643D02*
X230097981Y215866738D01*
X230097981Y215866738D02*
X230097981Y215884881D01*
X230097981Y215884881D02*
X230104029Y215896977D01*
X230104029Y215896977D02*
X230110077Y215903024D01*
X230110077Y215903024D02*
X230122172Y215909072D01*
X230122172Y215909072D02*
X230158458Y215909072D01*
X230158458Y215909072D02*
X230170553Y215903024D01*
X230170553Y215903024D02*
X230176601Y215896977D01*
X230176601Y215896977D02*
X230182648Y215884881D01*
X230182648Y215884881D02*
X230182648Y215866738D01*
X230097981Y215963501D02*
X230224981Y215963501D01*
X230104029Y215963501D02*
X230097981Y215975596D01*
X230097981Y215975596D02*
X230097981Y215999786D01*
X230097981Y215999786D02*
X230104029Y216011882D01*
X230104029Y216011882D02*
X230110077Y216017929D01*
X230110077Y216017929D02*
X230122172Y216023977D01*
X230122172Y216023977D02*
X230158458Y216023977D01*
X230158458Y216023977D02*
X230170553Y216017929D01*
X230170553Y216017929D02*
X230176601Y216011882D01*
X230176601Y216011882D02*
X230182648Y215999786D01*
X230182648Y215999786D02*
X230182648Y215975596D01*
X230182648Y215975596D02*
X230176601Y215963501D01*
X230097981Y216066310D02*
X230182648Y216096548D01*
X230097981Y216126787D02*
X230182648Y216096548D01*
X230182648Y216096548D02*
X230212886Y216084453D01*
X230212886Y216084453D02*
X230218934Y216078406D01*
X230218934Y216078406D02*
X230224981Y216066310D01*
X230182648Y216175168D02*
X230097981Y216175168D01*
X230122172Y216175168D02*
X230110077Y216181215D01*
X230110077Y216181215D02*
X230104029Y216187263D01*
X230104029Y216187263D02*
X230097981Y216199358D01*
X230097981Y216199358D02*
X230097981Y216211453D01*
X230182648Y216253787D02*
X230097981Y216253787D01*
X230055648Y216253787D02*
X230061696Y216247739D01*
X230061696Y216247739D02*
X230067743Y216253787D01*
X230067743Y216253787D02*
X230061696Y216259834D01*
X230061696Y216259834D02*
X230055648Y216253787D01*
X230055648Y216253787D02*
X230067743Y216253787D01*
X230097981Y216368691D02*
X230200791Y216368691D01*
X230200791Y216368691D02*
X230212886Y216362644D01*
X230212886Y216362644D02*
X230218934Y216356596D01*
X230218934Y216356596D02*
X230224981Y216344501D01*
X230224981Y216344501D02*
X230224981Y216326358D01*
X230224981Y216326358D02*
X230218934Y216314263D01*
X230176601Y216368691D02*
X230182648Y216356596D01*
X230182648Y216356596D02*
X230182648Y216332405D01*
X230182648Y216332405D02*
X230176601Y216320310D01*
X230176601Y216320310D02*
X230170553Y216314263D01*
X230170553Y216314263D02*
X230158458Y216308215D01*
X230158458Y216308215D02*
X230122172Y216308215D01*
X230122172Y216308215D02*
X230110077Y216314263D01*
X230110077Y216314263D02*
X230104029Y216320310D01*
X230104029Y216320310D02*
X230097981Y216332405D01*
X230097981Y216332405D02*
X230097981Y216356596D01*
X230097981Y216356596D02*
X230104029Y216368691D01*
X230182648Y216429168D02*
X230055648Y216429168D01*
X230182648Y216483596D02*
X230116124Y216483596D01*
X230116124Y216483596D02*
X230104029Y216477549D01*
X230104029Y216477549D02*
X230097981Y216465453D01*
X230097981Y216465453D02*
X230097981Y216447310D01*
X230097981Y216447310D02*
X230104029Y216435215D01*
X230104029Y216435215D02*
X230110077Y216429168D01*
X230097981Y216525930D02*
X230097981Y216574311D01*
X230055648Y216544073D02*
X230164505Y216544073D01*
X230164505Y216544073D02*
X230176601Y216550120D01*
X230176601Y216550120D02*
X230182648Y216562215D01*
X230182648Y216562215D02*
X230182648Y216574311D01*
X230067743Y216707358D02*
X230061696Y216713406D01*
X230061696Y216713406D02*
X230055648Y216725501D01*
X230055648Y216725501D02*
X230055648Y216755739D01*
X230055648Y216755739D02*
X230061696Y216767834D01*
X230061696Y216767834D02*
X230067743Y216773882D01*
X230067743Y216773882D02*
X230079839Y216779929D01*
X230079839Y216779929D02*
X230091934Y216779929D01*
X230091934Y216779929D02*
X230110077Y216773882D01*
X230110077Y216773882D02*
X230182648Y216701310D01*
X230182648Y216701310D02*
X230182648Y216779929D01*
X230055648Y216858548D02*
X230055648Y216870643D01*
X230055648Y216870643D02*
X230061696Y216882739D01*
X230061696Y216882739D02*
X230067743Y216888786D01*
X230067743Y216888786D02*
X230079839Y216894834D01*
X230079839Y216894834D02*
X230104029Y216900881D01*
X230104029Y216900881D02*
X230134267Y216900881D01*
X230134267Y216900881D02*
X230158458Y216894834D01*
X230158458Y216894834D02*
X230170553Y216888786D01*
X230170553Y216888786D02*
X230176601Y216882739D01*
X230176601Y216882739D02*
X230182648Y216870643D01*
X230182648Y216870643D02*
X230182648Y216858548D01*
X230182648Y216858548D02*
X230176601Y216846453D01*
X230176601Y216846453D02*
X230170553Y216840405D01*
X230170553Y216840405D02*
X230158458Y216834358D01*
X230158458Y216834358D02*
X230134267Y216828310D01*
X230134267Y216828310D02*
X230104029Y216828310D01*
X230104029Y216828310D02*
X230079839Y216834358D01*
X230079839Y216834358D02*
X230067743Y216840405D01*
X230067743Y216840405D02*
X230061696Y216846453D01*
X230061696Y216846453D02*
X230055648Y216858548D01*
X230182648Y217021833D02*
X230182648Y216949262D01*
X230182648Y216985548D02*
X230055648Y216985548D01*
X230055648Y216985548D02*
X230073791Y216973452D01*
X230073791Y216973452D02*
X230085886Y216961357D01*
X230085886Y216961357D02*
X230091934Y216949262D01*
X230055648Y217130690D02*
X230055648Y217106500D01*
X230055648Y217106500D02*
X230061696Y217094404D01*
X230061696Y217094404D02*
X230067743Y217088357D01*
X230067743Y217088357D02*
X230085886Y217076262D01*
X230085886Y217076262D02*
X230110077Y217070214D01*
X230110077Y217070214D02*
X230158458Y217070214D01*
X230158458Y217070214D02*
X230170553Y217076262D01*
X230170553Y217076262D02*
X230176601Y217082309D01*
X230176601Y217082309D02*
X230182648Y217094404D01*
X230182648Y217094404D02*
X230182648Y217118595D01*
X230182648Y217118595D02*
X230176601Y217130690D01*
X230176601Y217130690D02*
X230170553Y217136738D01*
X230170553Y217136738D02*
X230158458Y217142785D01*
X230158458Y217142785D02*
X230128220Y217142785D01*
X230128220Y217142785D02*
X230116124Y217136738D01*
X230116124Y217136738D02*
X230110077Y217130690D01*
X230110077Y217130690D02*
X230104029Y217118595D01*
X230104029Y217118595D02*
X230104029Y217094404D01*
X230104029Y217094404D02*
X230110077Y217082309D01*
X230110077Y217082309D02*
X230116124Y217076262D01*
X230116124Y217076262D02*
X230128220Y217070214D01*
X230146362Y217287928D02*
X230146362Y217348404D01*
X230182648Y217275833D02*
X230055648Y217318166D01*
X230055648Y217318166D02*
X230182648Y217360499D01*
X230176601Y217457261D02*
X230182648Y217445166D01*
X230182648Y217445166D02*
X230182648Y217420975D01*
X230182648Y217420975D02*
X230176601Y217408880D01*
X230176601Y217408880D02*
X230170553Y217402833D01*
X230170553Y217402833D02*
X230158458Y217396785D01*
X230158458Y217396785D02*
X230122172Y217396785D01*
X230122172Y217396785D02*
X230110077Y217402833D01*
X230110077Y217402833D02*
X230104029Y217408880D01*
X230104029Y217408880D02*
X230097981Y217420975D01*
X230097981Y217420975D02*
X230097981Y217445166D01*
X230097981Y217445166D02*
X230104029Y217457261D01*
X230176601Y217566118D02*
X230182648Y217554023D01*
X230182648Y217554023D02*
X230182648Y217529832D01*
X230182648Y217529832D02*
X230176601Y217517737D01*
X230176601Y217517737D02*
X230170553Y217511690D01*
X230170553Y217511690D02*
X230158458Y217505642D01*
X230158458Y217505642D02*
X230122172Y217505642D01*
X230122172Y217505642D02*
X230110077Y217511690D01*
X230110077Y217511690D02*
X230104029Y217517737D01*
X230104029Y217517737D02*
X230097981Y217529832D01*
X230097981Y217529832D02*
X230097981Y217554023D01*
X230097981Y217554023D02*
X230104029Y217566118D01*
X230176601Y217668928D02*
X230182648Y217656832D01*
X230182648Y217656832D02*
X230182648Y217632642D01*
X230182648Y217632642D02*
X230176601Y217620547D01*
X230176601Y217620547D02*
X230164505Y217614499D01*
X230164505Y217614499D02*
X230116124Y217614499D01*
X230116124Y217614499D02*
X230104029Y217620547D01*
X230104029Y217620547D02*
X230097981Y217632642D01*
X230097981Y217632642D02*
X230097981Y217656832D01*
X230097981Y217656832D02*
X230104029Y217668928D01*
X230104029Y217668928D02*
X230116124Y217674975D01*
X230116124Y217674975D02*
X230128220Y217674975D01*
X230128220Y217674975D02*
X230140315Y217614499D01*
X230182648Y217747546D02*
X230176601Y217735451D01*
X230176601Y217735451D02*
X230164505Y217729404D01*
X230164505Y217729404D02*
X230055648Y217729404D01*
X230176601Y217844309D02*
X230182648Y217832213D01*
X230182648Y217832213D02*
X230182648Y217808023D01*
X230182648Y217808023D02*
X230176601Y217795928D01*
X230176601Y217795928D02*
X230164505Y217789880D01*
X230164505Y217789880D02*
X230116124Y217789880D01*
X230116124Y217789880D02*
X230104029Y217795928D01*
X230104029Y217795928D02*
X230097981Y217808023D01*
X230097981Y217808023D02*
X230097981Y217832213D01*
X230097981Y217832213D02*
X230104029Y217844309D01*
X230104029Y217844309D02*
X230116124Y217850356D01*
X230116124Y217850356D02*
X230128220Y217850356D01*
X230128220Y217850356D02*
X230140315Y217789880D01*
X230182648Y217904785D02*
X230097981Y217904785D01*
X230122172Y217904785D02*
X230110077Y217910832D01*
X230110077Y217910832D02*
X230104029Y217916880D01*
X230104029Y217916880D02*
X230097981Y217928975D01*
X230097981Y217928975D02*
X230097981Y217941070D01*
X230182648Y218037832D02*
X230116124Y218037832D01*
X230116124Y218037832D02*
X230104029Y218031785D01*
X230104029Y218031785D02*
X230097981Y218019689D01*
X230097981Y218019689D02*
X230097981Y217995499D01*
X230097981Y217995499D02*
X230104029Y217983404D01*
X230176601Y218037832D02*
X230182648Y218025737D01*
X230182648Y218025737D02*
X230182648Y217995499D01*
X230182648Y217995499D02*
X230176601Y217983404D01*
X230176601Y217983404D02*
X230164505Y217977356D01*
X230164505Y217977356D02*
X230152410Y217977356D01*
X230152410Y217977356D02*
X230140315Y217983404D01*
X230140315Y217983404D02*
X230134267Y217995499D01*
X230134267Y217995499D02*
X230134267Y218025737D01*
X230134267Y218025737D02*
X230128220Y218037832D01*
X230097981Y218080166D02*
X230097981Y218128547D01*
X230055648Y218098309D02*
X230164505Y218098309D01*
X230164505Y218098309D02*
X230176601Y218104356D01*
X230176601Y218104356D02*
X230182648Y218116451D01*
X230182648Y218116451D02*
X230182648Y218128547D01*
X230176601Y218219261D02*
X230182648Y218207165D01*
X230182648Y218207165D02*
X230182648Y218182975D01*
X230182648Y218182975D02*
X230176601Y218170880D01*
X230176601Y218170880D02*
X230164505Y218164832D01*
X230164505Y218164832D02*
X230116124Y218164832D01*
X230116124Y218164832D02*
X230104029Y218170880D01*
X230104029Y218170880D02*
X230097981Y218182975D01*
X230097981Y218182975D02*
X230097981Y218207165D01*
X230097981Y218207165D02*
X230104029Y218219261D01*
X230104029Y218219261D02*
X230116124Y218225308D01*
X230116124Y218225308D02*
X230128220Y218225308D01*
X230128220Y218225308D02*
X230140315Y218164832D01*
X230182648Y218334165D02*
X230055648Y218334165D01*
X230176601Y218334165D02*
X230182648Y218322070D01*
X230182648Y218322070D02*
X230182648Y218297879D01*
X230182648Y218297879D02*
X230176601Y218285784D01*
X230176601Y218285784D02*
X230170553Y218279737D01*
X230170553Y218279737D02*
X230158458Y218273689D01*
X230158458Y218273689D02*
X230122172Y218273689D01*
X230122172Y218273689D02*
X230110077Y218279737D01*
X230110077Y218279737D02*
X230104029Y218285784D01*
X230104029Y218285784D02*
X230097981Y218297879D01*
X230097981Y218297879D02*
X230097981Y218322070D01*
X230097981Y218322070D02*
X230104029Y218334165D01*
X230182648Y218491404D02*
X230055648Y218491404D01*
X230055648Y218491404D02*
X230055648Y218521642D01*
X230055648Y218521642D02*
X230061696Y218539785D01*
X230061696Y218539785D02*
X230073791Y218551880D01*
X230073791Y218551880D02*
X230085886Y218557927D01*
X230085886Y218557927D02*
X230110077Y218563975D01*
X230110077Y218563975D02*
X230128220Y218563975D01*
X230128220Y218563975D02*
X230152410Y218557927D01*
X230152410Y218557927D02*
X230164505Y218551880D01*
X230164505Y218551880D02*
X230176601Y218539785D01*
X230176601Y218539785D02*
X230182648Y218521642D01*
X230182648Y218521642D02*
X230182648Y218491404D01*
X230176601Y218666785D02*
X230182648Y218654689D01*
X230182648Y218654689D02*
X230182648Y218630499D01*
X230182648Y218630499D02*
X230176601Y218618404D01*
X230176601Y218618404D02*
X230164505Y218612356D01*
X230164505Y218612356D02*
X230116124Y218612356D01*
X230116124Y218612356D02*
X230104029Y218618404D01*
X230104029Y218618404D02*
X230097981Y218630499D01*
X230097981Y218630499D02*
X230097981Y218654689D01*
X230097981Y218654689D02*
X230104029Y218666785D01*
X230104029Y218666785D02*
X230116124Y218672832D01*
X230116124Y218672832D02*
X230128220Y218672832D01*
X230128220Y218672832D02*
X230140315Y218612356D01*
X230176601Y218721213D02*
X230182648Y218733308D01*
X230182648Y218733308D02*
X230182648Y218757499D01*
X230182648Y218757499D02*
X230176601Y218769594D01*
X230176601Y218769594D02*
X230164505Y218775642D01*
X230164505Y218775642D02*
X230158458Y218775642D01*
X230158458Y218775642D02*
X230146362Y218769594D01*
X230146362Y218769594D02*
X230140315Y218757499D01*
X230140315Y218757499D02*
X230140315Y218739356D01*
X230140315Y218739356D02*
X230134267Y218727261D01*
X230134267Y218727261D02*
X230122172Y218721213D01*
X230122172Y218721213D02*
X230116124Y218721213D01*
X230116124Y218721213D02*
X230104029Y218727261D01*
X230104029Y218727261D02*
X230097981Y218739356D01*
X230097981Y218739356D02*
X230097981Y218757499D01*
X230097981Y218757499D02*
X230104029Y218769594D01*
X230182648Y218830071D02*
X230097981Y218830071D01*
X230055648Y218830071D02*
X230061696Y218824023D01*
X230061696Y218824023D02*
X230067743Y218830071D01*
X230067743Y218830071D02*
X230061696Y218836118D01*
X230061696Y218836118D02*
X230055648Y218830071D01*
X230055648Y218830071D02*
X230067743Y218830071D01*
X230097981Y218944975D02*
X230200791Y218944975D01*
X230200791Y218944975D02*
X230212886Y218938928D01*
X230212886Y218938928D02*
X230218934Y218932880D01*
X230218934Y218932880D02*
X230224981Y218920785D01*
X230224981Y218920785D02*
X230224981Y218902642D01*
X230224981Y218902642D02*
X230218934Y218890547D01*
X230176601Y218944975D02*
X230182648Y218932880D01*
X230182648Y218932880D02*
X230182648Y218908689D01*
X230182648Y218908689D02*
X230176601Y218896594D01*
X230176601Y218896594D02*
X230170553Y218890547D01*
X230170553Y218890547D02*
X230158458Y218884499D01*
X230158458Y218884499D02*
X230122172Y218884499D01*
X230122172Y218884499D02*
X230110077Y218890547D01*
X230110077Y218890547D02*
X230104029Y218896594D01*
X230104029Y218896594D02*
X230097981Y218908689D01*
X230097981Y218908689D02*
X230097981Y218932880D01*
X230097981Y218932880D02*
X230104029Y218944975D01*
X230097981Y219005452D02*
X230182648Y219005452D01*
X230110077Y219005452D02*
X230104029Y219011499D01*
X230104029Y219011499D02*
X230097981Y219023594D01*
X230097981Y219023594D02*
X230097981Y219041737D01*
X230097981Y219041737D02*
X230104029Y219053833D01*
X230104029Y219053833D02*
X230116124Y219059880D01*
X230116124Y219059880D02*
X230182648Y219059880D01*
X230176601Y219114309D02*
X230182648Y219126404D01*
X230182648Y219126404D02*
X230182648Y219150595D01*
X230182648Y219150595D02*
X230176601Y219162690D01*
X230176601Y219162690D02*
X230164505Y219168738D01*
X230164505Y219168738D02*
X230158458Y219168738D01*
X230158458Y219168738D02*
X230146362Y219162690D01*
X230146362Y219162690D02*
X230140315Y219150595D01*
X230140315Y219150595D02*
X230140315Y219132452D01*
X230140315Y219132452D02*
X230134267Y219120357D01*
X230134267Y219120357D02*
X230122172Y219114309D01*
X230122172Y219114309D02*
X230116124Y219114309D01*
X230116124Y219114309D02*
X230104029Y219120357D01*
X230104029Y219120357D02*
X230097981Y219132452D01*
X230097981Y219132452D02*
X230097981Y219150595D01*
X230097981Y219150595D02*
X230104029Y219162690D01*
X230170553Y219223167D02*
X230176601Y219229214D01*
X230176601Y219229214D02*
X230182648Y219223167D01*
X230182648Y219223167D02*
X230176601Y219217119D01*
X230176601Y219217119D02*
X230170553Y219223167D01*
X230170553Y219223167D02*
X230182648Y219223167D01*
X230146362Y219374357D02*
X230146362Y219434833D01*
X230182648Y219362262D02*
X230055648Y219404595D01*
X230055648Y219404595D02*
X230182648Y219446928D01*
X230182648Y219507404D02*
X230176601Y219495309D01*
X230176601Y219495309D02*
X230164505Y219489262D01*
X230164505Y219489262D02*
X230055648Y219489262D01*
X230182648Y219573928D02*
X230176601Y219561833D01*
X230176601Y219561833D02*
X230164505Y219555786D01*
X230164505Y219555786D02*
X230055648Y219555786D01*
X230182648Y219719072D02*
X230097981Y219719072D01*
X230122172Y219719072D02*
X230110077Y219725119D01*
X230110077Y219725119D02*
X230104029Y219731167D01*
X230104029Y219731167D02*
X230097981Y219743262D01*
X230097981Y219743262D02*
X230097981Y219755357D01*
X230182648Y219797691D02*
X230097981Y219797691D01*
X230055648Y219797691D02*
X230061696Y219791643D01*
X230061696Y219791643D02*
X230067743Y219797691D01*
X230067743Y219797691D02*
X230061696Y219803738D01*
X230061696Y219803738D02*
X230055648Y219797691D01*
X230055648Y219797691D02*
X230067743Y219797691D01*
X230097981Y219912595D02*
X230200791Y219912595D01*
X230200791Y219912595D02*
X230212886Y219906548D01*
X230212886Y219906548D02*
X230218934Y219900500D01*
X230218934Y219900500D02*
X230224981Y219888405D01*
X230224981Y219888405D02*
X230224981Y219870262D01*
X230224981Y219870262D02*
X230218934Y219858167D01*
X230176601Y219912595D02*
X230182648Y219900500D01*
X230182648Y219900500D02*
X230182648Y219876309D01*
X230182648Y219876309D02*
X230176601Y219864214D01*
X230176601Y219864214D02*
X230170553Y219858167D01*
X230170553Y219858167D02*
X230158458Y219852119D01*
X230158458Y219852119D02*
X230122172Y219852119D01*
X230122172Y219852119D02*
X230110077Y219858167D01*
X230110077Y219858167D02*
X230104029Y219864214D01*
X230104029Y219864214D02*
X230097981Y219876309D01*
X230097981Y219876309D02*
X230097981Y219900500D01*
X230097981Y219900500D02*
X230104029Y219912595D01*
X230182648Y219973072D02*
X230055648Y219973072D01*
X230182648Y220027500D02*
X230116124Y220027500D01*
X230116124Y220027500D02*
X230104029Y220021453D01*
X230104029Y220021453D02*
X230097981Y220009357D01*
X230097981Y220009357D02*
X230097981Y219991214D01*
X230097981Y219991214D02*
X230104029Y219979119D01*
X230104029Y219979119D02*
X230110077Y219973072D01*
X230097981Y220069834D02*
X230097981Y220118215D01*
X230055648Y220087977D02*
X230164505Y220087977D01*
X230164505Y220087977D02*
X230176601Y220094024D01*
X230176601Y220094024D02*
X230182648Y220106119D01*
X230182648Y220106119D02*
X230182648Y220118215D01*
X230176601Y220154500D02*
X230182648Y220166595D01*
X230182648Y220166595D02*
X230182648Y220190786D01*
X230182648Y220190786D02*
X230176601Y220202881D01*
X230176601Y220202881D02*
X230164505Y220208929D01*
X230164505Y220208929D02*
X230158458Y220208929D01*
X230158458Y220208929D02*
X230146362Y220202881D01*
X230146362Y220202881D02*
X230140315Y220190786D01*
X230140315Y220190786D02*
X230140315Y220172643D01*
X230140315Y220172643D02*
X230134267Y220160548D01*
X230134267Y220160548D02*
X230122172Y220154500D01*
X230122172Y220154500D02*
X230116124Y220154500D01*
X230116124Y220154500D02*
X230104029Y220160548D01*
X230104029Y220160548D02*
X230097981Y220172643D01*
X230097981Y220172643D02*
X230097981Y220190786D01*
X230097981Y220190786D02*
X230104029Y220202881D01*
X230182648Y220360120D02*
X230097981Y220360120D01*
X230122172Y220360120D02*
X230110077Y220366167D01*
X230110077Y220366167D02*
X230104029Y220372215D01*
X230104029Y220372215D02*
X230097981Y220384310D01*
X230097981Y220384310D02*
X230097981Y220396405D01*
X230176601Y220487120D02*
X230182648Y220475024D01*
X230182648Y220475024D02*
X230182648Y220450834D01*
X230182648Y220450834D02*
X230176601Y220438739D01*
X230176601Y220438739D02*
X230164505Y220432691D01*
X230164505Y220432691D02*
X230116124Y220432691D01*
X230116124Y220432691D02*
X230104029Y220438739D01*
X230104029Y220438739D02*
X230097981Y220450834D01*
X230097981Y220450834D02*
X230097981Y220475024D01*
X230097981Y220475024D02*
X230104029Y220487120D01*
X230104029Y220487120D02*
X230116124Y220493167D01*
X230116124Y220493167D02*
X230128220Y220493167D01*
X230128220Y220493167D02*
X230140315Y220432691D01*
X230176601Y220541548D02*
X230182648Y220553643D01*
X230182648Y220553643D02*
X230182648Y220577834D01*
X230182648Y220577834D02*
X230176601Y220589929D01*
X230176601Y220589929D02*
X230164505Y220595977D01*
X230164505Y220595977D02*
X230158458Y220595977D01*
X230158458Y220595977D02*
X230146362Y220589929D01*
X230146362Y220589929D02*
X230140315Y220577834D01*
X230140315Y220577834D02*
X230140315Y220559691D01*
X230140315Y220559691D02*
X230134267Y220547596D01*
X230134267Y220547596D02*
X230122172Y220541548D01*
X230122172Y220541548D02*
X230116124Y220541548D01*
X230116124Y220541548D02*
X230104029Y220547596D01*
X230104029Y220547596D02*
X230097981Y220559691D01*
X230097981Y220559691D02*
X230097981Y220577834D01*
X230097981Y220577834D02*
X230104029Y220589929D01*
X230176601Y220698787D02*
X230182648Y220686691D01*
X230182648Y220686691D02*
X230182648Y220662501D01*
X230182648Y220662501D02*
X230176601Y220650406D01*
X230176601Y220650406D02*
X230164505Y220644358D01*
X230164505Y220644358D02*
X230116124Y220644358D01*
X230116124Y220644358D02*
X230104029Y220650406D01*
X230104029Y220650406D02*
X230097981Y220662501D01*
X230097981Y220662501D02*
X230097981Y220686691D01*
X230097981Y220686691D02*
X230104029Y220698787D01*
X230104029Y220698787D02*
X230116124Y220704834D01*
X230116124Y220704834D02*
X230128220Y220704834D01*
X230128220Y220704834D02*
X230140315Y220644358D01*
X230182648Y220759263D02*
X230097981Y220759263D01*
X230122172Y220759263D02*
X230110077Y220765310D01*
X230110077Y220765310D02*
X230104029Y220771358D01*
X230104029Y220771358D02*
X230097981Y220783453D01*
X230097981Y220783453D02*
X230097981Y220795548D01*
X230097981Y220825786D02*
X230182648Y220856024D01*
X230182648Y220856024D02*
X230097981Y220886263D01*
X230176601Y220983025D02*
X230182648Y220970929D01*
X230182648Y220970929D02*
X230182648Y220946739D01*
X230182648Y220946739D02*
X230176601Y220934644D01*
X230176601Y220934644D02*
X230164505Y220928596D01*
X230164505Y220928596D02*
X230116124Y220928596D01*
X230116124Y220928596D02*
X230104029Y220934644D01*
X230104029Y220934644D02*
X230097981Y220946739D01*
X230097981Y220946739D02*
X230097981Y220970929D01*
X230097981Y220970929D02*
X230104029Y220983025D01*
X230104029Y220983025D02*
X230116124Y220989072D01*
X230116124Y220989072D02*
X230128220Y220989072D01*
X230128220Y220989072D02*
X230140315Y220928596D01*
X230182648Y221097929D02*
X230055648Y221097929D01*
X230176601Y221097929D02*
X230182648Y221085834D01*
X230182648Y221085834D02*
X230182648Y221061643D01*
X230182648Y221061643D02*
X230176601Y221049548D01*
X230176601Y221049548D02*
X230170553Y221043501D01*
X230170553Y221043501D02*
X230158458Y221037453D01*
X230158458Y221037453D02*
X230122172Y221037453D01*
X230122172Y221037453D02*
X230110077Y221043501D01*
X230110077Y221043501D02*
X230104029Y221049548D01*
X230104029Y221049548D02*
X230097981Y221061643D01*
X230097981Y221061643D02*
X230097981Y221085834D01*
X230097981Y221085834D02*
X230104029Y221097929D01*
X230170553Y221158406D02*
X230176601Y221164453D01*
X230176601Y221164453D02*
X230182648Y221158406D01*
X230182648Y221158406D02*
X230176601Y221152358D01*
X230176601Y221152358D02*
X230170553Y221158406D01*
X230170553Y221158406D02*
X230182648Y221158406D01*
D11*
X276430000Y-4748000D02*
X276430000Y207000000D01*
X-3570000Y-5450000D02*
X275628000Y-5450000D01*
X176700000Y116142000D02*
X176700000Y205028000D01*
X176700000Y294745000D02*
X-3570000Y294745000D01*
X188180000Y205028000D02*
X188180000Y255047000D01*
X188180000Y255047000D02*
X176700000Y255047000D01*
X176700000Y205028000D02*
X188180000Y205028000D01*
X276430000Y207000000D02*
X285420000Y207000000D01*
X276430000Y289100000D02*
X276430000Y315898000D01*
X276430000Y315898000D02*
X275628000Y316550000D01*
X176700000Y16405000D02*
X-3570000Y16405000D01*
X275628000Y-5450000D02*
X276430000Y-4748000D01*
X-3570000Y316550000D02*
X275628000Y316550000D01*
X176700000Y16405000D02*
X176700000Y66123000D01*
X285420000Y289100000D02*
X285420000Y207000000D01*
X176700000Y66123000D02*
X176700000Y116142000D01*
X-3570000Y294745000D02*
X-3570000Y316550000D01*
X-3570000Y-5450000D02*
X-3570000Y16405000D01*
X176700000Y255047000D02*
X176700000Y294745000D01*
X276430000Y289100000D02*
X285420000Y289100000D01*
M02*
