(module SY58023UM (layer F.Cu) (tedit 5ED6AC2D)
  (fp_text reference U701 (at 0 0) (layer F.SilkS)
    (effects (font (size 1 1) (thickness 0.15)))
  )
  (fp_text value SY58011UMG (at 0 0) (layer F.SilkS) hide
    (effects (font (size 1 1) (thickness 0.15)))
  )
  (fp_text user "Copyright 2016 Accelerated Designs. All rights reserved." (at 0 0) (layer Cmts.User)
    (effects (font (size 0.127 0.127) (thickness 0.002)))
  )
  (fp_text user * (at -2.4384 -1) (layer F.SilkS)
    (effects (font (size 1 1) (thickness 0.15)))
  )
  (fp_text user * (at -1.0414 -1) (layer F.Fab)
    (effects (font (size 1 1) (thickness 0.15)))
  )
  (fp_text user 0.02in/0.5mm (at -3.429 -0.5) (layer Dwgs.User) hide
    (effects (font (size 1 1) (thickness 0.15)))
  )
  (fp_text user 0.03in/0.762mm (at -1.4224 -4.4704) (layer Dwgs.User) hide
    (effects (font (size 1 1) (thickness 0.15)))
  )
  (fp_text user 0.007in/0.178mm (at -4.4704 1.4224) (layer Dwgs.User) hide
    (effects (font (size 1 1) (thickness 0.15)))
  )
  (fp_text user 0.112in/2.845mm (at 0 7.0104) (layer Dwgs.User) hide
    (effects (font (size 1 1) (thickness 0.15)))
  )
  (fp_text user 0.112in/2.845mm (at 7.0104 0.635) (layer Dwgs.User) hide
    (effects (font (size 1 1) (thickness 0.15)))
  )
  (fp_text user 0.063in/1.6mm (at 0 3.8481) (layer Dwgs.User) hide
    (effects (font (size 1 1) (thickness 0.15)))
  )
  (fp_text user 0.063in/1.6mm (at 3.8481 -0.635) (layer Dwgs.User) hide
    (effects (font (size 1 1) (thickness 0.15)))
  )
  (fp_text user * (at -2.4384 -1) (layer F.SilkS)
    (effects (font (size 1 1) (thickness 0.15)))
  )
  (fp_text user * (at -1.0414 -1) (layer F.Fab)
    (effects (font (size 1 1) (thickness 0.15)))
  )
  (fp_line (start -1.4986 -0.2286) (end -0.2286 -1.4986) (layer F.Fab) (width 0.1524))
  (fp_line (start 0.6103 -1.4986) (end 0.8897 -1.4986) (layer F.Fab) (width 0.1524))
  (fp_line (start 0.8897 -1.4986) (end 0.8897 -1.4986) (layer F.Fab) (width 0.1524))
  (fp_line (start 0.8897 -1.4986) (end 0.6103 -1.4986) (layer F.Fab) (width 0.1524))
  (fp_line (start 0.6103 -1.4986) (end 0.6103 -1.4986) (layer F.Fab) (width 0.1524))
  (fp_line (start 0.1103 -1.4986) (end 0.3897 -1.4986) (layer F.Fab) (width 0.1524))
  (fp_line (start 0.3897 -1.4986) (end 0.3897 -1.4986) (layer F.Fab) (width 0.1524))
  (fp_line (start 0.3897 -1.4986) (end 0.1103 -1.4986) (layer F.Fab) (width 0.1524))
  (fp_line (start 0.1103 -1.4986) (end 0.1103 -1.4986) (layer F.Fab) (width 0.1524))
  (fp_line (start -0.3897 -1.4986) (end -0.1103 -1.4986) (layer F.Fab) (width 0.1524))
  (fp_line (start -0.1103 -1.4986) (end -0.1103 -1.4986) (layer F.Fab) (width 0.1524))
  (fp_line (start -0.1103 -1.4986) (end -0.3897 -1.4986) (layer F.Fab) (width 0.1524))
  (fp_line (start -0.3897 -1.4986) (end -0.3897 -1.4986) (layer F.Fab) (width 0.1524))
  (fp_line (start -0.8897 -1.4986) (end -0.6103 -1.4986) (layer F.Fab) (width 0.1524))
  (fp_line (start -0.6103 -1.4986) (end -0.6103 -1.4986) (layer F.Fab) (width 0.1524))
  (fp_line (start -0.6103 -1.4986) (end -0.8897 -1.4986) (layer F.Fab) (width 0.1524))
  (fp_line (start -0.8897 -1.4986) (end -0.8897 -1.4986) (layer F.Fab) (width 0.1524))
  (fp_line (start -1.4986 -0.6103) (end -1.4986 -0.8897) (layer F.Fab) (width 0.1524))
  (fp_line (start -1.4986 -0.8897) (end -1.4986 -0.8897) (layer F.Fab) (width 0.1524))
  (fp_line (start -1.4986 -0.8897) (end -1.4986 -0.6103) (layer F.Fab) (width 0.1524))
  (fp_line (start -1.4986 -0.6103) (end -1.4986 -0.6103) (layer F.Fab) (width 0.1524))
  (fp_line (start -1.4986 -0.1103) (end -1.4986 -0.3897) (layer F.Fab) (width 0.1524))
  (fp_line (start -1.4986 -0.3897) (end -1.4986 -0.3897) (layer F.Fab) (width 0.1524))
  (fp_line (start -1.4986 -0.3897) (end -1.4986 -0.1103) (layer F.Fab) (width 0.1524))
  (fp_line (start -1.4986 -0.1103) (end -1.4986 -0.1103) (layer F.Fab) (width 0.1524))
  (fp_line (start -1.4986 0.3897) (end -1.4986 0.1103) (layer F.Fab) (width 0.1524))
  (fp_line (start -1.4986 0.1103) (end -1.4986 0.1103) (layer F.Fab) (width 0.1524))
  (fp_line (start -1.4986 0.1103) (end -1.4986 0.3897) (layer F.Fab) (width 0.1524))
  (fp_line (start -1.4986 0.3897) (end -1.4986 0.3897) (layer F.Fab) (width 0.1524))
  (fp_line (start -1.4986 0.8897) (end -1.4986 0.6103) (layer F.Fab) (width 0.1524))
  (fp_line (start -1.4986 0.6103) (end -1.4986 0.6103) (layer F.Fab) (width 0.1524))
  (fp_line (start -1.4986 0.6103) (end -1.4986 0.8897) (layer F.Fab) (width 0.1524))
  (fp_line (start -1.4986 0.8897) (end -1.4986 0.8897) (layer F.Fab) (width 0.1524))
  (fp_line (start -0.6103 1.4986) (end -0.8897 1.4986) (layer F.Fab) (width 0.1524))
  (fp_line (start -0.8897 1.4986) (end -0.8897 1.4986) (layer F.Fab) (width 0.1524))
  (fp_line (start -0.8897 1.4986) (end -0.6103 1.4986) (layer F.Fab) (width 0.1524))
  (fp_line (start -0.6103 1.4986) (end -0.6103 1.4986) (layer F.Fab) (width 0.1524))
  (fp_line (start -0.1103 1.4986) (end -0.3897 1.4986) (layer F.Fab) (width 0.1524))
  (fp_line (start -0.3897 1.4986) (end -0.3897 1.4986) (layer F.Fab) (width 0.1524))
  (fp_line (start -0.3897 1.4986) (end -0.1103 1.4986) (layer F.Fab) (width 0.1524))
  (fp_line (start -0.1103 1.4986) (end -0.1103 1.4986) (layer F.Fab) (width 0.1524))
  (fp_line (start 0.3897 1.4986) (end 0.1103 1.4986) (layer F.Fab) (width 0.1524))
  (fp_line (start 0.1103 1.4986) (end 0.1103 1.4986) (layer F.Fab) (width 0.1524))
  (fp_line (start 0.1103 1.4986) (end 0.3897 1.4986) (layer F.Fab) (width 0.1524))
  (fp_line (start 0.3897 1.4986) (end 0.3897 1.4986) (layer F.Fab) (width 0.1524))
  (fp_line (start 0.8897 1.4986) (end 0.6103 1.4986) (layer F.Fab) (width 0.1524))
  (fp_line (start 0.6103 1.4986) (end 0.6103 1.4986) (layer F.Fab) (width 0.1524))
  (fp_line (start 0.6103 1.4986) (end 0.8897 1.4986) (layer F.Fab) (width 0.1524))
  (fp_line (start 0.8897 1.4986) (end 0.8897 1.4986) (layer F.Fab) (width 0.1524))
  (fp_line (start 1.4986 0.6103) (end 1.4986 0.8897) (layer F.Fab) (width 0.1524))
  (fp_line (start 1.4986 0.8897) (end 1.4986 0.8897) (layer F.Fab) (width 0.1524))
  (fp_line (start 1.4986 0.8897) (end 1.4986 0.6103) (layer F.Fab) (width 0.1524))
  (fp_line (start 1.4986 0.6103) (end 1.4986 0.6103) (layer F.Fab) (width 0.1524))
  (fp_line (start 1.4986 0.1103) (end 1.4986 0.3897) (layer F.Fab) (width 0.1524))
  (fp_line (start 1.4986 0.3897) (end 1.4986 0.3897) (layer F.Fab) (width 0.1524))
  (fp_line (start 1.4986 0.3897) (end 1.4986 0.1103) (layer F.Fab) (width 0.1524))
  (fp_line (start 1.4986 0.1103) (end 1.4986 0.1103) (layer F.Fab) (width 0.1524))
  (fp_line (start 1.4986 -0.3897) (end 1.4986 -0.1103) (layer F.Fab) (width 0.1524))
  (fp_line (start 1.4986 -0.1103) (end 1.4986 -0.1103) (layer F.Fab) (width 0.1524))
  (fp_line (start 1.4986 -0.1103) (end 1.4986 -0.3897) (layer F.Fab) (width 0.1524))
  (fp_line (start 1.4986 -0.3897) (end 1.4986 -0.3897) (layer F.Fab) (width 0.1524))
  (fp_line (start 1.4986 -0.8897) (end 1.4986 -0.6103) (layer F.Fab) (width 0.1524))
  (fp_line (start 1.4986 -0.6103) (end 1.4986 -0.6103) (layer F.Fab) (width 0.1524))
  (fp_line (start 1.4986 -0.6103) (end 1.4986 -0.8897) (layer F.Fab) (width 0.1524))
  (fp_line (start 1.4986 -0.8897) (end 1.4986 -0.8897) (layer F.Fab) (width 0.1524))
  (fp_line (start -1.6256 1.6256) (end -1.171641 1.6256) (layer F.SilkS) (width 0.1524))
  (fp_line (start 1.6256 1.6256) (end 1.6256 1.171641) (layer F.SilkS) (width 0.1524))
  (fp_line (start 1.6256 -1.6256) (end 1.171641 -1.6256) (layer F.SilkS) (width 0.1524))
  (fp_line (start -1.6256 -1.6256) (end -1.6256 -1.171641) (layer F.SilkS) (width 0.1524))
  (fp_line (start -1.6256 1.171641) (end -1.6256 1.6256) (layer F.SilkS) (width 0.1524))
  (fp_line (start -1.4986 1.4986) (end 1.4986 1.4986) (layer F.Fab) (width 0.1524))
  (fp_line (start 1.4986 1.4986) (end 1.4986 1.4986) (layer F.Fab) (width 0.1524))
  (fp_line (start 1.4986 1.4986) (end 1.4986 -1.4986) (layer F.Fab) (width 0.1524))
  (fp_line (start 1.4986 -1.4986) (end 1.4986 -1.4986) (layer F.Fab) (width 0.1524))
  (fp_line (start 1.4986 -1.4986) (end -1.4986 -1.4986) (layer F.Fab) (width 0.1524))
  (fp_line (start -1.4986 -1.4986) (end -1.4986 -1.4986) (layer F.Fab) (width 0.1524))
  (fp_line (start -1.4986 -1.4986) (end -1.4986 1.4986) (layer F.Fab) (width 0.1524))
  (fp_line (start -1.4986 1.4986) (end -1.4986 1.4986) (layer F.Fab) (width 0.1524))
  (fp_line (start 1.171641 1.6256) (end 1.6256 1.6256) (layer F.SilkS) (width 0.1524))
  (fp_line (start 1.6256 -1.171641) (end 1.6256 -1.6256) (layer F.SilkS) (width 0.1524))
  (fp_line (start -1.171641 -1.6256) (end -1.6256 -1.6256) (layer F.SilkS) (width 0.1524))
  (fp_line (start -1.7526 1.7526) (end -1.7526 1.0929) (layer F.CrtYd) (width 0.1524))
  (fp_line (start -1.7526 1.0929) (end -2.0574 1.0929) (layer F.CrtYd) (width 0.1524))
  (fp_line (start -2.0574 1.0929) (end -2.0574 -1.0929) (layer F.CrtYd) (width 0.1524))
  (fp_line (start -2.0574 -1.0929) (end -1.7526 -1.0929) (layer F.CrtYd) (width 0.1524))
  (fp_line (start -1.7526 -1.0929) (end -1.7526 -1.7526) (layer F.CrtYd) (width 0.1524))
  (fp_line (start -1.7526 -1.7526) (end -1.0929 -1.7526) (layer F.CrtYd) (width 0.1524))
  (fp_line (start -1.0929 -1.7526) (end -1.0929 -2.0574) (layer F.CrtYd) (width 0.1524))
  (fp_line (start -1.0929 -2.0574) (end 1.0929 -2.0574) (layer F.CrtYd) (width 0.1524))
  (fp_line (start 1.0929 -2.0574) (end 1.0929 -1.7526) (layer F.CrtYd) (width 0.1524))
  (fp_line (start 1.0929 -1.7526) (end 1.7526 -1.7526) (layer F.CrtYd) (width 0.1524))
  (fp_line (start 1.7526 -1.7526) (end 1.7526 -1.0929) (layer F.CrtYd) (width 0.1524))
  (fp_line (start 1.7526 -1.0929) (end 2.0574 -1.0929) (layer F.CrtYd) (width 0.1524))
  (fp_line (start 2.0574 -1.0929) (end 2.0574 1.0929) (layer F.CrtYd) (width 0.1524))
  (fp_line (start 2.0574 1.0929) (end 1.7526 1.0929) (layer F.CrtYd) (width 0.1524))
  (fp_line (start 1.7526 1.0929) (end 1.7526 1.7526) (layer F.CrtYd) (width 0.1524))
  (fp_line (start 1.7526 1.7526) (end 1.0929 1.7526) (layer F.CrtYd) (width 0.1524))
  (fp_line (start 1.0929 1.7526) (end 1.0929 2.0574) (layer F.CrtYd) (width 0.1524))
  (fp_line (start 1.0929 2.0574) (end -1.0929 2.0574) (layer F.CrtYd) (width 0.1524))
  (fp_line (start -1.0929 2.0574) (end -1.0929 1.7526) (layer F.CrtYd) (width 0.1524))
  (fp_line (start -1.0929 1.7526) (end -1.7526 1.7526) (layer F.CrtYd) (width 0.1524))
  (pad 1 smd rect (at -1.4224 -0.750001 90) (size 0.1778 0.762) (layers F.Cu F.Paste F.Mask))
  (pad 2 smd rect (at -1.4224 -0.25 90) (size 0.1778 0.762) (layers F.Cu F.Paste F.Mask))
  (pad 3 smd rect (at -1.4224 0.25 90) (size 0.1778 0.762) (layers F.Cu F.Paste F.Mask))
  (pad 4 smd rect (at -1.4224 0.750001 90) (size 0.1778 0.762) (layers F.Cu F.Paste F.Mask))
  (pad 5 smd rect (at -0.750001 1.4224) (size 0.1778 0.762) (layers F.Cu F.Paste F.Mask))
  (pad 6 smd rect (at -0.25 1.4224) (size 0.1778 0.762) (layers F.Cu F.Paste F.Mask))
  (pad 7 smd rect (at 0.25 1.4224) (size 0.1778 0.762) (layers F.Cu F.Paste F.Mask))
  (pad 8 smd rect (at 0.750001 1.4224) (size 0.1778 0.762) (layers F.Cu F.Paste F.Mask))
  (pad 9 smd rect (at 1.4224 0.750001 90) (size 0.1778 0.762) (layers F.Cu F.Paste F.Mask))
  (pad 10 smd rect (at 1.4224 0.25 90) (size 0.1778 0.762) (layers F.Cu F.Paste F.Mask))
  (pad 11 smd rect (at 1.4224 -0.25 90) (size 0.1778 0.762) (layers F.Cu F.Paste F.Mask))
  (pad 12 smd rect (at 1.4224 -0.750001 90) (size 0.1778 0.762) (layers F.Cu F.Paste F.Mask))
  (pad 13 smd rect (at 0.750001 -1.4224) (size 0.1778 0.762) (layers F.Cu F.Paste F.Mask))
  (pad 14 smd rect (at 0.25 -1.4224) (size 0.1778 0.762) (layers F.Cu F.Paste F.Mask))
  (pad 15 smd rect (at -0.25 -1.4224) (size 0.1778 0.762) (layers F.Cu F.Paste F.Mask))
  (pad 16 smd rect (at -0.750001 -1.4224) (size 0.1778 0.762) (layers F.Cu F.Paste F.Mask))
  (pad Pad smd rect (at 0 0) (size 1.6002 1.6002) (layers F.Cu F.Paste F.Mask))
)
