(kicad_symbol_lib (version 20220914) (generator kicad_symbol_editor)
  (symbol "MDT420B03001" (pin_names (offset 1.016)) (in_bom yes) (on_board yes)
    (property "Reference" "P" (at -10.16 50.8254 0)
      (effects (font (size 1.27 1.27)) (justify left bottom))
    )
    (property "Value" "MDT420B03001" (at -10.16 -50.8254 0)
      (effects (font (size 1.27 1.27)) (justify left bottom))
    )
    (property "Footprint" "AMPHENOL_MDT420B03001" (at 0 0 0)
      (effects (font (size 1.27 1.27)) (justify left bottom) hide)
    )
    (property "Datasheet" "Amphenol" (at 0 0 0)
      (effects (font (size 1.27 1.27)) (justify left bottom) hide)
    )
    (property "ki_locked" "" (at 0 0 0)
      (effects (font (size 1.27 1.27)))
    )
    (symbol "MDT420B03001_0_0"
      (polyline
        (pts
          (xy -10.16 -48.26)
          (xy -10.16 50.8)
        )
        (stroke (width 0.254) (type solid))
        (fill (type none))
      )
      (polyline
        (pts
          (xy -10.16 50.8)
          (xy 10.16 50.8)
        )
        (stroke (width 0.254) (type solid))
        (fill (type none))
      )
      (polyline
        (pts
          (xy 10.16 -48.26)
          (xy -10.16 -48.26)
        )
        (stroke (width 0.254) (type solid))
        (fill (type none))
      )
      (polyline
        (pts
          (xy 10.16 50.8)
          (xy 10.16 -48.26)
        )
        (stroke (width 0.254) (type solid))
        (fill (type none))
      )
      (pin passive line (at -12.7 48.26 0) (length 2.54)
        (name "1" (effects (font (size 1.016 1.016))))
        (number "1" (effects (font (size 1.016 1.016))))
      )
      (pin passive line (at 12.7 38.1 180) (length 2.54)
        (name "10" (effects (font (size 1.016 1.016))))
        (number "10" (effects (font (size 1.016 1.016))))
      )
      (pin passive line (at -12.7 35.56 0) (length 2.54)
        (name "11" (effects (font (size 1.016 1.016))))
        (number "11" (effects (font (size 1.016 1.016))))
      )
      (pin passive line (at 12.7 48.26 180) (length 2.54)
        (name "2" (effects (font (size 1.016 1.016))))
        (number "2" (effects (font (size 1.016 1.016))))
      )
      (pin passive line (at 12.7 25.4 180) (length 2.54)
        (name "20" (effects (font (size 1.016 1.016))))
        (number "20" (effects (font (size 1.016 1.016))))
      )
      (pin passive line (at -12.7 22.86 0) (length 2.54)
        (name "21" (effects (font (size 1.016 1.016))))
        (number "21" (effects (font (size 1.016 1.016))))
      )
      (pin passive line (at 12.7 22.86 180) (length 2.54)
        (name "22" (effects (font (size 1.016 1.016))))
        (number "22" (effects (font (size 1.016 1.016))))
      )
      (pin passive line (at -12.7 20.32 0) (length 2.54)
        (name "23" (effects (font (size 1.016 1.016))))
        (number "23" (effects (font (size 1.016 1.016))))
      )
      (pin passive line (at 12.7 20.32 180) (length 2.54)
        (name "24" (effects (font (size 1.016 1.016))))
        (number "24" (effects (font (size 1.016 1.016))))
      )
      (pin passive line (at -12.7 17.78 0) (length 2.54)
        (name "25" (effects (font (size 1.016 1.016))))
        (number "25" (effects (font (size 1.016 1.016))))
      )
      (pin passive line (at 12.7 17.78 180) (length 2.54)
        (name "26" (effects (font (size 1.016 1.016))))
        (number "26" (effects (font (size 1.016 1.016))))
      )
      (pin passive line (at -12.7 15.24 0) (length 2.54)
        (name "27" (effects (font (size 1.016 1.016))))
        (number "27" (effects (font (size 1.016 1.016))))
      )
      (pin passive line (at 12.7 15.24 180) (length 2.54)
        (name "28" (effects (font (size 1.016 1.016))))
        (number "28" (effects (font (size 1.016 1.016))))
      )
      (pin passive line (at -12.7 12.7 0) (length 2.54)
        (name "29" (effects (font (size 1.016 1.016))))
        (number "29" (effects (font (size 1.016 1.016))))
      )
      (pin passive line (at -12.7 45.72 0) (length 2.54)
        (name "3" (effects (font (size 1.016 1.016))))
        (number "3" (effects (font (size 1.016 1.016))))
      )
      (pin passive line (at 12.7 12.7 180) (length 2.54)
        (name "30" (effects (font (size 1.016 1.016))))
        (number "30" (effects (font (size 1.016 1.016))))
      )
      (pin passive line (at -12.7 10.16 0) (length 2.54)
        (name "31" (effects (font (size 1.016 1.016))))
        (number "31" (effects (font (size 1.016 1.016))))
      )
      (pin passive line (at 12.7 10.16 180) (length 2.54)
        (name "32" (effects (font (size 1.016 1.016))))
        (number "32" (effects (font (size 1.016 1.016))))
      )
      (pin passive line (at -12.7 7.62 0) (length 2.54)
        (name "33" (effects (font (size 1.016 1.016))))
        (number "33" (effects (font (size 1.016 1.016))))
      )
      (pin passive line (at 12.7 7.62 180) (length 2.54)
        (name "34" (effects (font (size 1.016 1.016))))
        (number "34" (effects (font (size 1.016 1.016))))
      )
      (pin passive line (at -12.7 5.08 0) (length 2.54)
        (name "35" (effects (font (size 1.016 1.016))))
        (number "35" (effects (font (size 1.016 1.016))))
      )
      (pin passive line (at 12.7 5.08 180) (length 2.54)
        (name "36" (effects (font (size 1.016 1.016))))
        (number "36" (effects (font (size 1.016 1.016))))
      )
      (pin passive line (at -12.7 2.54 0) (length 2.54)
        (name "37" (effects (font (size 1.016 1.016))))
        (number "37" (effects (font (size 1.016 1.016))))
      )
      (pin passive line (at 12.7 2.54 180) (length 2.54)
        (name "38" (effects (font (size 1.016 1.016))))
        (number "38" (effects (font (size 1.016 1.016))))
      )
      (pin passive line (at -12.7 0 0) (length 2.54)
        (name "39" (effects (font (size 1.016 1.016))))
        (number "39" (effects (font (size 1.016 1.016))))
      )
      (pin passive line (at 12.7 45.72 180) (length 2.54)
        (name "4" (effects (font (size 1.016 1.016))))
        (number "4" (effects (font (size 1.016 1.016))))
      )
      (pin passive line (at 12.7 0 180) (length 2.54)
        (name "40" (effects (font (size 1.016 1.016))))
        (number "40" (effects (font (size 1.016 1.016))))
      )
      (pin passive line (at -12.7 -2.54 0) (length 2.54)
        (name "41" (effects (font (size 1.016 1.016))))
        (number "41" (effects (font (size 1.016 1.016))))
      )
      (pin passive line (at 12.7 -2.54 180) (length 2.54)
        (name "42" (effects (font (size 1.016 1.016))))
        (number "42" (effects (font (size 1.016 1.016))))
      )
      (pin passive line (at -12.7 -5.08 0) (length 2.54)
        (name "43" (effects (font (size 1.016 1.016))))
        (number "43" (effects (font (size 1.016 1.016))))
      )
      (pin passive line (at 12.7 -5.08 180) (length 2.54)
        (name "44" (effects (font (size 1.016 1.016))))
        (number "44" (effects (font (size 1.016 1.016))))
      )
      (pin passive line (at -12.7 -7.62 0) (length 2.54)
        (name "45" (effects (font (size 1.016 1.016))))
        (number "45" (effects (font (size 1.016 1.016))))
      )
      (pin passive line (at 12.7 -7.62 180) (length 2.54)
        (name "46" (effects (font (size 1.016 1.016))))
        (number "46" (effects (font (size 1.016 1.016))))
      )
      (pin passive line (at -12.7 -10.16 0) (length 2.54)
        (name "47" (effects (font (size 1.016 1.016))))
        (number "47" (effects (font (size 1.016 1.016))))
      )
      (pin passive line (at 12.7 -10.16 180) (length 2.54)
        (name "48" (effects (font (size 1.016 1.016))))
        (number "48" (effects (font (size 1.016 1.016))))
      )
      (pin passive line (at -12.7 -12.7 0) (length 2.54)
        (name "49" (effects (font (size 1.016 1.016))))
        (number "49" (effects (font (size 1.016 1.016))))
      )
      (pin passive line (at -12.7 43.18 0) (length 2.54)
        (name "5" (effects (font (size 1.016 1.016))))
        (number "5" (effects (font (size 1.016 1.016))))
      )
      (pin passive line (at 12.7 -12.7 180) (length 2.54)
        (name "50" (effects (font (size 1.016 1.016))))
        (number "50" (effects (font (size 1.016 1.016))))
      )
      (pin passive line (at -12.7 -15.24 0) (length 2.54)
        (name "51" (effects (font (size 1.016 1.016))))
        (number "51" (effects (font (size 1.016 1.016))))
      )
      (pin passive line (at 12.7 -15.24 180) (length 2.54)
        (name "52" (effects (font (size 1.016 1.016))))
        (number "52" (effects (font (size 1.016 1.016))))
      )
      (pin passive line (at -12.7 -17.78 0) (length 2.54)
        (name "53" (effects (font (size 1.016 1.016))))
        (number "53" (effects (font (size 1.016 1.016))))
      )
      (pin passive line (at 12.7 -17.78 180) (length 2.54)
        (name "54" (effects (font (size 1.016 1.016))))
        (number "54" (effects (font (size 1.016 1.016))))
      )
      (pin passive line (at -12.7 -20.32 0) (length 2.54)
        (name "55" (effects (font (size 1.016 1.016))))
        (number "55" (effects (font (size 1.016 1.016))))
      )
      (pin passive line (at 12.7 -20.32 180) (length 2.54)
        (name "56" (effects (font (size 1.016 1.016))))
        (number "56" (effects (font (size 1.016 1.016))))
      )
      (pin passive line (at -12.7 -22.86 0) (length 2.54)
        (name "57" (effects (font (size 1.016 1.016))))
        (number "57" (effects (font (size 1.016 1.016))))
      )
      (pin passive line (at 12.7 -22.86 180) (length 2.54)
        (name "58" (effects (font (size 1.016 1.016))))
        (number "58" (effects (font (size 1.016 1.016))))
      )
      (pin passive line (at -12.7 -25.4 0) (length 2.54)
        (name "59" (effects (font (size 1.016 1.016))))
        (number "59" (effects (font (size 1.016 1.016))))
      )
      (pin passive line (at 12.7 43.18 180) (length 2.54)
        (name "6" (effects (font (size 1.016 1.016))))
        (number "6" (effects (font (size 1.016 1.016))))
      )
      (pin passive line (at 12.7 -25.4 180) (length 2.54)
        (name "60" (effects (font (size 1.016 1.016))))
        (number "60" (effects (font (size 1.016 1.016))))
      )
      (pin passive line (at -12.7 -27.94 0) (length 2.54)
        (name "61" (effects (font (size 1.016 1.016))))
        (number "61" (effects (font (size 1.016 1.016))))
      )
      (pin passive line (at 12.7 -27.94 180) (length 2.54)
        (name "62" (effects (font (size 1.016 1.016))))
        (number "62" (effects (font (size 1.016 1.016))))
      )
      (pin passive line (at -12.7 -30.48 0) (length 2.54)
        (name "63" (effects (font (size 1.016 1.016))))
        (number "63" (effects (font (size 1.016 1.016))))
      )
      (pin passive line (at 12.7 -30.48 180) (length 2.54)
        (name "64" (effects (font (size 1.016 1.016))))
        (number "64" (effects (font (size 1.016 1.016))))
      )
      (pin passive line (at -12.7 -33.02 0) (length 2.54)
        (name "65" (effects (font (size 1.016 1.016))))
        (number "65" (effects (font (size 1.016 1.016))))
      )
      (pin passive line (at 12.7 -33.02 180) (length 2.54)
        (name "66" (effects (font (size 1.016 1.016))))
        (number "66" (effects (font (size 1.016 1.016))))
      )
      (pin passive line (at -12.7 -35.56 0) (length 2.54)
        (name "67" (effects (font (size 1.016 1.016))))
        (number "67" (effects (font (size 1.016 1.016))))
      )
      (pin passive line (at 12.7 -35.56 180) (length 2.54)
        (name "68" (effects (font (size 1.016 1.016))))
        (number "68" (effects (font (size 1.016 1.016))))
      )
      (pin passive line (at -12.7 -38.1 0) (length 2.54)
        (name "69" (effects (font (size 1.016 1.016))))
        (number "69" (effects (font (size 1.016 1.016))))
      )
      (pin passive line (at -12.7 40.64 0) (length 2.54)
        (name "7" (effects (font (size 1.016 1.016))))
        (number "7" (effects (font (size 1.016 1.016))))
      )
      (pin passive line (at 12.7 -38.1 180) (length 2.54)
        (name "70" (effects (font (size 1.016 1.016))))
        (number "70" (effects (font (size 1.016 1.016))))
      )
      (pin passive line (at -12.7 -40.64 0) (length 2.54)
        (name "71" (effects (font (size 1.016 1.016))))
        (number "71" (effects (font (size 1.016 1.016))))
      )
      (pin passive line (at 12.7 -40.64 180) (length 2.54)
        (name "72" (effects (font (size 1.016 1.016))))
        (number "72" (effects (font (size 1.016 1.016))))
      )
      (pin passive line (at -12.7 -43.18 0) (length 2.54)
        (name "73" (effects (font (size 1.016 1.016))))
        (number "73" (effects (font (size 1.016 1.016))))
      )
      (pin passive line (at 12.7 -43.18 180) (length 2.54)
        (name "74" (effects (font (size 1.016 1.016))))
        (number "74" (effects (font (size 1.016 1.016))))
      )
      (pin passive line (at -12.7 -45.72 0) (length 2.54)
        (name "75" (effects (font (size 1.016 1.016))))
        (number "75" (effects (font (size 1.016 1.016))))
      )
      (pin passive line (at 12.7 40.64 180) (length 2.54)
        (name "8" (effects (font (size 1.016 1.016))))
        (number "8" (effects (font (size 1.016 1.016))))
      )
      (pin passive line (at -12.7 38.1 0) (length 2.54)
        (name "9" (effects (font (size 1.016 1.016))))
        (number "9" (effects (font (size 1.016 1.016))))
      )
      (pin passive line (at 12.7 -45.72 180) (length 2.54)
        (name "SHIELD" (effects (font (size 1.016 1.016))))
        (number "P1" (effects (font (size 1.016 1.016))))
      )
      (pin passive line (at 12.7 -46.99 180) (length 2.54)
        (name "SHIELD" (effects (font (size 1.016 1.016))))
        (number "P2" (effects (font (size 1.016 1.016))))
      )
    )
  )
)
