(kicad_symbol_lib (version 20220914) (generator kicad_symbol_editor)
  (symbol "AO3401A" (pin_names (offset 1.016)) (in_bom yes) (on_board yes)
    (property "Reference" "Q" (at 15.24 -15.24 0)
      (effects (font (size 1.27 1.27)))
    )
    (property "Value" "AO3401A" (at -13.97 -13.97 0)
      (effects (font (size 1.27 1.27)))
    )
    (property "Footprint" "" (at -6.35 -10.16 0)
      (effects (font (size 1.27 1.27)) hide)
    )
    (property "Datasheet" "" (at -6.35 -10.16 0)
      (effects (font (size 1.27 1.27)) hide)
    )
    (symbol "AO3401A_0_0"
      (text "D" (at 3.81 3.175 0)
        (effects (font (size 0.635 0.635)))
      )
      (text "S" (at 3.81 -3.175 0)
        (effects (font (size 0.635 0.635)))
      )
    )
    (symbol "AO3401A_1_1"
      (polyline
        (pts
          (xy -2.54 -1.27)
          (xy 0.254 -1.27)
        )
        (stroke (width 0) (type solid))
        (fill (type none))
      )
      (polyline
        (pts
          (xy 0.762 -2.032)
          (xy 0.762 -1.016)
        )
        (stroke (width 0.254) (type solid))
        (fill (type none))
      )
      (polyline
        (pts
          (xy 0.762 -1.524)
          (xy 2.54 -1.524)
        )
        (stroke (width 0) (type solid))
        (fill (type none))
      )
      (polyline
        (pts
          (xy 0.762 -0.254)
          (xy 0.762 0.762)
        )
        (stroke (width 0.254) (type solid))
        (fill (type none))
      )
      (polyline
        (pts
          (xy 0.762 1.524)
          (xy 0.762 2.54)
        )
        (stroke (width 0.254) (type solid))
        (fill (type none))
      )
      (polyline
        (pts
          (xy 0.762 2.032)
          (xy 2.54 2.032)
        )
        (stroke (width 0) (type solid))
        (fill (type none))
      )
      (polyline
        (pts
          (xy 1.27 0.254)
          (xy 2.54 0.254)
        )
        (stroke (width 0) (type solid))
        (fill (type none))
      )
      (polyline
        (pts
          (xy 2.54 -1.27)
          (xy 2.54 -3.81)
        )
        (stroke (width 0) (type solid))
        (fill (type none))
      )
      (polyline
        (pts
          (xy 2.54 0.254)
          (xy 2.54 -1.778)
        )
        (stroke (width 0) (type solid))
        (fill (type none))
      )
      (polyline
        (pts
          (xy 2.54 2.032)
          (xy 2.54 3.175)
        )
        (stroke (width 0) (type solid))
        (fill (type none))
      )
      (polyline
        (pts
          (xy 0.254 -1.651)
          (xy 0.254 2.159)
          (xy 0.254 2.159)
        )
        (stroke (width 0.254) (type solid))
        (fill (type none))
      )
      (polyline
        (pts
          (xy 2.159 0.254)
          (xy 1.143 0.635)
          (xy 1.143 -0.127)
          (xy 2.159 0.254)
        )
        (stroke (width 0) (type solid))
        (fill (type outline))
      )
      (polyline
        (pts
          (xy 2.54 2.032)
          (xy 3.302 2.032)
          (xy 3.302 -1.524)
          (xy 2.54 -1.524)
        )
        (stroke (width 0) (type solid))
        (fill (type none))
      )
      (polyline
        (pts
          (xy 2.794 -0.127)
          (xy 2.921 -0.127)
          (xy 3.683 -0.127)
          (xy 3.81 -0.127)
        )
        (stroke (width 0) (type solid))
        (fill (type none))
      )
      (polyline
        (pts
          (xy 3.302 -0.127)
          (xy 2.921 0.508)
          (xy 3.683 0.508)
          (xy 3.302 -0.127)
        )
        (stroke (width 0) (type solid))
        (fill (type none))
      )
      (circle (center 2.54 -1.524) (radius 0.2794)
        (stroke (width 0) (type solid))
        (fill (type outline))
      )
      (circle (center 2.54 2.032) (radius 0.2794)
        (stroke (width 0) (type solid))
        (fill (type outline))
      )
      (pin input line (at -5.08 -1.27 0) (length 2.54)
        (name "~" (effects (font (size 1.27 1.27))))
        (number "1" (effects (font (size 1.27 1.27))))
      )
      (pin passive line (at 2.54 -5.08 90) (length 2.54)
        (name "~" (effects (font (size 1.27 1.27))))
        (number "2" (effects (font (size 1.27 1.27))))
      )
      (pin passive line (at 2.54 5.08 270) (length 2.54)
        (name "~" (effects (font (size 1.27 1.27))))
        (number "3" (effects (font (size 1.27 1.27))))
      )
    )
  )
)
