G04 #@! TF.GenerationSoftware,KiCad,Pcbnew,8.0.6*
G04 #@! TF.CreationDate,2024-12-10T13:57:06-05:00*
G04 #@! TF.ProjectId,carrier,63617272-6965-4722-9e6b-696361645f70,rev?*
G04 #@! TF.SameCoordinates,PX795bdf0PY16b59940*
G04 #@! TF.FileFunction,Copper,L10,Inr*
G04 #@! TF.FilePolarity,Positive*
%FSLAX46Y46*%
G04 Gerber Fmt 4.6, Leading zero omitted, Abs format (unit mm)*
G04 Created by KiCad (PCBNEW 8.0.6) date 2024-12-10 13:57:06*
%MOMM*%
%LPD*%
G01*
G04 APERTURE LIST*
%ADD10C,0.300000*%
G04 #@! TA.AperFunction,NonConductor*
%ADD11C,0.300000*%
G04 #@! TD*
G04 #@! TA.AperFunction,ComponentPad*
%ADD12C,2.000000*%
G04 #@! TD*
G04 #@! TA.AperFunction,ComponentPad*
%ADD13R,2.400000X2.400000*%
G04 #@! TD*
G04 #@! TA.AperFunction,ComponentPad*
%ADD14C,2.400000*%
G04 #@! TD*
G04 #@! TA.AperFunction,ComponentPad*
%ADD15C,1.524000*%
G04 #@! TD*
G04 #@! TA.AperFunction,ComponentPad*
%ADD16O,1.700000X1.700000*%
G04 #@! TD*
G04 #@! TA.AperFunction,ComponentPad*
%ADD17R,1.700000X1.700000*%
G04 #@! TD*
G04 #@! TA.AperFunction,ComponentPad*
%ADD18C,2.540000*%
G04 #@! TD*
G04 #@! TA.AperFunction,WasherPad*
%ADD19C,2.000000*%
G04 #@! TD*
G04 #@! TA.AperFunction,WasherPad*
%ADD20C,2.900000*%
G04 #@! TD*
G04 #@! TA.AperFunction,ComponentPad*
%ADD21C,0.660400*%
G04 #@! TD*
G04 #@! TA.AperFunction,ViaPad*
%ADD22C,1.000000*%
G04 #@! TD*
G04 #@! TA.AperFunction,ViaPad*
%ADD23C,0.508000*%
G04 #@! TD*
G04 #@! TA.AperFunction,Conductor*
%ADD24C,0.203200*%
G04 #@! TD*
G04 #@! TA.AperFunction,Conductor*
%ADD25C,0.127000*%
G04 #@! TD*
G04 #@! TA.AperFunction,Conductor*
%ADD26C,0.200000*%
G04 #@! TD*
G04 #@! TA.AperFunction,Profile*
%ADD27C,0.152400*%
G04 #@! TD*
G04 APERTURE END LIST*
D10*
D11*
X61860286Y2321672D02*
X62146000Y2321672D01*
X62146000Y2321672D02*
X62288857Y2393100D01*
X62288857Y2393100D02*
X62360286Y2464529D01*
X62360286Y2464529D02*
X62503143Y2678815D01*
X62503143Y2678815D02*
X62574572Y2964529D01*
X62574572Y2964529D02*
X62574572Y3535958D01*
X62574572Y3535958D02*
X62503143Y3678815D01*
X62503143Y3678815D02*
X62431715Y3750243D01*
X62431715Y3750243D02*
X62288857Y3821672D01*
X62288857Y3821672D02*
X62003143Y3821672D01*
X62003143Y3821672D02*
X61860286Y3750243D01*
X61860286Y3750243D02*
X61788857Y3678815D01*
X61788857Y3678815D02*
X61717429Y3535958D01*
X61717429Y3535958D02*
X61717429Y3178815D01*
X61717429Y3178815D02*
X61788857Y3035958D01*
X61788857Y3035958D02*
X61860286Y2964529D01*
X61860286Y2964529D02*
X62003143Y2893100D01*
X62003143Y2893100D02*
X62288857Y2893100D01*
X62288857Y2893100D02*
X62431715Y2964529D01*
X62431715Y2964529D02*
X62503143Y3035958D01*
X62503143Y3035958D02*
X62574572Y3178815D01*
D12*
X191500000Y227645000D03*
X191500000Y230185000D03*
X191500000Y232725000D03*
X191500000Y235265000D03*
X191500000Y237805000D03*
X191500000Y240345000D03*
X191500000Y242885000D03*
X191500000Y245425000D03*
X194040000Y227645000D03*
X194040000Y230185000D03*
X194040000Y232725000D03*
X194040000Y235265000D03*
X194040000Y237805000D03*
X194040000Y240345000D03*
X194040000Y242885000D03*
X194040000Y245425000D03*
X196580000Y227645000D03*
X196580000Y230185000D03*
X196580000Y232725000D03*
X196580000Y235265000D03*
X196580000Y237805000D03*
X196580000Y240345000D03*
X196580000Y242885000D03*
X196580000Y245425000D03*
X192500000Y213975000D03*
X192500000Y216975000D03*
X195000000Y213975000D03*
X195000000Y216975000D03*
X197500000Y213975000D03*
X197500000Y216975000D03*
X200000000Y213975000D03*
X200000000Y216975000D03*
X202500000Y213975000D03*
X202500000Y216975000D03*
X192500000Y219475000D03*
X192500000Y222475000D03*
X195000000Y219475000D03*
X195000000Y222475000D03*
X197500000Y219475000D03*
X197500000Y222475000D03*
X200000000Y219475000D03*
X200000000Y222475000D03*
X202500000Y219475000D03*
X202500000Y222475000D03*
D13*
X190856000Y52065500D03*
D14*
X198356000Y52065500D03*
D15*
X185156000Y92165500D03*
X203956000Y92165500D03*
D16*
X264160000Y293878000D03*
D17*
X180340000Y4572000D03*
D16*
X27178000Y307594000D03*
X32258000Y307594000D03*
X34798000Y310134000D03*
D18*
X236220000Y29972000D03*
X236220000Y45212000D03*
D19*
X264130000Y3050000D03*
D20*
X264130000Y10450000D03*
X251660000Y39000000D03*
D19*
X264130000Y40950000D03*
D21*
X259080000Y236474000D03*
X258572000Y236220000D03*
D22*
X265938000Y118475003D03*
X220730184Y173857671D03*
X220726000Y174752000D03*
X265938000Y119380000D03*
D23*
X236474000Y277876000D03*
X236474000Y264668000D03*
X234442000Y281940000D03*
X233426000Y270764000D03*
X221234000Y215900000D03*
X220218000Y205740000D03*
X241554000Y508000D03*
X241554000Y119380000D03*
X178562000Y292100000D03*
X177546000Y300228000D03*
X178562000Y301244000D03*
X179578000Y294132000D03*
X178562000Y18288000D03*
X177546000Y8636000D03*
X230378000Y266192000D03*
X230086000Y278898000D03*
D22*
X256032000Y103632000D03*
D23*
X259842000Y508000D03*
D22*
X257302000Y98552000D03*
D23*
X260858000Y508000D03*
X275082000Y37084000D03*
X273050000Y216916000D03*
X263906000Y43180000D03*
X264922000Y215900000D03*
X261874000Y48006000D03*
X262890000Y213868000D03*
X275082000Y35052000D03*
X268986000Y214884000D03*
X251714000Y84836000D03*
X252730000Y214884000D03*
X245997000Y66677000D03*
X250698000Y137160000D03*
X250698000Y137922000D03*
X245997000Y67435000D03*
X238506000Y260604000D03*
X221234000Y180340000D03*
X220218000Y202692000D03*
X238506000Y227076000D03*
X252730000Y177292000D03*
X253746000Y208788000D03*
X254762000Y198628000D03*
X254762000Y157988000D03*
X254762000Y244348000D03*
X254759289Y207769289D03*
X205994000Y207772000D03*
X208026000Y276860000D03*
X180594000Y50292000D03*
X179578000Y10668000D03*
X234442000Y190500000D03*
X234442000Y280924000D03*
X225298000Y200660000D03*
X225298000Y212852000D03*
X275082000Y289052000D03*
X272034000Y195580000D03*
X245618000Y274828000D03*
X245618000Y195580000D03*
X258826000Y154940000D03*
X258826000Y196596000D03*
X260858000Y198628000D03*
X259842000Y162052000D03*
X249682000Y168148000D03*
X249682000Y201676000D03*
X245618000Y168148000D03*
X245618000Y202692000D03*
X237490000Y50292000D03*
X227330000Y200660000D03*
X238493299Y114300000D03*
X242570000Y229108000D03*
X243586000Y210820000D03*
X256794000Y216916000D03*
X257302000Y94996000D03*
X265996000Y186458000D03*
X264922000Y276860000D03*
X205994000Y243332000D03*
X205994000Y289052000D03*
X212090000Y182372000D03*
X212090000Y240284000D03*
X209042000Y241300000D03*
X209042000Y182372000D03*
X204978000Y287020000D03*
X201930000Y238252000D03*
X240030000Y214884000D03*
X238506000Y226060000D03*
X201930000Y271780000D03*
X202946000Y225044000D03*
X200914000Y227076000D03*
X199745600Y283616400D03*
X209042000Y230124000D03*
X207010000Y300228000D03*
X188722000Y301128000D03*
X190754000Y207772000D03*
X188696000Y299638000D03*
X188722000Y211836000D03*
X179578000Y301244000D03*
X180676000Y294228000D03*
X261874000Y281940000D03*
X261874000Y313436000D03*
X253746000Y290068000D03*
X254762000Y249428000D03*
X238493299Y181356000D03*
X238493299Y200660000D03*
X253746000Y277876000D03*
X240036000Y222108000D03*
X251714000Y223012000D03*
X240030000Y213868000D03*
X238506000Y269748000D03*
X240030000Y212852000D03*
X236474000Y129540000D03*
X239522000Y118872000D03*
X239522000Y128524000D03*
X235458000Y197612000D03*
X242570000Y157988000D03*
X241554000Y225044000D03*
X243586000Y151384000D03*
X243586000Y224536000D03*
X209042000Y292100000D03*
X239522000Y310192000D03*
X245618000Y147828000D03*
X238506000Y293116000D03*
X246634000Y54356000D03*
X214122000Y309372000D03*
X233426000Y260604000D03*
X232410000Y231140000D03*
X181610000Y193548000D03*
X181610000Y185420000D03*
X244094000Y266954000D03*
X243586000Y272796000D03*
X259857388Y249430190D03*
X258826000Y290068000D03*
X253746000Y275844000D03*
X252730000Y221996000D03*
X248666000Y289052000D03*
X237490000Y258572000D03*
X246634000Y258572000D03*
X237490000Y228092000D03*
X280670000Y278892000D03*
X281178000Y220980000D03*
X255778000Y132588000D03*
X255778000Y173228000D03*
X215646000Y131572000D03*
X217170000Y205740000D03*
X237490000Y142748000D03*
X236474000Y207772000D03*
X232410000Y126492000D03*
X233426000Y196088000D03*
X265946000Y233208000D03*
X265946000Y201698000D03*
X231902000Y235966000D03*
X232410000Y200660000D03*
X266954000Y198628000D03*
X266954000Y232156000D03*
X240538000Y297180000D03*
X242062000Y240284000D03*
X235458000Y248920000D03*
X235458000Y297180000D03*
X231394000Y298196000D03*
X231394000Y244348000D03*
X241554000Y281940000D03*
X241554000Y298196000D03*
X218186000Y212852000D03*
X218186000Y231140000D03*
X224282000Y212852000D03*
X224282000Y220980000D03*
X240538000Y508000D03*
X241554000Y196596000D03*
X221234000Y202692000D03*
X221234000Y218948000D03*
X274066000Y250952000D03*
X272034000Y283972000D03*
X243586000Y205740000D03*
X242570000Y6604000D03*
X262890000Y114300000D03*
X261874000Y111252000D03*
X251587000Y101727000D03*
X253492000Y-508000D03*
X181610000Y49276000D03*
X224282000Y236220000D03*
X223266000Y203708000D03*
X245618000Y287020000D03*
X242570000Y283972000D03*
X217170000Y244115950D03*
X220218000Y241300000D03*
X218186000Y312420000D03*
X216154000Y312420000D03*
X214122000Y242316000D03*
X280162000Y211836000D03*
X279400000Y227076000D03*
X243175800Y244348000D03*
X242570000Y273812000D03*
X199898000Y260604000D03*
X198882000Y233172000D03*
X243586000Y251460000D03*
X263906000Y281940000D03*
X260530050Y251642456D03*
X243586000Y258572000D03*
X249682000Y262636000D03*
X249682000Y274828000D03*
X256794000Y253734050D03*
X256794000Y274828000D03*
X237490000Y226060000D03*
X236474000Y244728997D03*
X243676000Y235204000D03*
X243586000Y262636000D03*
X234442000Y270764000D03*
X234442000Y212852000D03*
X229362000Y208788000D03*
X241553500Y59078000D03*
D24*
X207010000Y298384000D02*
X207010000Y300228000D01*
X208534000Y291338000D02*
X208534000Y296860000D01*
X209550000Y230632000D02*
X209550000Y290322000D01*
X209550000Y290322000D02*
X208534000Y291338000D01*
X209042000Y230124000D02*
X209550000Y230632000D01*
X208534000Y296860000D02*
X207010000Y298384000D01*
X209042000Y292944000D02*
X214976000Y298878000D01*
X214976000Y308518000D02*
X214122000Y309372000D01*
X209042000Y292100000D02*
X209042000Y292944000D01*
X214976000Y298878000D02*
X214976000Y308518000D01*
X236982000Y277368000D02*
X236474000Y277876000D01*
X236474000Y264668000D02*
X236982000Y265176000D01*
X236982000Y265176000D02*
X236982000Y277368000D01*
X233934000Y281432000D02*
X233934000Y272034000D01*
X234442000Y281940000D02*
X233934000Y281432000D01*
X233934000Y272034000D02*
X233934000Y271272000D01*
X233934000Y271272000D02*
X233426000Y270764000D01*
X220726000Y215392000D02*
X220726000Y206248000D01*
X220726000Y206248000D02*
X220218000Y205740000D01*
X221234000Y215900000D02*
X220726000Y215392000D01*
X241808000Y77470000D02*
X241808000Y83058000D01*
X243216000Y55312000D02*
X243216000Y65734000D01*
X242062000Y66888000D02*
X242062000Y77216000D01*
X242062000Y116840000D02*
X242062000Y118872000D01*
X241554000Y508000D02*
X242062000Y1016000D01*
X242062000Y1016000D02*
X242062000Y54158000D01*
X242062000Y54158000D02*
X243216000Y55312000D01*
X241808000Y83058000D02*
X242062000Y83312000D01*
X242062000Y118872000D02*
X241554000Y119380000D01*
X242062000Y111252000D02*
X241808000Y111506000D01*
X242062000Y77216000D02*
X241808000Y77470000D01*
X243216000Y65734000D02*
X242062000Y66888000D01*
X241808000Y111506000D02*
X241808000Y116586000D01*
X242062000Y83312000D02*
X242062000Y111252000D01*
X241808000Y116586000D02*
X242062000Y116840000D01*
X178054000Y292608000D02*
X178054000Y298450000D01*
X178562000Y292100000D02*
X178054000Y292608000D01*
X178054000Y299720000D02*
X177546000Y300228000D01*
X178054000Y298450000D02*
X178054000Y299720000D01*
X179070000Y294640000D02*
X179070000Y300736000D01*
X179070000Y300736000D02*
X178562000Y301244000D01*
X179578000Y294132000D02*
X179070000Y294640000D01*
X178054000Y9144000D02*
X178054000Y17018000D01*
X178054000Y17780000D02*
X178562000Y18288000D01*
X178054000Y17018000D02*
X178054000Y17780000D01*
X177546000Y8636000D02*
X178054000Y9144000D01*
X230086000Y278898000D02*
X229615999Y278427999D01*
X229870000Y276108158D02*
X229870000Y266700000D01*
X229870000Y266700000D02*
X230378000Y266192000D01*
X229615999Y276362159D02*
X229870000Y276108158D01*
X229615999Y278427999D02*
X229615999Y276362159D01*
X256032000Y92710000D02*
X256032000Y85333842D01*
X256032000Y76708000D02*
X255270000Y75946000D01*
X256032000Y84074000D02*
X256032000Y76708000D01*
X260350000Y67564000D02*
X260350000Y1016000D01*
X256032000Y85333842D02*
X256286001Y85079841D01*
X256286001Y85079841D02*
X256286001Y84328001D01*
X255270000Y75946000D02*
X255270000Y72644000D01*
X255270000Y72644000D02*
X260350000Y67564000D01*
X255270000Y102870000D02*
X255270000Y93472000D01*
X260350000Y1016000D02*
X259842000Y508000D01*
X256286001Y84328001D02*
X256032000Y84074000D01*
X255270000Y93472000D02*
X256032000Y92710000D01*
X256032000Y103632000D02*
X255270000Y102870000D01*
X261366000Y39878000D02*
X261366011Y39877989D01*
X257048000Y92456000D02*
X257048000Y72644000D01*
X261366000Y68326000D02*
X261366000Y39878000D01*
X261366011Y39877989D02*
X261366011Y33771853D01*
X256920999Y94107001D02*
X256920999Y92583001D01*
X261366000Y33771842D02*
X261366000Y1016000D01*
X257302000Y98552000D02*
X257302000Y97790000D01*
X257048000Y72644000D02*
X261366000Y68326000D01*
X261366011Y33771853D02*
X261366000Y33771842D01*
X256920999Y92583001D02*
X257048000Y92456000D01*
X256286000Y94742000D02*
X256920999Y94107001D01*
X256286000Y96774000D02*
X256286000Y94742000D01*
X257302000Y97790000D02*
X256286000Y96774000D01*
X261366000Y1016000D02*
X260858000Y508000D01*
D25*
X273716000Y71908000D02*
X273716000Y96398834D01*
X273716000Y96398834D02*
X274574000Y97256834D01*
D24*
X273558000Y216408000D02*
X273558000Y213868000D01*
D25*
X275606000Y70018000D02*
X273716000Y71908000D01*
D24*
X273558000Y213868000D02*
X274574000Y212852000D01*
X273050000Y216916000D02*
X273558000Y216408000D01*
X275590000Y37592000D02*
X275590000Y70002000D01*
X274574000Y212852000D02*
X274574000Y97536000D01*
X275590000Y70002000D02*
X275606000Y70018000D01*
X275082000Y37084000D02*
X275590000Y37592000D01*
D25*
X274574000Y97256834D02*
X274574000Y97536000D01*
D24*
X264922000Y215900000D02*
X264396000Y215374000D01*
X264414000Y71756000D02*
X264414000Y43688000D01*
X264396000Y179448000D02*
X264396000Y167404000D01*
X264456000Y181248000D02*
X264456000Y179508000D01*
X264414000Y43688000D02*
X263906000Y43180000D01*
X264396000Y215374000D02*
X264396000Y181308000D01*
D25*
X265176000Y96258000D02*
X264716000Y95798000D01*
D24*
X264456000Y179508000D02*
X264396000Y179448000D01*
X264546000Y71888000D02*
X264414000Y71756000D01*
X265176000Y101346000D02*
X265176000Y96266000D01*
X265691999Y144942077D02*
X264414000Y143664078D01*
X264414000Y102108000D02*
X265176000Y101346000D01*
D25*
X264716000Y95798000D02*
X264716000Y72058000D01*
X265176000Y96266000D02*
X265176000Y96258000D01*
D24*
X265691999Y147312001D02*
X265691999Y144942077D01*
X264396000Y181308000D02*
X264456000Y181248000D01*
X264414000Y167386000D02*
X264414000Y148590000D01*
X264414000Y148590000D02*
X265691999Y147312001D01*
X264396000Y167404000D02*
X264414000Y167386000D01*
D25*
X264716000Y72058000D02*
X264546000Y71888000D01*
D24*
X264414000Y143664078D02*
X264414000Y102108000D01*
X262382000Y101346000D02*
X262382000Y96266000D01*
X262382000Y48514000D02*
X261874000Y48006000D01*
D25*
X261916000Y96048000D02*
X262164000Y96048000D01*
D24*
X262128000Y71406000D02*
X261456000Y72078000D01*
D25*
X261456000Y72078000D02*
X261426000Y72108000D01*
D24*
X262890000Y213868000D02*
X263398000Y213360000D01*
X262382000Y51308000D02*
X262382000Y48514000D01*
X262128000Y71374000D02*
X262128000Y71406000D01*
D25*
X262164000Y96048000D02*
X262382000Y96266000D01*
X261426000Y72108000D02*
X261426000Y95558000D01*
X261426000Y95558000D02*
X261916000Y96048000D01*
D24*
X262128000Y71374000D02*
X262382000Y71120000D01*
X263398000Y213360000D02*
X263398000Y102362000D01*
X263398000Y102362000D02*
X262382000Y101346000D01*
X262382000Y71120000D02*
X262382000Y51308000D01*
X274574000Y35560000D02*
X275082000Y35052000D01*
X271526000Y116078000D02*
X271526000Y168656000D01*
X269494000Y180340000D02*
X268203000Y181631000D01*
X269494000Y193294000D02*
X269494000Y199136000D01*
X271526000Y168656000D02*
X272288000Y169418000D01*
X269494000Y199136000D02*
X270002000Y199644000D01*
X270002000Y192786000D02*
X269494000Y193294000D01*
X270002000Y200660000D02*
X269494000Y201168000D01*
X274574000Y70006000D02*
X274574000Y35560000D01*
X272288000Y169418000D02*
X272288000Y172941922D01*
X269456000Y208246000D02*
X269456000Y210430000D01*
X270002000Y199644000D02*
X270002000Y200660000D01*
X272288000Y172941922D02*
X269494000Y175735922D01*
X272034000Y114046000D02*
X272034000Y115570000D01*
D25*
X272566000Y95782000D02*
X272566000Y72014000D01*
D24*
X273558000Y96774000D02*
X273558000Y112522000D01*
X269494000Y175735922D02*
X269494000Y180340000D01*
X269456000Y210430000D02*
X269494000Y210468000D01*
X270002000Y185166000D02*
X270002000Y192786000D01*
X268203000Y181631000D02*
X268203000Y183367000D01*
X269494000Y210468000D02*
X269494000Y214376000D01*
X273558000Y112522000D02*
X272034000Y114046000D01*
X269494000Y208208000D02*
X269456000Y208246000D01*
D25*
X273558000Y96774000D02*
X272566000Y95782000D01*
D24*
X269494000Y201168000D02*
X269494000Y208208000D01*
D25*
X272566000Y72014000D02*
X274574000Y70006000D01*
D24*
X268203000Y183367000D02*
X270002000Y185166000D01*
X272034000Y115570000D02*
X271526000Y116078000D01*
X269494000Y214376000D02*
X268986000Y214884000D01*
X252730000Y214884000D02*
X252222000Y214376000D01*
X250952000Y86614000D02*
X250952000Y85598000D01*
X250952000Y85598000D02*
X251714000Y84836000D01*
X250952000Y86868000D02*
X250952000Y86614000D01*
X250952000Y105145842D02*
X250952000Y86868000D01*
X252222000Y107188000D02*
X252222000Y106415842D01*
X252222000Y214376000D02*
X252222000Y107188000D01*
X252222000Y106415842D02*
X250952000Y105145842D01*
D26*
X248383000Y136812800D02*
X248886200Y137316000D01*
X245997000Y66677000D02*
X246151000Y66831000D01*
X246151000Y66831000D02*
X247489200Y66831000D01*
X248886200Y137316000D02*
X250542000Y137316000D01*
X247489200Y66831000D02*
X248383000Y67724800D01*
X248383000Y67724800D02*
X248383000Y136812800D01*
X250542000Y137316000D02*
X250698000Y137160000D01*
X250542000Y137766000D02*
X250698000Y137922000D01*
X247933000Y67911200D02*
X247933000Y136999200D01*
X248699800Y137766000D02*
X250542000Y137766000D01*
X246151000Y67281000D02*
X247302800Y67281000D01*
X247933000Y136999200D02*
X248699800Y137766000D01*
X245997000Y67435000D02*
X246151000Y67281000D01*
X247302800Y67281000D02*
X247933000Y67911200D01*
D24*
X238506000Y227076000D02*
X239014000Y227584000D01*
X239014000Y227584000D02*
X239014000Y247650000D01*
X220726000Y202184000D02*
X220218000Y202692000D01*
X242316000Y250952000D02*
X242316000Y256794000D01*
X221234000Y180340000D02*
X220726000Y180848000D01*
D26*
X220726000Y180848000D02*
X220726000Y200152000D01*
D24*
X239014000Y247650000D02*
X242316000Y250952000D01*
X242316000Y256794000D02*
X238506000Y260604000D01*
X220726000Y200152000D02*
X220726000Y202184000D01*
X253746000Y208788000D02*
X253238000Y208280000D01*
X253238000Y208280000D02*
X253238000Y177800000D01*
X253238000Y177800000D02*
X252730000Y177292000D01*
X254254000Y198120000D02*
X254254000Y159004000D01*
X254254000Y158496000D02*
X254762000Y157988000D01*
X254254000Y159004000D02*
X254254000Y158496000D01*
X254762000Y198628000D02*
X254254000Y198120000D01*
X254759289Y207769289D02*
X255270000Y208280000D01*
X255270000Y208280000D02*
X255270000Y234696000D01*
X255270000Y234696000D02*
X254254000Y235712000D01*
X254254000Y243840000D02*
X254762000Y244348000D01*
X254254000Y235712000D02*
X254254000Y243840000D01*
X207518000Y276352000D02*
X208026000Y276860000D01*
X208026000Y255524000D02*
X208026000Y254000000D01*
X207518000Y253492000D02*
X207518000Y209296000D01*
X207518000Y256032000D02*
X208026000Y255524000D01*
X207518000Y209296000D02*
X205994000Y207772000D01*
X207518000Y276352000D02*
X207518000Y256032000D01*
X208026000Y254000000D02*
X207518000Y253492000D01*
X180086000Y49784000D02*
X180594000Y50292000D01*
X179578000Y10668000D02*
X180086000Y11176000D01*
X180086000Y11176000D02*
X180086000Y49784000D01*
X234442000Y249174000D02*
X234442000Y259842000D01*
X234442000Y190500000D02*
X234950000Y191008000D01*
X234950000Y280416000D02*
X234442000Y280924000D01*
X234442000Y259842000D02*
X234950000Y260350000D01*
X234950000Y191008000D02*
X234950000Y248666000D01*
X234950000Y260350000D02*
X234950000Y280416000D01*
X234950000Y248666000D02*
X234442000Y249174000D01*
X224790000Y201167500D02*
X225298000Y200659500D01*
X225298000Y212852000D02*
X224790000Y212344000D01*
X224790000Y212344000D02*
X224790000Y201167500D01*
X272542000Y232664000D02*
X272542000Y243203014D01*
X272318000Y219740000D02*
X272542000Y219964000D01*
X272542000Y217170000D02*
X272318000Y217394000D01*
X272318000Y230348000D02*
X272318000Y232440000D01*
X274574000Y288544000D02*
X275082000Y289052000D01*
X272034000Y195580000D02*
X272542000Y196088000D01*
X272542000Y230124000D02*
X272318000Y230348000D01*
X272542000Y219964000D02*
X272542000Y230124000D01*
X272318000Y217394000D02*
X272318000Y219740000D01*
X272542000Y196088000D02*
X272542000Y217170000D01*
X274574000Y245235014D02*
X274574000Y288544000D01*
X272542000Y243203014D02*
X274574000Y245235014D01*
X272318000Y232440000D02*
X272542000Y232664000D01*
X245110000Y260604000D02*
X245110000Y274320000D01*
X245110000Y222758000D02*
X247142000Y224790000D01*
X247396000Y252222000D02*
X245999000Y253619000D01*
X247142000Y224790000D02*
X247142000Y233934000D01*
X246557801Y242493801D02*
X247396000Y243332000D01*
X245999000Y259715000D02*
X245110000Y260604000D01*
X245110000Y196088000D02*
X245110000Y222758000D01*
X245999000Y253619000D02*
X245999000Y259715000D01*
X245872000Y235204000D02*
X245872000Y235840130D01*
X245110000Y274320000D02*
X245618000Y274828000D01*
X247396000Y243332000D02*
X247396000Y252222000D01*
X247142000Y233934000D02*
X245872000Y235204000D01*
X245872000Y235840130D02*
X246557801Y236525931D01*
X245618000Y195580000D02*
X245110000Y196088000D01*
X246557801Y236525931D02*
X246557801Y242493801D01*
X258318000Y159512000D02*
X258318000Y155448000D01*
X258318000Y155448000D02*
X258826000Y154940000D01*
X258318000Y196088000D02*
X258318000Y159512000D01*
X258826000Y196596000D02*
X258318000Y196088000D01*
X259588000Y177038000D02*
X260350000Y176276000D01*
X260350000Y178816000D02*
X259588000Y178054000D01*
X259588000Y178054000D02*
X259588000Y177292000D01*
X260350000Y176276000D02*
X260350000Y163068000D01*
X260350000Y163068000D02*
X260350000Y162560000D01*
X260350000Y198120000D02*
X260350000Y178816000D01*
X260350000Y162560000D02*
X259842000Y162052000D01*
X259588000Y177292000D02*
X259588000Y177038000D01*
X260858000Y198628000D02*
X260350000Y198120000D01*
X249174000Y169164000D02*
X249174000Y168656000D01*
X249174000Y201168000D02*
X249174000Y169164000D01*
X249682000Y201676000D02*
X249174000Y201168000D01*
X249174000Y168656000D02*
X249682000Y168148000D01*
X246126000Y202184000D02*
X246126000Y169164000D01*
X246126000Y168656000D02*
X245618000Y168148000D01*
X246126000Y169164000D02*
X246126000Y168656000D01*
X245618000Y202692000D02*
X246126000Y202184000D01*
X227838000Y187654101D02*
X226822000Y186638101D01*
X227330000Y200660000D02*
X227838000Y200152000D01*
X233934000Y46736000D02*
X237490000Y50292000D01*
X229869999Y104043991D02*
X229869999Y34525950D01*
X229869999Y34525950D02*
X234423949Y29972000D01*
X226059999Y175006001D02*
X226822000Y174244000D01*
X233934000Y32766000D02*
X233934000Y46736000D01*
X226822000Y107091990D02*
X229869999Y104043991D01*
X226822000Y174244000D02*
X226822000Y107091990D01*
X226822000Y186638101D02*
X226822000Y179578000D01*
X236220000Y29972000D02*
X236220000Y30480000D01*
D26*
X227838000Y200152000D02*
X227838000Y187654101D01*
D24*
X226822000Y179578000D02*
X226060000Y178816000D01*
X236220000Y30480000D02*
X233934000Y32766000D01*
X226060000Y178816000D02*
X226059999Y175006001D01*
X234423949Y29972000D02*
X236220000Y29972000D01*
X236220000Y45212000D02*
X237998000Y46990000D01*
X242106000Y57696000D02*
X242106000Y64820000D01*
X238239300Y114033300D02*
X238239300Y114046001D01*
X237998000Y68928000D02*
X237998000Y113792000D01*
X237998000Y113792000D02*
X238239300Y114033300D01*
X238239300Y114046001D02*
X238493299Y114300000D01*
X237998000Y46990000D02*
X237998000Y53588000D01*
X237998000Y53588000D02*
X242106000Y57696000D01*
X242106000Y64820000D02*
X237998000Y68928000D01*
X243078000Y211328000D02*
X243078000Y224028000D01*
X243586000Y210820000D02*
X243078000Y211328000D01*
X243078000Y224028000D02*
X242570000Y224536000D01*
X242570000Y224536000D02*
X242570000Y229108000D01*
X256794000Y216916000D02*
X257302000Y216408000D01*
X257302000Y137160000D02*
X257302000Y216408000D01*
X258318000Y136144000D02*
X257302000Y137160000D01*
X257302000Y96012000D02*
X258318000Y97028000D01*
X257302000Y96012000D02*
X257302000Y94996000D01*
X258318000Y97028000D02*
X258318000Y136144000D01*
X264922000Y276860000D02*
X265430000Y276352000D01*
X264922000Y276860000D02*
X265430000Y277368000D01*
X265996000Y186458000D02*
X266446000Y186908000D01*
X265430000Y276352000D02*
X265430000Y239268000D01*
X265430000Y239268000D02*
X266446001Y238251999D01*
X266446000Y186908000D02*
X266446000Y238251999D01*
X265430000Y277368000D02*
X265430000Y292608000D01*
X265430000Y292608000D02*
X264160000Y293878000D01*
X204978000Y256032000D02*
X205486000Y256540000D01*
X205486000Y243840000D02*
X205486000Y252476000D01*
X205994000Y243332000D02*
X205486000Y243840000D01*
X205486000Y256540000D02*
X205486000Y288544000D01*
X204978000Y252984000D02*
X204978000Y256032000D01*
X205486000Y252476000D02*
X204978000Y252984000D01*
X205486000Y288544000D02*
X205994000Y289052000D01*
X211582000Y239268000D02*
X211582000Y239776000D01*
X211582000Y182880000D02*
X211582000Y239268000D01*
X212090000Y182372000D02*
X211582000Y182880000D01*
X211582000Y239776000D02*
X212090000Y240284000D01*
X208534000Y240284000D02*
X208534000Y240792000D01*
X208534000Y236982000D02*
X208534000Y240284000D01*
X208534000Y182880000D02*
X208534000Y236982000D01*
X209042000Y182372000D02*
X208534000Y182880000D01*
X208534000Y240792000D02*
X209042000Y241300000D01*
X201930000Y256032000D02*
X202438000Y256540000D01*
X202438000Y252984000D02*
X201930000Y253492000D01*
X202438000Y256540000D02*
X202438000Y284480000D01*
X201930000Y253492000D02*
X201930000Y256032000D01*
X201930000Y238252000D02*
X202438000Y238760000D01*
X202438000Y238760000D02*
X202438000Y252984000D01*
X202438000Y284480000D02*
X204470000Y286512000D01*
X204470000Y286512000D02*
X204978000Y287020000D01*
X239522000Y225044000D02*
X239522000Y215392000D01*
X239522000Y215392000D02*
X240030000Y214884000D01*
X239522000Y225044000D02*
X238506000Y226060000D01*
X202438000Y225552000D02*
X201422000Y226568000D01*
X201422000Y226568000D02*
X201422000Y271272000D01*
X201422000Y271272000D02*
X201930000Y271780000D01*
X202946000Y225044000D02*
X202438000Y225552000D01*
X200406000Y227584000D02*
X200914000Y227076000D01*
X200406000Y282956000D02*
X200406000Y227584000D01*
X199745600Y283616400D02*
X200406000Y282956000D01*
X188722000Y301128000D02*
X190246000Y299604000D01*
X190246000Y208280000D02*
X190754000Y207772000D01*
X190246000Y299604000D02*
X190246000Y208280000D01*
X189738000Y264160000D02*
X189738000Y263144000D01*
X189230000Y299104000D02*
X189230000Y264668000D01*
X189230000Y262636000D02*
X189230000Y212344000D01*
X188696000Y299638000D02*
X189230000Y299104000D01*
X189230000Y264668000D02*
X189738000Y264160000D01*
X189230000Y212344000D02*
X188722000Y211836000D01*
X189738000Y263144000D02*
X189230000Y262636000D01*
X180086000Y294818000D02*
X180086000Y300736000D01*
X180086000Y300736000D02*
X179578000Y301244000D01*
X180676000Y294228000D02*
X180086000Y294818000D01*
X261874000Y281940000D02*
X262382000Y282448000D01*
X262382000Y312928000D02*
X261874000Y313436000D01*
X262382000Y282448000D02*
X262382000Y312928000D01*
X254762000Y249428000D02*
X255270000Y249936000D01*
X255116000Y288698000D02*
X253746000Y290068000D01*
X255270000Y249936000D02*
X255270000Y286512000D01*
X255116000Y286666000D02*
X255116000Y288698000D01*
X255270000Y286512000D02*
X255116000Y286666000D01*
X237998000Y181851299D02*
X237998000Y181864000D01*
X237998000Y185674000D02*
X237998000Y181864000D01*
X237985298Y187185298D02*
X237985298Y185686702D01*
X237998000Y196088000D02*
X237998000Y187198000D01*
X238493299Y200660000D02*
X237998000Y200164701D01*
X237998000Y200164701D02*
X237985298Y200151999D01*
X237985298Y185686702D02*
X237998000Y185674000D01*
X237985298Y196100702D02*
X237998000Y196088000D01*
X237985298Y200151999D02*
X237985298Y196100702D01*
X237998000Y187198000D02*
X237985298Y187185298D01*
X238493299Y181356000D02*
X237998000Y181851299D01*
X251714000Y256286000D02*
X252222000Y255778000D01*
X253746000Y277876000D02*
X253238000Y277368000D01*
X250952000Y260083984D02*
X250952000Y259842000D01*
X250952000Y259842000D02*
X250952000Y257048000D01*
X240538000Y221606000D02*
X240538000Y214376000D01*
X251206000Y223520000D02*
X251714000Y223012000D01*
X240538000Y214376000D02*
X240030000Y213868000D01*
X252222000Y255778000D02*
X252222000Y251206000D01*
X253238000Y262369984D02*
X250952000Y260083984D01*
X253238000Y276098000D02*
X253238000Y262369984D01*
X240036000Y222108000D02*
X240538000Y221606000D01*
X251206000Y233426000D02*
X251206000Y223520000D01*
X252222000Y251206000D02*
X252222000Y234442000D01*
X250952000Y257048000D02*
X251714000Y256286000D01*
X253238000Y277368000D02*
X253238000Y276098000D01*
X252222000Y234442000D02*
X251206000Y233426000D01*
X237998000Y218948000D02*
X237998000Y238252000D01*
X235966000Y250444000D02*
X235966000Y255270000D01*
X238760000Y218186000D02*
X237998000Y218948000D01*
X237998000Y248412000D02*
X235966000Y250444000D01*
X237998000Y257302000D02*
X237998000Y269240000D01*
X238252000Y239224421D02*
X237998000Y239478421D01*
X240030000Y212852000D02*
X238760000Y214122000D01*
X238252000Y238506000D02*
X238252000Y239224421D01*
X235966000Y255270000D02*
X237998000Y257302000D01*
X237998000Y239478421D02*
X237998000Y248412000D01*
X237998000Y269240000D02*
X238506000Y269748000D01*
X238760000Y214122000D02*
X238760000Y218186000D01*
X237998000Y238252000D02*
X238252000Y238506000D01*
X235966000Y130048000D02*
X236474000Y129540000D01*
X235995982Y181539878D02*
X235995982Y180115982D01*
X235995982Y180115982D02*
X235966000Y180086000D01*
X235458000Y197612000D02*
X235966000Y197104000D01*
X235966000Y181569860D02*
X235995982Y181539878D01*
X239522000Y118872000D02*
X240030000Y119380000D01*
X235966000Y180086000D02*
X235966000Y130048000D01*
X240030000Y128016000D02*
X239522000Y128524000D01*
X240030000Y119380000D02*
X240030000Y128016000D01*
X235966000Y197104000D02*
X235966000Y181569860D01*
X242062000Y224536000D02*
X242062000Y161290000D01*
X242062000Y161290000D02*
X242062000Y158242000D01*
X242316000Y157988000D02*
X242570000Y157988000D01*
X242062000Y158242000D02*
X242316000Y157988000D01*
X241554000Y225044000D02*
X242062000Y224536000D01*
X243586000Y151384000D02*
X244094000Y151892000D01*
X244094000Y151892000D02*
X244094000Y224028000D01*
X244094000Y224028000D02*
X243586000Y224536000D01*
X239014000Y293624000D02*
X238506000Y293116000D01*
X239522000Y310192000D02*
X239014000Y309684000D01*
X246126000Y91737382D02*
X246126000Y147320000D01*
X245110000Y90721382D02*
X246126000Y91737382D01*
X245110000Y55880000D02*
X245110000Y90721382D01*
X246634000Y54356000D02*
X245364000Y55626000D01*
X239014000Y309684000D02*
X239014000Y293624000D01*
X246126000Y147320000D02*
X245618000Y147828000D01*
X245364000Y55626000D02*
X245110000Y55880000D01*
X232410000Y231140000D02*
X232918000Y231648000D01*
X232918000Y231648000D02*
X232918000Y260096000D01*
X233426000Y260604000D02*
X232918000Y260096000D01*
X181102000Y185928000D02*
X181102000Y193040000D01*
X181610000Y185420000D02*
X181102000Y185928000D01*
X181102000Y193040000D02*
X181610000Y193548000D01*
X242823999Y267462001D02*
X242823999Y267969999D01*
X243078000Y272288000D02*
X243586000Y272796000D01*
X242823999Y267969999D02*
X243078000Y268224000D01*
X243332000Y266954000D02*
X242823999Y267462001D01*
X243078000Y268224000D02*
X243078000Y271780000D01*
X243078000Y271780000D02*
X243078000Y272288000D01*
X244094000Y266954000D02*
X243332000Y266954000D01*
X259334000Y289560000D02*
X259334000Y286305562D01*
X259391721Y286247841D02*
X259391721Y285299721D01*
X259391721Y285299721D02*
X259334000Y285242000D01*
X259334000Y285242000D02*
X259334000Y249953578D01*
X259334000Y249953578D02*
X259857388Y249430190D01*
X258826000Y290068000D02*
X259334000Y289560000D01*
X259334000Y286305562D02*
X259391721Y286247841D01*
X252222000Y222504000D02*
X252222000Y231902000D01*
X252730000Y221996000D02*
X252222000Y222504000D01*
X253238000Y252730000D02*
X254254000Y253746000D01*
X252222000Y231902000D02*
X253238000Y232918000D01*
X254254000Y275336000D02*
X253746000Y275844000D01*
X254254000Y253746000D02*
X254254000Y275336000D01*
X253238000Y232918000D02*
X253238000Y252730000D01*
X246634000Y258572000D02*
X247142000Y259080000D01*
X235458000Y249936000D02*
X235458000Y256540000D01*
X246634000Y271399000D02*
X248158000Y272923000D01*
X235966000Y246380000D02*
X235966000Y249428000D01*
X237477298Y228092000D02*
X237477298Y228451210D01*
X246634000Y263906000D02*
X246634000Y271399000D01*
X236982000Y229108000D02*
X236982000Y245364000D01*
X235458000Y256540000D02*
X237490000Y258572000D01*
X235966000Y249428000D02*
X235458000Y249936000D01*
X248158000Y272923000D02*
X248158000Y288544000D01*
X247142000Y263398000D02*
X246634000Y263906000D01*
X247142000Y259080000D02*
X247142000Y263398000D01*
X237477298Y228451210D02*
X237328508Y228600000D01*
X237328508Y228761492D02*
X236982000Y229108000D01*
X237328508Y228600000D02*
X237328508Y228761492D01*
X248158000Y288544000D02*
X248666000Y289052000D01*
X236982000Y245364000D02*
X235966000Y246380000D01*
X281686000Y221996000D02*
X281686000Y221488000D01*
X280670000Y278892000D02*
X281686000Y277876000D01*
X281686000Y277876000D02*
X281686000Y221996000D01*
X281686000Y221488000D02*
X281178000Y220980000D01*
X255778000Y132588000D02*
X255778000Y135890000D01*
X255778000Y135890000D02*
X255270000Y136398000D01*
X255270000Y136398000D02*
X255270000Y172720000D01*
X255270000Y172720000D02*
X255778000Y173228000D01*
X216662000Y205232000D02*
X216662000Y197358000D01*
X217170000Y205740000D02*
X216662000Y205232000D01*
X216154000Y196850000D02*
X216154000Y172974000D01*
X216154000Y172974000D02*
X214630000Y171450000D01*
X215646000Y137414000D02*
X215646000Y131572000D01*
X214630000Y171450000D02*
X214630000Y138430000D01*
X216662000Y197358000D02*
X216154000Y196850000D01*
X214630000Y138430000D02*
X215646000Y137414000D01*
X237490000Y142748000D02*
X236982000Y143256000D01*
X236982000Y197104000D02*
X236982000Y207264000D01*
X236982000Y207264000D02*
X236474000Y207772000D01*
X236982000Y197104000D02*
X236982000Y143256000D01*
X232410000Y126492000D02*
X232918000Y127000000D01*
X232918000Y127000000D02*
X232918000Y182880000D01*
X232918000Y189473842D02*
X232918000Y195580000D01*
X231902000Y187960000D02*
X232918000Y188976000D01*
X231902000Y183896000D02*
X231902000Y187960000D01*
X232918000Y188976000D02*
X232918000Y189473842D01*
X232918000Y182880000D02*
X231902000Y183896000D01*
X233426000Y196088000D02*
X232918000Y195580000D01*
X265406000Y208578000D02*
X265406000Y207178000D01*
X265446000Y232708000D02*
X265446000Y224048000D01*
X265446000Y220258000D02*
X265446000Y208618000D01*
X265946000Y233208000D02*
X265446000Y232708000D01*
X265406000Y224008000D02*
X265406000Y220298000D01*
X265406000Y220298000D02*
X265446000Y220258000D01*
X265446000Y224048000D02*
X265406000Y224008000D01*
X265446000Y202198000D02*
X265946000Y201698000D01*
X265446000Y208618000D02*
X265406000Y208578000D01*
X265406000Y207178000D02*
X265446000Y207138000D01*
X265446000Y207138000D02*
X265446000Y202198000D01*
X231902000Y235966000D02*
X231902000Y201168000D01*
X232410000Y200660000D02*
X231902000Y201168000D01*
X267462000Y199136000D02*
X266954000Y198628000D01*
X267462000Y231648000D02*
X267462000Y199136000D01*
X266954000Y232156000D02*
X267462000Y231648000D01*
X241046000Y296672000D02*
X240538000Y297180000D01*
X242062000Y249936000D02*
X243078000Y250952000D01*
X242062000Y240284000D02*
X242062000Y249936000D01*
X241046000Y260858000D02*
X241046000Y296672000D01*
X243078000Y258826000D02*
X241046000Y260858000D01*
X243078000Y250952000D02*
X243078000Y258826000D01*
X234950000Y258826000D02*
X235966000Y259842000D01*
X235966000Y259842000D02*
X235966000Y296672000D01*
X234950000Y249682000D02*
X234950000Y258826000D01*
X235966000Y296672000D02*
X235458000Y297180000D01*
X235458000Y249174000D02*
X234950000Y249682000D01*
X235458000Y248920000D02*
X235458000Y249174000D01*
X231394000Y244348000D02*
X231902000Y244856000D01*
X231902000Y294640000D02*
X231902000Y297688000D01*
X231902000Y244856000D02*
X231902000Y294640000D01*
X231902000Y297688000D02*
X231394000Y298196000D01*
X242062000Y282448000D02*
X242062000Y282956000D01*
X242062000Y282956000D02*
X242062000Y297688000D01*
X242062000Y297688000D02*
X241554000Y298196000D01*
X241554000Y281940000D02*
X242062000Y282448000D01*
X217678000Y213360000D02*
X217678000Y213868000D01*
X217678000Y230632000D02*
X217678000Y213868000D01*
X218186000Y212852000D02*
X217678000Y213360000D01*
X218186000Y231140000D02*
X217678000Y230632000D01*
X224790000Y220472000D02*
X224282000Y220980000D01*
X224790000Y213360000D02*
X224790000Y220472000D01*
X224282000Y212852000D02*
X224790000Y213360000D01*
X241046000Y54348000D02*
X242626000Y55928000D01*
X241046000Y1016000D02*
X241046000Y54348000D01*
X241046000Y196088000D02*
X241554000Y196596000D01*
X241046000Y66798000D02*
X241046000Y196088000D01*
X242626000Y55928000D02*
X242626000Y65218000D01*
X240538000Y508000D02*
X241046000Y1016000D01*
X242626000Y65218000D02*
X241046000Y66798000D01*
X221742000Y218440000D02*
X221742000Y207010000D01*
X221830001Y203542001D02*
X221742000Y203454000D01*
X221234000Y218948000D02*
X221742000Y218440000D01*
X221742000Y207010000D02*
X221742000Y206248000D01*
X221742000Y203454000D02*
X221742000Y202946000D01*
X221488000Y202946000D02*
X221234000Y202692000D01*
X221742000Y204579922D02*
X221830001Y204491921D01*
X221830001Y204491921D02*
X221830001Y203542001D01*
X221742000Y202946000D02*
X221488000Y202946000D01*
X221742000Y206248000D02*
X221742000Y204579922D01*
X273558000Y271272000D02*
X271526000Y269240000D01*
X273558000Y257556000D02*
X273558000Y251460000D01*
X273050000Y282956000D02*
X273050000Y279664158D01*
X273558000Y251460000D02*
X274066000Y250952000D01*
X271526000Y269240000D02*
X271526000Y259588000D01*
X273050000Y279664158D02*
X273558000Y279156158D01*
X271526000Y259588000D02*
X273558000Y257556000D01*
X273558000Y279156158D02*
X273558000Y271272000D01*
X272034000Y283972000D02*
X273050000Y282956000D01*
X242570000Y116078000D02*
X243078000Y116586000D01*
X242570000Y111760000D02*
X242570000Y116078000D01*
X243078000Y153162000D02*
X243332000Y153416000D01*
X243086000Y53888000D02*
X243746000Y54548000D01*
X243746000Y54548000D02*
X243746000Y65950000D01*
X242570000Y6604000D02*
X243078000Y7112000D01*
X243078000Y83058000D02*
X243078000Y111252000D01*
X243078000Y111252000D02*
X242570000Y111760000D01*
X243078000Y134620000D02*
X242969000Y134729000D01*
X243332000Y157226000D02*
X243078000Y157480000D01*
X243078000Y7112000D02*
X243078000Y53430000D01*
X242969000Y137051000D02*
X243078000Y137160000D01*
X242570000Y77978000D02*
X242570000Y82550000D01*
X243078000Y77470000D02*
X242570000Y77978000D01*
X243746000Y65950000D02*
X243078000Y66618000D01*
X242969000Y134729000D02*
X242969000Y137051000D01*
X243078000Y53430000D02*
X243086000Y53438000D01*
X243078000Y137160000D02*
X243078000Y153162000D01*
X243332000Y153416000D02*
X243332000Y157226000D01*
X243078000Y116586000D02*
X243078000Y134620000D01*
X243078000Y205232000D02*
X243586000Y205740000D01*
X243078000Y157480000D02*
X243078000Y205232000D01*
X242570000Y82550000D02*
X243078000Y83058000D01*
X243078000Y66618000D02*
X243078000Y77470000D01*
X243086000Y53438000D02*
X243086000Y53888000D01*
X254000000Y33528000D02*
X252397185Y31925185D01*
X261874000Y111252000D02*
X262382000Y111760000D01*
X252397185Y19128815D02*
X254000000Y17526000D01*
X254000000Y40640000D02*
X254000000Y33528000D01*
X254000000Y17526000D02*
X254000000Y15494000D01*
X252349000Y101727000D02*
X253618999Y100457001D01*
X252222000Y42418000D02*
X254000000Y40640000D01*
X262382000Y113792000D02*
X262890000Y114300000D01*
X253618999Y99949001D02*
X254254000Y99314000D01*
X252222000Y68580000D02*
X252222000Y42418000D01*
X254000000Y95504000D02*
X254000000Y70358000D01*
X253618999Y100457001D02*
X253618999Y99949001D01*
X254254000Y95758000D02*
X254000000Y95504000D01*
X251587000Y101727000D02*
X252349000Y101727000D01*
X254000000Y15494000D02*
X253492000Y14986000D01*
X262382000Y111760000D02*
X262382000Y113792000D01*
X252397185Y31925185D02*
X252397185Y19128815D01*
X254254000Y99314000D02*
X254254000Y95758000D01*
X253492000Y14986000D02*
X253492000Y-508000D01*
X254000000Y70358000D02*
X252222000Y68580000D01*
X180340000Y4572000D02*
X180340000Y5080000D01*
X179832000Y9144000D02*
X180086000Y9398000D01*
X180086000Y10160000D02*
X181102000Y11176000D01*
X181102000Y48768000D02*
X181610000Y49276000D01*
X179832000Y5588000D02*
X179832000Y9144000D01*
X180340000Y5080000D02*
X179832000Y5588000D01*
D26*
X181102000Y11176000D02*
X181102000Y48768000D01*
X180086000Y9398000D02*
X180086000Y10160000D01*
D24*
X223266000Y231394000D02*
X223774000Y230886000D01*
X224282000Y236220000D02*
X223266000Y235204000D01*
X223774000Y204216000D02*
X223266000Y203708000D01*
X223266000Y235204000D02*
X223266000Y231394000D01*
X223774000Y230886000D02*
X223774000Y204216000D01*
X245618000Y287020000D02*
X242570000Y283972000D01*
X214630000Y314960000D02*
X217170000Y312420000D01*
X27178000Y307594000D02*
X28027999Y308443999D01*
X217170000Y312420000D02*
X217678000Y311912000D01*
X212598000Y314960000D02*
X214630000Y314960000D01*
X28956000Y314960000D02*
X212598000Y314960000D01*
X28027999Y308443999D02*
X28448000Y308864000D01*
X217678000Y244856000D02*
X217678000Y244623950D01*
X217678000Y244623950D02*
X217170000Y244115950D01*
X28448000Y308864000D02*
X28448000Y314452000D01*
X28448000Y314452000D02*
X28956000Y314960000D01*
X217678000Y311912000D02*
X217678000Y244856000D01*
X219710000Y241808000D02*
X220218000Y241300000D01*
X218694000Y242062000D02*
X218948000Y241808000D01*
X218694000Y311912000D02*
X218694000Y242062000D01*
X218186000Y312420000D02*
X218694000Y311912000D01*
X218948000Y241808000D02*
X219710000Y241808000D01*
X214630000Y313944000D02*
X216154000Y312420000D01*
X33528000Y313690000D02*
X33782000Y313944000D01*
X32258000Y307594000D02*
X33528000Y308864000D01*
X33782000Y313944000D02*
X212852000Y313944000D01*
X33528000Y308864000D02*
X33528000Y313690000D01*
X212852000Y313944000D02*
X214630000Y313944000D01*
X35814000Y312928000D02*
X211582000Y312928000D01*
X216662000Y269059106D02*
X216685801Y269035305D01*
X34798000Y311912000D02*
X35814000Y312928000D01*
X216662000Y310896000D02*
X216662000Y269059106D01*
X216662000Y244348000D02*
X216154000Y244348000D01*
X216154000Y244348000D02*
X214122000Y242316000D01*
X34798000Y310134000D02*
X34798000Y311912000D01*
X214630000Y312928000D02*
X215138000Y312420000D01*
X211582000Y312928000D02*
X214630000Y312928000D01*
X216685801Y266723801D02*
X216662000Y266700000D01*
X215138000Y312420000D02*
X216662000Y310896000D01*
X216685801Y269035305D02*
X216685801Y266723801D01*
X216662000Y266700000D02*
X216662000Y244348000D01*
X279908000Y226568000D02*
X279908000Y223774000D01*
X279653999Y223519999D02*
X279653999Y212344001D01*
X279908000Y223774000D02*
X279653999Y223519999D01*
X279400000Y227076000D02*
X279908000Y226568000D01*
X279653999Y212344001D02*
X280162000Y211836000D01*
X243175800Y244348000D02*
X242570000Y244953800D01*
X242062000Y273304000D02*
X242570000Y273812000D01*
X242570000Y249713203D02*
X244824797Y251968000D01*
X242570000Y244953800D02*
X242570000Y249713203D01*
X244824797Y258603203D02*
X242062000Y261366000D01*
X244824797Y251968000D02*
X244824797Y258603203D01*
X242062000Y261366000D02*
X242062000Y273304000D01*
X199390000Y250190000D02*
X199477000Y250277000D01*
X199390000Y252222000D02*
X199390000Y260096000D01*
X199390000Y233680000D02*
X199390000Y250190000D01*
X199477000Y252135000D02*
X199390000Y252222000D01*
X199477000Y250277000D02*
X199477000Y252135000D01*
X199390000Y260096000D02*
X199898000Y260604000D01*
X198882000Y233172000D02*
X199390000Y233680000D01*
X260530050Y251642456D02*
X260855594Y251968000D01*
X260858000Y251968000D02*
X262890000Y254000000D01*
X243586000Y258572000D02*
X244094000Y258064000D01*
X244094000Y252730000D02*
X244094000Y251968000D01*
X262890000Y280924000D02*
X263906000Y281940000D01*
X262890000Y254000000D02*
X262890000Y280162000D01*
X244094000Y258064000D02*
X244094000Y252730000D01*
X262890000Y280162000D02*
X262890000Y280924000D01*
X260855594Y251968000D02*
X260858000Y251968000D01*
X244094000Y251968000D02*
X243586000Y251460000D01*
X249682000Y262636000D02*
X249174000Y263144000D01*
X249174000Y274320000D02*
X249682000Y274828000D01*
X249174000Y263144000D02*
X249174000Y274320000D01*
X256794000Y253734050D02*
X256286000Y254242050D01*
X256206199Y274240199D02*
X256794000Y274828000D01*
X256206199Y254321851D02*
X256206199Y274240199D01*
X256286000Y254242050D02*
X256206199Y254321851D01*
X236220000Y227317298D02*
X236220000Y227330000D01*
X235966000Y227584000D02*
X235966000Y244220997D01*
X237477298Y226060000D02*
X236220000Y227317298D01*
X236220000Y227330000D02*
X235966000Y227584000D01*
X235966000Y244220997D02*
X236474000Y244728997D01*
X246888000Y251714000D02*
X245491000Y253111000D01*
X244094000Y237744000D02*
X243078000Y238760000D01*
X245491000Y253111000D02*
X245491000Y259461000D01*
X244602000Y261620000D02*
X243586000Y262636000D01*
X243676000Y235204000D02*
X244094000Y235622000D01*
X245491000Y259461000D02*
X244602000Y260350000D01*
X243078000Y238760000D02*
X243078000Y240538000D01*
X244602000Y260350000D02*
X244602000Y261620000D01*
X243078000Y240538000D02*
X246888000Y244348000D01*
X246888000Y244348000D02*
X246888000Y251714000D01*
X244094000Y235622000D02*
X244094000Y237744000D01*
X233934000Y269240000D02*
X233934000Y270256000D01*
X234442000Y212852000D02*
X233934000Y213360000D01*
X233934000Y270256000D02*
X234442000Y270764000D01*
X233934000Y213360000D02*
X233934000Y269240000D01*
X230766000Y188637236D02*
X230766000Y183020764D01*
X228766000Y181020764D02*
X228766000Y179694764D01*
X230382000Y190314764D02*
X230382000Y189021236D01*
X230766000Y194778000D02*
X230448000Y194460000D01*
X230766000Y183020764D02*
X228766000Y181020764D01*
X229866000Y112618000D02*
X236866000Y105618000D01*
X227791200Y178302436D02*
X229866000Y176227636D01*
X229362000Y208788000D02*
X229362000Y199424584D01*
X236866000Y105618000D02*
X236866000Y101728000D01*
X230766000Y198020584D02*
X230766000Y194778000D01*
X236866000Y101728000D02*
X237116000Y101478000D01*
X229362000Y199424584D02*
X230766000Y198020584D01*
X228766000Y179694764D02*
X227791200Y178719964D01*
X237116000Y101478000D02*
X237116000Y63515500D01*
X230382000Y189021236D02*
X230766000Y188637236D01*
X237116000Y63515500D02*
X241553500Y59078000D01*
X227791200Y178719964D02*
X227791200Y178302436D01*
X230448000Y194460000D02*
X230448000Y190380764D01*
X229866000Y176227636D02*
X229866000Y112618000D01*
X230448000Y190380764D02*
X230382000Y190314764D01*
G04 #@! TA.AperFunction,NonConductor*
G36*
X64088121Y5079998D02*
G01*
X64134614Y5026342D01*
X64146000Y4974000D01*
X64146000Y1226000D01*
X64125998Y1157879D01*
X64072342Y1111386D01*
X64020000Y1100000D01*
X60272000Y1100000D01*
X60203879Y1120002D01*
X60157386Y1173658D01*
X60146000Y1226000D01*
X60146000Y2037447D01*
X61433204Y2037447D01*
X62859776Y2037447D01*
X62859776Y4105897D01*
X61433204Y4105897D01*
X61433204Y2037447D01*
X60146000Y2037447D01*
X60146000Y4974000D01*
X60166002Y5042121D01*
X60219658Y5088614D01*
X60272000Y5100000D01*
X64020000Y5100000D01*
X64088121Y5079998D01*
G37*
G04 #@! TD.AperFunction*
D27*
X276430000Y-4748000D02*
X276430000Y207000000D01*
X-3570000Y-5450000D02*
X275628000Y-5450000D01*
X176700000Y116142000D02*
X176700000Y205028000D01*
X176700000Y294745000D02*
X-3570000Y294745000D01*
X188180000Y205028000D02*
X188180000Y255047000D01*
X188180000Y255047000D02*
X176700000Y255047000D01*
X176700000Y205028000D02*
X188180000Y205028000D01*
X276430000Y207000000D02*
X285420000Y207000000D01*
X276430000Y289100000D02*
X276430000Y315898000D01*
X276430000Y315898000D02*
X275628000Y316550000D01*
X176700000Y16405000D02*
X-3570000Y16405000D01*
X275628000Y-5450000D02*
X276430000Y-4748000D01*
X-3570000Y316550000D02*
X275628000Y316550000D01*
X176700000Y16405000D02*
X176700000Y66123000D01*
X285420000Y289100000D02*
X285420000Y207000000D01*
X176700000Y66123000D02*
X176700000Y116142000D01*
X-3570000Y294745000D02*
X-3570000Y316550000D01*
X-3570000Y-5450000D02*
X-3570000Y16405000D01*
X176700000Y255047000D02*
X176700000Y294745000D01*
X276430000Y289100000D02*
X285420000Y289100000D01*
M02*
