(kicad_symbol_lib (version 20220914) (generator kicad_symbol_editor)
  (symbol "SDS001" (pin_names (offset 1.016)) (in_bom yes) (on_board yes)
    (property "Reference" "U" (at 6.35 3.81 0)
      (effects (font (size 1.27 1.27)))
    )
    (property "Value" "SDS001" (at 0 -5.08 0)
      (effects (font (size 1.27 1.27)))
    )
    (property "Footprint" "" (at 0 0 0)
      (effects (font (size 1.27 1.27)) hide)
    )
    (property "Datasheet" "" (at 0 0 0)
      (effects (font (size 1.27 1.27)) hide)
    )
    (symbol "SDS001_0_1"
      (circle (center -2.54 -1.27) (radius 1.27)
        (stroke (width 0) (type solid))
        (fill (type none))
      )
      (polyline
        (pts
          (xy -3.81 1.27)
          (xy 3.81 1.27)
        )
        (stroke (width 0) (type solid))
        (fill (type none))
      )
      (polyline
        (pts
          (xy 0 1.27)
          (xy 0 2.54)
        )
        (stroke (width 0) (type solid))
        (fill (type none))
      )
      (circle (center 2.54 -1.27) (radius 1.27)
        (stroke (width 0) (type solid))
        (fill (type none))
      )
    )
    (symbol "SDS001_1_1"
      (pin passive line (at -8.89 -1.27 0) (length 5.08)
        (name "~" (effects (font (size 1.27 1.27))))
        (number "1" (effects (font (size 1.27 1.27))))
      )
      (pin passive line (at 8.89 -1.27 180) (length 5.08)
        (name "~" (effects (font (size 1.27 1.27))))
        (number "2" (effects (font (size 1.27 1.27))))
      )
    )
  )
)
