(kicad_symbol_lib (version 20220914) (generator kicad_symbol_editor)
  (symbol "ADP1755" (pin_names (offset 1.016)) (in_bom yes) (on_board yes)
    (property "Reference" "U" (at 6.35 -21.59 0)
      (effects (font (size 1.27 1.27)))
    )
    (property "Value" "ADP1755" (at 0 -20.32 0)
      (effects (font (size 1.27 1.27)))
    )
    (property "Footprint" "" (at 0 7.62 0)
      (effects (font (size 1.27 1.27)) hide)
    )
    (property "Datasheet" "" (at 0 7.62 0)
      (effects (font (size 1.27 1.27)) hide)
    )
    (symbol "ADP1755_0_1"
      (rectangle (start -7.62 13.97) (end 7.62 -19.05)
        (stroke (width 0) (type solid))
        (fill (type none))
      )
    )
    (symbol "ADP1755_1_1"
      (pin power_in line (at -10.16 11.43 0) (length 2.54)
        (name "V_IN" (effects (font (size 1.27 1.27))))
        (number "1" (effects (font (size 1.27 1.27))))
      )
      (pin power_out line (at 10.16 11.43 180) (length 2.54)
        (name "V_OUT" (effects (font (size 1.27 1.27))))
        (number "10" (effects (font (size 1.27 1.27))))
      )
      (pin passive line (at 10.16 8.89 180) (length 2.54)
        (name "V_OUT" (effects (font (size 1.27 1.27))))
        (number "11" (effects (font (size 1.27 1.27))))
      )
      (pin passive line (at 10.16 6.35 180) (length 2.54)
        (name "V_OUT" (effects (font (size 1.27 1.27))))
        (number "12" (effects (font (size 1.27 1.27))))
      )
      (pin passive line (at 10.16 3.81 180) (length 2.54)
        (name "V_OUT" (effects (font (size 1.27 1.27))))
        (number "13" (effects (font (size 1.27 1.27))))
      )
      (pin passive line (at 10.16 1.27 180) (length 2.54)
        (name "V_OUT" (effects (font (size 1.27 1.27))))
        (number "14" (effects (font (size 1.27 1.27))))
      )
      (pin power_in line (at -10.16 3.81 0) (length 2.54)
        (name "V_IN" (effects (font (size 1.27 1.27))))
        (number "15" (effects (font (size 1.27 1.27))))
      )
      (pin power_in line (at -10.16 1.27 0) (length 2.54)
        (name "V_IN" (effects (font (size 1.27 1.27))))
        (number "16" (effects (font (size 1.27 1.27))))
      )
      (pin power_in line (at -10.16 8.89 0) (length 2.54)
        (name "V_IN" (effects (font (size 1.27 1.27))))
        (number "2" (effects (font (size 1.27 1.27))))
      )
      (pin power_in line (at -10.16 6.35 0) (length 2.54)
        (name "V_IN" (effects (font (size 1.27 1.27))))
        (number "3" (effects (font (size 1.27 1.27))))
      )
      (pin input line (at -10.16 -3.81 0) (length 2.54)
        (name "EN" (effects (font (size 1.27 1.27))))
        (number "4" (effects (font (size 1.27 1.27))))
      )
      (pin output line (at -10.16 -10.16 0) (length 2.54)
        (name "PG" (effects (font (size 1.27 1.27))))
        (number "5" (effects (font (size 1.27 1.27))))
      )
      (pin power_in line (at 10.16 -13.97 180) (length 2.54)
        (name "GND" (effects (font (size 1.27 1.27))))
        (number "6" (effects (font (size 1.27 1.27))))
      )
      (pin passive line (at 10.16 -8.89 180) (length 2.54)
        (name "SS" (effects (font (size 1.27 1.27))))
        (number "7" (effects (font (size 1.27 1.27))))
      )
      (pin no_connect line (at -10.16 -16.51 0) (length 2.54)
        (name "NC" (effects (font (size 1.27 1.27))))
        (number "8" (effects (font (size 1.27 1.27))))
      )
      (pin input line (at 10.16 -3.81 180) (length 2.54)
        (name "ADJ" (effects (font (size 1.27 1.27))))
        (number "9" (effects (font (size 1.27 1.27))))
      )
      (pin power_in line (at 10.16 -16.51 180) (length 2.54)
        (name "GND" (effects (font (size 1.27 1.27))))
        (number "PAD" (effects (font (size 1.27 1.27))))
      )
    )
  )
)
