(module ERF8-013-01-L-D-RA (layer F.Cu) (tedit 5C17DDE4)
  (fp_text reference J16 (at 4.045 2.17) (layer F.SilkS)
    (effects (font (size 1 1) (thickness 0.15)))
  )
  (fp_text value MezzHSD (at -8.835 -4.17) (layer F.Fab)
    (effects (font (size 1 1) (thickness 0.15)))
  )
  (fp_line (start -20.53 3) (end -20.53 -8.35) (layer F.SilkS) (width 0.15))
  (fp_line (start -20.53 3) (end 2.88 3) (layer F.SilkS) (width 0.15))
  (fp_line (start -20.53 -8.35) (end 2.88 -8.35) (layer F.SilkS) (width 0.15))
  (fp_line (start 2.88 3) (end 2.88 -8.35) (layer F.SilkS) (width 0.15))
  (pad G2 thru_hole circle (at -17.65 0) (size 3.5 3.5) (drill 1.905) (layers *.Cu *.Mask))
  (pad G1 thru_hole circle (at 0 0) (size 3.5 3.5) (drill 1.905) (layers *.Cu *.Mask))
  (pad "" np_thru_hole circle (at -17.65 -4.35) (size 1.45 1.45) (drill 1.45) (layers *.Cu *.Mask))
  (pad "" np_thru_hole circle (at 0 -4.35) (size 1.45 1.45) (drill 1.45) (layers *.Cu *.Mask))
  (pad L2 thru_hole circle (at -16.925 -6.13) (size 1 1) (drill 0.63) (layers *.Cu *.Mask))
  (pad L1 thru_hole circle (at -0.725 -6.13) (size 1 1) (drill 0.63) (layers *.Cu *.Mask))
  (pad 26 smd rect (at -13.625 0.23) (size 0.5 1.5) (layers F.Cu F.Paste F.Mask))
  (pad 24 smd rect (at -12.825 0.23) (size 0.5 1.5) (layers F.Cu F.Paste F.Mask))
  (pad 22 smd rect (at -12.025 0.23) (size 0.5 1.5) (layers F.Cu F.Paste F.Mask))
  (pad 20 smd rect (at -11.225 0.23) (size 0.5 1.5) (layers F.Cu F.Paste F.Mask))
  (pad 18 smd rect (at -10.425 0.23) (size 0.5 1.5) (layers F.Cu F.Paste F.Mask))
  (pad 16 smd rect (at -9.625 0.23) (size 0.5 1.5) (layers F.Cu F.Paste F.Mask))
  (pad 14 smd rect (at -8.825 0.23) (size 0.5 1.5) (layers F.Cu F.Paste F.Mask))
  (pad 12 smd rect (at -8.025 0.23) (size 0.5 1.5) (layers F.Cu F.Paste F.Mask))
  (pad 10 smd rect (at -7.225 0.23) (size 0.5 1.5) (layers F.Cu F.Paste F.Mask))
  (pad 8 smd rect (at -6.425 0.23) (size 0.5 1.5) (layers F.Cu F.Paste F.Mask))
  (pad 6 smd rect (at -5.625 0.23) (size 0.5 1.5) (layers F.Cu F.Paste F.Mask))
  (pad 4 smd rect (at -4.825 0.23) (size 0.5 1.5) (layers F.Cu F.Paste F.Mask))
  (pad 2 smd rect (at -4.025 0.23) (size 0.5 1.5) (layers F.Cu F.Paste F.Mask))
  (pad 25 smd rect (at -13.625 -1.65) (size 0.5 1.25) (layers F.Cu F.Paste F.Mask))
  (pad 23 smd rect (at -12.825 -1.65) (size 0.5 1.25) (layers F.Cu F.Paste F.Mask))
  (pad 21 smd rect (at -12.025 -1.65) (size 0.5 1.25) (layers F.Cu F.Paste F.Mask))
  (pad 19 smd rect (at -11.225 -1.65) (size 0.5 1.25) (layers F.Cu F.Paste F.Mask))
  (pad 17 smd rect (at -10.425 -1.65) (size 0.5 1.25) (layers F.Cu F.Paste F.Mask))
  (pad 15 smd rect (at -9.625 -1.65) (size 0.5 1.25) (layers F.Cu F.Paste F.Mask))
  (pad 13 smd rect (at -8.825 -1.65) (size 0.5 1.25) (layers F.Cu F.Paste F.Mask))
  (pad 11 smd rect (at -8.025 -1.65) (size 0.5 1.25) (layers F.Cu F.Paste F.Mask))
  (pad 9 smd rect (at -7.225 -1.65) (size 0.5 1.25) (layers F.Cu F.Paste F.Mask))
  (pad 7 smd rect (at -6.425 -1.65) (size 0.5 1.25) (layers F.Cu F.Paste F.Mask))
  (pad 5 smd rect (at -5.625 -1.65) (size 0.5 1.25) (layers F.Cu F.Paste F.Mask))
  (pad 3 smd rect (at -4.825 -1.65) (size 0.5 1.25) (layers F.Cu F.Paste F.Mask))
  (pad 1 smd rect (at -4.025 -1.65) (size 0.5 1.25) (layers F.Cu F.Paste F.Mask))
  (model ${KIPRJMOD}/mod/Samtec.pretty/mod_3D/ERF8-013-01-L-D-RA-TR.stp
    (offset (xyz -8.800000000000001 5.35 3.2))
    (scale (xyz 1 1 1))
    (rotate (xyz -90 0 180))
  )
)
