(module SOD-923 (layer F.Cu) (tedit 5C2E2C6B)
  (fp_text reference REF** (at 0 1.2) (layer F.SilkS)
    (effects (font (size 1 1) (thickness 0.15)))
  )
  (fp_text value SOD-923 (at 0 -0.5) (layer F.Fab)
    (effects (font (size 1 1) (thickness 0.15)))
  )
  (fp_line (start -0.3 -0.4) (end -0.8 -0.4) (layer F.SilkS) (width 0.15))
  (fp_line (start -0.8 -0.4) (end -0.8 0.4) (layer F.SilkS) (width 0.15))
  (fp_line (start -0.8 0.4) (end -0.3 0.4) (layer F.SilkS) (width 0.15))
  (pad 2 smd rect (at -0.48 0) (size 0.48 0.4) (layers F.Cu F.Paste F.Mask))
  (pad 1 smd rect (at 0.48 0) (size 0.48 0.4) (layers F.Cu F.Paste F.Mask))
)
