(module QFN65P400X400X100-17N (layer F.Cu) (tedit 5E90B15A)
  (fp_text reference REF** (at 0.42567 -3.5176) (layer F.SilkS)
    (effects (font (size 1.001591 1.001591) (thickness 0.015)))
  )
  (fp_text value QFN65P400X400X100-17N (at 10.59499 3.52334) (layer F.Fab)
    (effects (font (size 1.000945 1.000945) (thickness 0.015)))
  )
  (fp_line (start -2 -2) (end -2 2) (layer F.Fab) (width 0.2032))
  (fp_line (start -2 2) (end 2 2) (layer F.Fab) (width 0.2032))
  (fp_line (start 2 2) (end 2 -2) (layer F.Fab) (width 0.2032))
  (fp_line (start 2 -2) (end -2 -2) (layer F.Fab) (width 0.2032))
  (fp_line (start -2 -2) (end -1.4 -2) (layer F.SilkS) (width 0.2032))
  (fp_line (start -2 -2) (end -2 -1.4) (layer F.SilkS) (width 0.2032))
  (fp_line (start -2 2) (end -2 1.4) (layer F.SilkS) (width 0.2032))
  (fp_line (start -2 2) (end -1.4 2) (layer F.SilkS) (width 0.2032))
  (fp_line (start 2 2) (end 1.4 2) (layer F.SilkS) (width 0.2032))
  (fp_line (start 2 2) (end 2 1.4) (layer F.SilkS) (width 0.2032))
  (fp_line (start 2 -2) (end 2 -1.4) (layer F.SilkS) (width 0.2032))
  (fp_line (start 2 -2) (end 1.4 -2) (layer F.SilkS) (width 0.2032))
  (fp_line (start -2.75 -2.75) (end 2.75 -2.75) (layer F.CrtYd) (width 0.05))
  (fp_line (start 2.75 -2.75) (end 2.75 2.75) (layer F.CrtYd) (width 0.05))
  (fp_line (start 2.75 2.75) (end -2.75 2.75) (layer F.CrtYd) (width 0.05))
  (fp_line (start -2.75 2.75) (end -2.75 -2.75) (layer F.CrtYd) (width 0.05))
  (fp_circle (center -2.45 -1.85) (end -2.25 -1.85) (layer F.SilkS) (width 0.1))
  (fp_poly (pts (xy -0.695799 -0.695) (xy 0.695 -0.695) (xy 0.695 0.695799) (xy -0.695799 0.695799)) (layer F.Paste) (width 0.01))
  (pad 1 smd rect (at -1.85 -0.975) (size 1.05 0.35) (layers F.Cu F.Paste F.Mask))
  (pad 2 smd rect (at -1.85 -0.325) (size 1.05 0.35) (layers F.Cu F.Paste F.Mask))
  (pad 3 smd rect (at -1.85 0.325) (size 1.05 0.35) (layers F.Cu F.Paste F.Mask))
  (pad 4 smd rect (at -1.85 0.975) (size 1.05 0.35) (layers F.Cu F.Paste F.Mask))
  (pad 5 smd rect (at -0.975 1.85) (size 0.35 1.05) (layers F.Cu F.Paste F.Mask))
  (pad 6 smd rect (at -0.325 1.85) (size 0.35 1.05) (layers F.Cu F.Paste F.Mask))
  (pad 7 smd rect (at 0.325 1.85) (size 0.35 1.05) (layers F.Cu F.Paste F.Mask))
  (pad 8 smd rect (at 0.975 1.85) (size 0.35 1.05) (layers F.Cu F.Paste F.Mask))
  (pad 9 smd rect (at 1.85 0.975) (size 1.05 0.35) (layers F.Cu F.Paste F.Mask))
  (pad 10 smd rect (at 1.85 0.325) (size 1.05 0.35) (layers F.Cu F.Paste F.Mask))
  (pad 11 smd rect (at 1.85 -0.325) (size 1.05 0.35) (layers F.Cu F.Paste F.Mask))
  (pad 12 smd rect (at 1.85 -0.975) (size 1.05 0.35) (layers F.Cu F.Paste F.Mask))
  (pad 13 smd rect (at 0.975 -1.85) (size 0.35 1.05) (layers F.Cu F.Paste F.Mask))
  (pad 14 smd rect (at 0.325 -1.85) (size 0.35 1.05) (layers F.Cu F.Paste F.Mask))
  (pad 15 smd rect (at -0.325 -1.85) (size 0.35 1.05) (layers F.Cu F.Paste F.Mask))
  (pad 16 smd rect (at -0.975 -1.85) (size 0.35 1.05) (layers F.Cu F.Paste F.Mask))
  (pad PAD smd rect (at 0 0) (size 2.2 2.2) (layers F.Cu F.Mask))
)
