(module CL-SB-12C-01 (layer F.Cu) (tedit 5C5215D7)
  (fp_text reference REF** (at 1.1 4.4) (layer F.SilkS)
    (effects (font (size 1 1) (thickness 0.15)))
  )
  (fp_text value CL-SB-12C-01 (at 0 -0.5) (layer F.Fab)
    (effects (font (size 1 1) (thickness 0.15)))
  )
  (fp_line (start 1.75 3.3) (end 1.75 0) (layer F.SilkS) (width 0.15))
  (fp_line (start -1.6 3.3) (end 1.75 3.3) (layer F.SilkS) (width 0.15))
  (fp_line (start -6.75 3.3) (end -3.4 3.3) (layer F.SilkS) (width 0.15))
  (fp_line (start -6.75 3.3) (end -6.75 0) (layer F.SilkS) (width 0.15))
  (fp_line (start -4.1 0) (end -0.9 0) (layer F.SilkS) (width 0.15))
  (fp_line (start -6.75 0) (end -5.9 0) (layer F.SilkS) (width 0.15))
  (fp_line (start 1.75 0) (end 0.9 0) (layer F.SilkS) (width 0.15))
  (pad 1 thru_hole circle (at 0 0) (size 1.6 1.6) (drill 0.8) (layers *.Cu *.Mask))
  (pad 3 thru_hole circle (at -5 0) (size 1.6 1.6) (drill 0.8) (layers *.Cu *.Mask))
  (pad 2 thru_hole circle (at -2.5 3.3) (size 1.6 1.6) (drill 0.8) (layers *.Cu *.Mask))
  (model ${KIPRJMOD}/mod/Switches.pretty/mod_3D/CL-SB-12C-01.stp
    (offset (xyz -2.5 -1.65 2))
    (scale (xyz 1 1 1))
    (rotate (xyz -90 0 180))
  )
)
