G04 #@! TF.GenerationSoftware,KiCad,Pcbnew,7.0.8*
G04 #@! TF.CreationDate,2024-03-01T18:25:39-05:00*
G04 #@! TF.ProjectId,carrier,63617272-6965-4722-9e6b-696361645f70,rev?*
G04 #@! TF.SameCoordinates,PX795bdf0PY16b59940*
G04 #@! TF.FileFunction,Copper,L12,Inr*
G04 #@! TF.FilePolarity,Positive*
%FSLAX46Y46*%
G04 Gerber Fmt 4.6, Leading zero omitted, Abs format (unit mm)*
G04 Created by KiCad (PCBNEW 7.0.8) date 2024-03-01 18:25:39*
%MOMM*%
%LPD*%
G01*
G04 APERTURE LIST*
%ADD10C,0.300000*%
G04 #@! TA.AperFunction,NonConductor*
%ADD11C,0.300000*%
G04 #@! TD*
G04 #@! TA.AperFunction,ComponentPad*
%ADD12C,2.000000*%
G04 #@! TD*
G04 #@! TA.AperFunction,ComponentPad*
%ADD13R,1.700000X1.700000*%
G04 #@! TD*
G04 #@! TA.AperFunction,ComponentPad*
%ADD14C,2.108200*%
G04 #@! TD*
G04 #@! TA.AperFunction,ComponentPad*
%ADD15O,1.700000X1.700000*%
G04 #@! TD*
G04 #@! TA.AperFunction,WasherPad*
%ADD16C,2.000000*%
G04 #@! TD*
G04 #@! TA.AperFunction,WasherPad*
%ADD17C,2.900000*%
G04 #@! TD*
G04 #@! TA.AperFunction,ComponentPad*
%ADD18C,1.700000*%
G04 #@! TD*
G04 #@! TA.AperFunction,ViaPad*
%ADD19C,1.000000*%
G04 #@! TD*
G04 #@! TA.AperFunction,ViaPad*
%ADD20C,0.508000*%
G04 #@! TD*
G04 #@! TA.AperFunction,Conductor*
%ADD21C,0.254000*%
G04 #@! TD*
G04 #@! TA.AperFunction,Conductor*
%ADD22C,0.228600*%
G04 #@! TD*
G04 #@! TA.AperFunction,Profile*
%ADD23C,0.152400*%
G04 #@! TD*
G04 APERTURE END LIST*
D10*
D11*
X70253142Y3107386D02*
X70467428Y3035958D01*
X70467428Y3035958D02*
X70538857Y2964529D01*
X70538857Y2964529D02*
X70610285Y2821672D01*
X70610285Y2821672D02*
X70610285Y2607386D01*
X70610285Y2607386D02*
X70538857Y2464529D01*
X70538857Y2464529D02*
X70467428Y2393100D01*
X70467428Y2393100D02*
X70324571Y2321672D01*
X70324571Y2321672D02*
X69753142Y2321672D01*
X69753142Y2321672D02*
X69753142Y3821672D01*
X69753142Y3821672D02*
X70253142Y3821672D01*
X70253142Y3821672D02*
X70396000Y3750243D01*
X70396000Y3750243D02*
X70467428Y3678815D01*
X70467428Y3678815D02*
X70538857Y3535958D01*
X70538857Y3535958D02*
X70538857Y3393100D01*
X70538857Y3393100D02*
X70467428Y3250243D01*
X70467428Y3250243D02*
X70396000Y3178815D01*
X70396000Y3178815D02*
X70253142Y3107386D01*
X70253142Y3107386D02*
X69753142Y3107386D01*
D12*
X191500000Y230185000D03*
X196580000Y230185000D03*
X196580000Y232725000D03*
X196580000Y240345000D03*
X196580000Y242885000D03*
D13*
X157480000Y4572000D03*
X165100000Y4572000D03*
D14*
X225298000Y55880000D03*
D15*
X9398000Y302514000D03*
X11938000Y299974000D03*
X255778000Y181102000D03*
X27178000Y310134000D03*
X32258000Y310134000D03*
X19558000Y307594000D03*
D13*
X175260000Y4572000D03*
D16*
X264130000Y3050000D03*
D17*
X264130000Y10450000D03*
X251660000Y39000000D03*
D16*
X264130000Y40950000D03*
D18*
X245060000Y37650000D03*
X255560000Y37650000D03*
X258260000Y37650000D03*
D19*
X265938000Y118475003D03*
X220730184Y173857671D03*
X220726000Y174752000D03*
X265938000Y119380000D03*
X200152000Y298450000D03*
D20*
X119634000Y300228000D03*
X122682000Y299212000D03*
D19*
X184988200Y294902000D03*
D20*
X241554000Y508000D03*
X177546000Y13716000D03*
X124968000Y9652000D03*
X230378000Y266192000D03*
X207010000Y267208000D03*
X260858000Y508000D03*
X275082000Y37084000D03*
X273050000Y216916000D03*
X245618000Y216916000D03*
X275082000Y40132000D03*
X274066000Y215900000D03*
X253746000Y216916000D03*
X275082000Y35052000D03*
X253746000Y215900000D03*
X268986000Y214884000D03*
X249682000Y214884000D03*
X262890000Y214884000D03*
X220218000Y202692000D03*
X238493299Y201676000D03*
X233426000Y208788000D03*
X253746000Y208788000D03*
X227330000Y199644000D03*
X259842000Y199644000D03*
X249682000Y180340000D03*
X263906000Y180340000D03*
X254762000Y204724000D03*
X222250000Y205740000D03*
X237490000Y257556000D03*
X225298000Y257556000D03*
X238493299Y196596000D03*
X255778000Y195580000D03*
X252730000Y194564000D03*
X257810000Y193548000D03*
X249682000Y161036000D03*
X241554000Y161036000D03*
X253746000Y207772000D03*
X178562000Y9652000D03*
X245618000Y206756000D03*
X179578000Y50292000D03*
X5334000Y9144000D03*
X234188000Y50292000D03*
X234442000Y190500000D03*
X245618000Y190500000D03*
X245618000Y191516000D03*
X272034000Y191516000D03*
X242570000Y198628000D03*
X225298000Y200660000D03*
X249682000Y208788000D03*
X238493299Y209804000D03*
X249682000Y194564000D03*
X272034000Y195580000D03*
X245618000Y197612000D03*
X258826000Y196596000D03*
X260858000Y198628000D03*
X245618000Y199644000D03*
X249682000Y160020000D03*
X259842000Y159004000D03*
X259842000Y201676000D03*
X249682000Y202692000D03*
X239522000Y50292000D03*
X178562000Y49276000D03*
X243446000Y207772500D03*
X230426000Y206768000D03*
X205994000Y210820000D03*
X226314000Y208788000D03*
X237490000Y282956000D03*
X205994000Y209804000D03*
X204978000Y282956000D03*
X225298000Y208788000D03*
X205994000Y243332000D03*
X230378000Y295148000D03*
X195072000Y296164000D03*
X212090000Y182372000D03*
X212090000Y240284000D03*
X257810000Y183388000D03*
X262890000Y287020000D03*
X204978000Y287020000D03*
X241554000Y269748000D03*
X190754000Y269748000D03*
X234442000Y231140000D03*
X232410000Y229108000D03*
X232410000Y224028000D03*
X240030000Y220978000D03*
X203962000Y220980000D03*
X186182000Y283972000D03*
X199745600Y283616400D03*
X242570000Y98044000D03*
X204978000Y99060000D03*
X197205600Y283616400D03*
X207010000Y300228000D03*
X232410000Y207772000D03*
X188722000Y301244000D03*
X190754000Y207772000D03*
X231394500Y207810049D03*
X188722000Y211836000D03*
X253746000Y287020000D03*
X230378000Y286209971D03*
X240538000Y311404000D03*
X253746000Y205740000D03*
X234442000Y206756000D03*
X229362000Y196596000D03*
X253746000Y192532000D03*
X258826000Y201676000D03*
X238493299Y200660000D03*
X228346000Y290068000D03*
X238506000Y289052000D03*
X228346000Y292100000D03*
X238506000Y291084000D03*
X241554000Y277876000D03*
X251714000Y278892000D03*
X236474000Y129540000D03*
X239522000Y128524000D03*
X180638329Y293115999D03*
X263906000Y278892000D03*
X200914000Y279907610D03*
X197104000Y287274000D03*
X226441003Y280924000D03*
X236474000Y280924000D03*
X249682000Y210820000D03*
X241554000Y211836000D03*
X229362000Y212852000D03*
X245618000Y211836000D03*
X209042000Y212852000D03*
X220218000Y211836000D03*
X257556000Y287020000D03*
X282194000Y287020000D03*
X228346000Y131572000D03*
X254762000Y132588000D03*
X242570000Y157988000D03*
X242570000Y151384000D03*
X215138000Y309372000D03*
X256794000Y147828000D03*
X239522000Y311403990D03*
X242570000Y146812000D03*
X223266000Y292100000D03*
X238506000Y293116000D03*
X233426000Y260604000D03*
X249682000Y261620000D03*
X240030000Y187452000D03*
X181610000Y185420000D03*
X218186000Y268732000D03*
X225298000Y267716000D03*
X211074000Y278892000D03*
X234442000Y277876000D03*
X256794000Y282956000D03*
X241554000Y282956000D03*
X252730000Y221996000D03*
X230378000Y220980000D03*
X251714000Y221996000D03*
X230378000Y221996000D03*
X237490000Y258572000D03*
X230378000Y228092000D03*
X246634000Y258572000D03*
X237490000Y228092000D03*
X284480000Y277876000D03*
X256794000Y278892000D03*
X234442000Y131572000D03*
X255778000Y132588000D03*
X217170000Y260604000D03*
X236474000Y260604000D03*
X233426000Y196088000D03*
X235458000Y196596000D03*
X228346000Y236220000D03*
X265938000Y233172000D03*
X233426000Y235204000D03*
X265938000Y234188000D03*
X232410000Y233172000D03*
X266954000Y232156000D03*
X234442000Y247396000D03*
X236474000Y241808000D03*
X224282000Y215900000D03*
X241554000Y215900000D03*
X217170000Y238760000D03*
X241046000Y239014000D03*
X241847295Y236712260D03*
X225298000Y236220000D03*
X249682000Y197612000D03*
X258826000Y198628000D03*
X221234000Y202692000D03*
X238493299Y202692000D03*
X276098000Y288036000D03*
X226314000Y288036000D03*
X272034000Y186436000D03*
X267970000Y290068000D03*
X226314000Y291084000D03*
X253746000Y184404000D03*
X258826000Y212852000D03*
X249682000Y213868000D03*
X242570000Y6604000D03*
X191770000Y279907610D03*
X250698000Y280924000D03*
X261874000Y111252000D03*
X252730000Y169164000D03*
X252730000Y110744000D03*
X254762000Y110236000D03*
X235458000Y169164000D03*
X207010000Y175260000D03*
X230378000Y176276000D03*
X229362000Y310388000D03*
X164338000Y308864000D03*
X228346000Y239014000D03*
X248920000Y239014000D03*
X249657715Y239008479D03*
X227330000Y240538000D03*
X168402000Y304292000D03*
X229362000Y305308000D03*
X168402000Y311022979D03*
X227330000Y311404000D03*
X230378000Y241808000D03*
X219202000Y312420000D03*
X219202000Y242316000D03*
X228346000Y242062000D03*
X220218000Y241300000D03*
X218186000Y312420000D03*
X214122000Y242316000D03*
X226314000Y244348000D03*
X203506000Y206418000D03*
X225298500Y206756500D03*
X254127000Y100457000D03*
X242570000Y99822000D03*
X231394000Y162052000D03*
X249682000Y162052000D03*
X225298000Y306324000D03*
X157226000Y305308000D03*
X219202000Y218948000D03*
X225298000Y219964000D03*
X199898000Y258572000D03*
X243586000Y251460000D03*
X260530050Y251642456D03*
X243586000Y258572000D03*
X245618000Y292100000D03*
X241554000Y293116000D03*
X242570000Y218948000D03*
X221234000Y216916000D03*
X242570000Y216916000D03*
X224282000Y216916000D03*
X251714000Y53340000D03*
X257810000Y275844000D03*
X249682000Y274828000D03*
X222250000Y261620000D03*
X256794000Y261723416D03*
X254762000Y246799604D03*
X236474000Y244728997D03*
X243586000Y262636000D03*
X253746000Y263795510D03*
X238506000Y281940000D03*
X246634000Y281940000D03*
X236474000Y281940000D03*
X243586000Y281940000D03*
X230471500Y267715500D03*
X242570000Y269748000D03*
D21*
X240802000Y222718000D02*
X241016000Y222504000D01*
X251206000Y222504000D02*
X251714000Y221996000D01*
X239040000Y222718000D02*
X240802000Y222718000D01*
X238826000Y222504000D02*
X239040000Y222718000D01*
X230886000Y222504000D02*
X238826000Y222504000D01*
X230378000Y221996000D02*
X230886000Y222504000D01*
X241016000Y222504000D02*
X251206000Y222504000D01*
X119634000Y300228000D02*
X120142000Y299720000D01*
X166751000Y296418000D02*
X169688001Y296418000D01*
X126508001Y296655999D02*
X166513001Y296655999D01*
X199644000Y297942000D02*
X200152000Y298450000D01*
X123444000Y299720000D02*
X126508001Y296655999D01*
X169926000Y296655999D02*
X173211999Y296655999D01*
X199644000Y296672000D02*
X199644000Y297942000D01*
X120142000Y299720000D02*
X123444000Y299720000D01*
X173211999Y296655999D02*
X173228000Y296672000D01*
X173228000Y296672000D02*
X199644000Y296672000D01*
X169688001Y296418000D02*
X169926000Y296655999D01*
X166513001Y296655999D02*
X166751000Y296418000D01*
X183888000Y294902000D02*
X183134000Y295656000D01*
X122682000Y298450000D02*
X125476000Y295656000D01*
X127508000Y295656000D02*
X125476000Y295656000D01*
X184988200Y294902000D02*
X183888000Y294902000D01*
X122682000Y299212000D02*
X122682000Y298450000D01*
X183134000Y295656000D02*
X127508000Y295656000D01*
X167386000Y0D02*
X241046000Y0D01*
X166878000Y3898000D02*
X166878000Y508000D01*
X165100000Y4572000D02*
X166204000Y4572000D01*
X241046000Y0D02*
X241554000Y508000D01*
X166204000Y4572000D02*
X166878000Y3898000D01*
X166878000Y508000D02*
X167386000Y0D01*
X169926000Y10160000D02*
X129285999Y10160000D01*
X177038000Y14224000D02*
X177546000Y13716000D01*
X125476000Y10160000D02*
X124968000Y9652000D01*
X129285999Y10160000D02*
X125476000Y10160000D01*
X170942000Y11176000D02*
X169926000Y10160000D01*
X170942000Y11176000D02*
X173990000Y14224000D01*
X173990000Y14224000D02*
X177038000Y14224000D01*
X218440000Y266700000D02*
X207518000Y266700000D01*
X219445841Y267208001D02*
X218948001Y267208001D01*
X230378000Y266192000D02*
X229870000Y266700000D01*
X207518000Y266700000D02*
X207010000Y267208000D01*
X229870000Y266700000D02*
X219953842Y266700000D01*
X218948001Y267208001D02*
X218440000Y266700000D01*
X219953842Y266700000D02*
X219445841Y267208001D01*
X158584000Y4572000D02*
X157480000Y4572000D01*
X259334000Y-1016000D02*
X161036000Y-1016000D01*
X159004000Y1016000D02*
X159004000Y4152000D01*
X260858000Y508000D02*
X259334000Y-1016000D01*
X159004000Y4152000D02*
X158584000Y4572000D01*
X161036000Y-1016000D02*
X159004000Y1016000D01*
X274574000Y37592000D02*
X275082000Y37084000D01*
X272542000Y217424000D02*
X246126000Y217424000D01*
X258260000Y37650000D02*
X259784000Y37650000D01*
X273050000Y37592000D02*
X274574000Y37592000D01*
X259842000Y37592000D02*
X273050000Y37592000D01*
X246126000Y217424000D02*
X245618000Y216916000D01*
X259784000Y37650000D02*
X259842000Y37592000D01*
X273050000Y216916000D02*
X272542000Y217424000D01*
X258826000Y39116000D02*
X259334000Y39624000D01*
X273558000Y216408000D02*
X274066000Y215900000D01*
X273050000Y216408000D02*
X273558000Y216408000D01*
X255560000Y37650000D02*
X257026000Y39116000D01*
X253746000Y216916000D02*
X254254000Y216408000D01*
X273558000Y39624000D02*
X274574000Y39624000D01*
X259334000Y39624000D02*
X271526000Y39624000D01*
X274574000Y39624000D02*
X275082000Y40132000D01*
X257026000Y39116000D02*
X258826000Y39116000D01*
X271526000Y39624000D02*
X273558000Y39624000D01*
X254254000Y216408000D02*
X273050000Y216408000D01*
X274574000Y35560000D02*
X260096000Y35560000D01*
X259110001Y36545999D02*
X246164001Y36545999D01*
X268478000Y215392000D02*
X268986000Y214884000D01*
X254254000Y215392000D02*
X268478000Y215392000D01*
X253746000Y215900000D02*
X254254000Y215392000D01*
X260096000Y35560000D02*
X259110001Y36545999D01*
X246164001Y36545999D02*
X245909999Y36800001D01*
X245909999Y36800001D02*
X245060000Y37650000D01*
X275082000Y35052000D02*
X274574000Y35560000D01*
X262636000Y214630000D02*
X262890000Y214884000D01*
X262890000Y214884000D02*
X262382000Y214376000D01*
X262382000Y214376000D02*
X262128000Y214376000D01*
X249682000Y214884000D02*
X250190000Y214376000D01*
X250190000Y214376000D02*
X262128000Y214376000D01*
X220726000Y202184000D02*
X220218000Y202692000D01*
X237985299Y201168000D02*
X221742000Y201168000D01*
X238493299Y201676000D02*
X237985299Y201168000D01*
X221742000Y201168000D02*
X220726000Y202184000D01*
X233934000Y208280000D02*
X240835579Y208280000D01*
X233426000Y208788000D02*
X233934000Y208280000D01*
X242359579Y208280000D02*
X252984000Y208280000D01*
X241343579Y207772000D02*
X241851579Y207772000D01*
X240835579Y208280000D02*
X241343579Y207772000D01*
X252984000Y208280000D02*
X253238000Y208280000D01*
X253238000Y208280000D02*
X253746000Y208788000D01*
X241851579Y207772000D02*
X242359579Y208280000D01*
X227838000Y200152000D02*
X227330000Y199644000D01*
X228854000Y200152000D02*
X227838000Y200152000D01*
X251460000Y200152000D02*
X259334000Y200152000D01*
X259334000Y200152000D02*
X259842000Y199644000D01*
X228854000Y200152000D02*
X251460000Y200152000D01*
X249682000Y180340000D02*
X250190000Y179832000D01*
X255778000Y179832000D02*
X255778000Y181102000D01*
X255778000Y179832000D02*
X263398000Y179832000D01*
X263906000Y180340000D02*
X263398000Y179832000D01*
X250190000Y179832000D02*
X255778000Y179832000D01*
X222250000Y205740000D02*
X222758000Y205232000D01*
X222758000Y205232000D02*
X252984000Y205232000D01*
X252984000Y205232000D02*
X254254000Y205232000D01*
X254254000Y205232000D02*
X254762000Y204724000D01*
X237490000Y257556000D02*
X236982000Y258064000D01*
X255270000Y196088000D02*
X255778000Y195580000D01*
X238493299Y196596000D02*
X239001299Y196088000D01*
X225806000Y258064000D02*
X225298000Y257556000D01*
X239001299Y196088000D02*
X254762000Y196088000D01*
X236982000Y258064000D02*
X225806000Y258064000D01*
X254762000Y196088000D02*
X255270000Y196088000D01*
X252730000Y194564000D02*
X253238000Y194056000D01*
X253238000Y194056000D02*
X253242001Y194060001D01*
X253242001Y194060001D02*
X257297999Y194060001D01*
X257297999Y194060001D02*
X257810000Y193548000D01*
X242062000Y160528000D02*
X249174000Y160528000D01*
X249174000Y160528000D02*
X249682000Y161036000D01*
X241554000Y161036000D02*
X242062000Y160528000D01*
D22*
X179578000Y50292000D02*
X180069300Y50783300D01*
D21*
X178054000Y9144000D02*
X5334000Y9144000D01*
D22*
X192380594Y50292000D02*
X196952594Y54864000D01*
D21*
X234188000Y50292000D02*
X233680000Y50800000D01*
D22*
X180069300Y50783300D02*
X181813504Y50783300D01*
X182304804Y50292000D02*
X192380594Y50292000D01*
X181813504Y50783300D02*
X182304804Y50292000D01*
X196952594Y54864000D02*
X211260804Y54864000D01*
X211260804Y54864000D02*
X215578804Y50546000D01*
D21*
X246126000Y207264000D02*
X253238000Y207264000D01*
X178562000Y9652000D02*
X178054000Y9144000D01*
X245618000Y206756000D02*
X246126000Y207264000D01*
D22*
X215578804Y50546000D02*
X233426000Y50546000D01*
X233426000Y50546000D02*
X233680000Y50800000D01*
D21*
X253746000Y207772000D02*
X253238000Y207264000D01*
X245110000Y191008000D02*
X245618000Y190500000D01*
X244602000Y191008000D02*
X245110000Y191008000D01*
X234442000Y190500000D02*
X234950000Y191008000D01*
X234950000Y191008000D02*
X244602000Y191008000D01*
X246126000Y191008000D02*
X271526000Y191008000D01*
X271526000Y191008000D02*
X272034000Y191516000D01*
X245618000Y191516000D02*
X246126000Y191008000D01*
X226314000Y199136000D02*
X225298000Y200152000D01*
X225298000Y200152000D02*
X225298000Y200660000D01*
X226314000Y199136000D02*
X242062000Y199136000D01*
X242062000Y199136000D02*
X242570000Y198628000D01*
X239001299Y209296000D02*
X248920000Y209296000D01*
X249174000Y209296000D02*
X249682000Y208788000D01*
X248920000Y209296000D02*
X249174000Y209296000D01*
X238493299Y209804000D02*
X239001299Y209296000D01*
X249682000Y194564000D02*
X250190000Y195072000D01*
X250190000Y195072000D02*
X270510000Y195072000D01*
X271526000Y195072000D02*
X272034000Y195580000D01*
X270510000Y195072000D02*
X271526000Y195072000D01*
X246126000Y197104000D02*
X257302000Y197104000D01*
X257302000Y197104000D02*
X258318000Y197104000D01*
X258318000Y197104000D02*
X258826000Y196596000D01*
X245618000Y197612000D02*
X246126000Y197104000D01*
X246126000Y199136000D02*
X259842000Y199136000D01*
X245618000Y199644000D02*
X246126000Y199136000D01*
X260350000Y199136000D02*
X260858000Y198628000D01*
X259842000Y199136000D02*
X260350000Y199136000D01*
X258572000Y159512000D02*
X259334000Y159512000D01*
X250190000Y159512000D02*
X258572000Y159512000D01*
X259334000Y159512000D02*
X259842000Y159004000D01*
X249682000Y160020000D02*
X250190000Y159512000D01*
X259334000Y202184000D02*
X259842000Y201676000D01*
X250190000Y202184000D02*
X258064000Y202184000D01*
X249682000Y202692000D02*
X250190000Y202184000D01*
X258064000Y202184000D02*
X259334000Y202184000D01*
D22*
X179070000Y49784000D02*
X178562000Y49276000D01*
D21*
X239014000Y49784000D02*
X239522000Y50292000D01*
D22*
X239014000Y49784000D02*
X238506000Y49784000D01*
X238506000Y49784000D02*
X181102000Y49784000D01*
X181102000Y49784000D02*
X179070000Y49784000D01*
D21*
X243446000Y207772500D02*
X242937500Y207264000D01*
X242937500Y207264000D02*
X232452000Y207264000D01*
X231956000Y206768000D02*
X230426000Y206768000D01*
X232452000Y207264000D02*
X231956000Y206768000D01*
X226314000Y208788000D02*
X226314000Y210058000D01*
X213106000Y210312000D02*
X206502000Y210312000D01*
X215646000Y210312000D02*
X215611000Y210277000D01*
X226060000Y210312000D02*
X215646000Y210312000D01*
X215611000Y210277000D02*
X213141000Y210277000D01*
X226314000Y210058000D02*
X226060000Y210312000D01*
X206502000Y210312000D02*
X205994000Y210820000D01*
X213141000Y210277000D02*
X213106000Y210312000D01*
X223281922Y283479922D02*
X223266000Y283464000D01*
X231648000Y283464000D02*
X231140000Y282956000D01*
X236982000Y283464000D02*
X231648000Y283464000D01*
X206502000Y209296000D02*
X205994000Y209804000D01*
X225298000Y208788000D02*
X224790000Y209296000D01*
X225028078Y283479922D02*
X223281922Y283479922D01*
X225044000Y283464000D02*
X225028078Y283479922D01*
X231140000Y282956000D02*
X229616000Y282956000D01*
X205486000Y283464000D02*
X204978000Y282956000D01*
X229108000Y283464000D02*
X225044000Y283464000D01*
X229616000Y282956000D02*
X229108000Y283464000D01*
X223266000Y283464000D02*
X205486000Y283464000D01*
X224790000Y209296000D02*
X206502000Y209296000D01*
X237490000Y282956000D02*
X236982000Y283464000D01*
X197994213Y242885000D02*
X198055213Y242824000D01*
X196580000Y242885000D02*
X197994213Y242885000D01*
X205486000Y242824000D02*
X205994000Y243332000D01*
X198055213Y242824000D02*
X205486000Y242824000D01*
X210058000Y295656000D02*
X229870000Y295656000D01*
X201168000Y295656000D02*
X195834000Y295656000D01*
X195580000Y295656000D02*
X195072000Y296164000D01*
X195834000Y295656000D02*
X195580000Y295656000D01*
X210058000Y295656000D02*
X201168000Y295656000D01*
X229870000Y295656000D02*
X230378000Y295148000D01*
X199136000Y239776000D02*
X211582000Y239776000D01*
X212598000Y182880000D02*
X212090000Y182372000D01*
X199136000Y239776000D02*
X198567000Y240345000D01*
X257302000Y182880000D02*
X228600000Y182880000D01*
X211582000Y239776000D02*
X212090000Y240284000D01*
X198567000Y240345000D02*
X196580000Y240345000D01*
X217534492Y182880000D02*
X212598000Y182880000D01*
X228600000Y182880000D02*
X217534492Y182880000D01*
X257810000Y183388000D02*
X257302000Y182880000D01*
X262382000Y287528000D02*
X231902000Y287528000D01*
X204978000Y287020000D02*
X205486000Y287528000D01*
X220980000Y287528000D02*
X205486000Y287528000D01*
X231902000Y287528000D02*
X220980000Y287528000D01*
X262890000Y287020000D02*
X262382000Y287528000D01*
X241046000Y269240000D02*
X191262000Y269240000D01*
X191262000Y269240000D02*
X190754000Y269748000D01*
X241554000Y269748000D02*
X241046000Y269240000D01*
X198120000Y230632000D02*
X198120000Y231185000D01*
X234442000Y231140000D02*
X233934000Y230632000D01*
X198120000Y231185000D02*
X196580000Y232725000D01*
X233934000Y230632000D02*
X198120000Y230632000D01*
X231902000Y228600000D02*
X198165000Y228600000D01*
X198165000Y228600000D02*
X196580000Y230185000D01*
X232410000Y229108000D02*
X231902000Y228600000D01*
X192786000Y225552000D02*
X192786000Y228899000D01*
X192786000Y228899000D02*
X191500000Y230185000D01*
X193802000Y224536000D02*
X192786000Y225552000D01*
X232410000Y224028000D02*
X231902000Y224536000D01*
X231902000Y224536000D02*
X193802000Y224536000D01*
X213301000Y220277000D02*
X213106000Y220472000D01*
X215197000Y220277000D02*
X213301000Y220277000D01*
X240030000Y220978000D02*
X239524000Y220472000D01*
X215392000Y220472000D02*
X215197000Y220277000D01*
X204470000Y220472000D02*
X203962000Y220980000D01*
X213106000Y220472000D02*
X204470000Y220472000D01*
X239524000Y220472000D02*
X215392000Y220472000D01*
X205740000Y98552000D02*
X205486000Y98552000D01*
X197205600Y283616400D02*
X196951601Y283362401D01*
X205486000Y98552000D02*
X204978000Y99060000D01*
X207518000Y98552000D02*
X205740000Y98552000D01*
X186182000Y283972000D02*
X186791599Y283362401D01*
X242570000Y98044000D02*
X242062000Y98552000D01*
X242062000Y98552000D02*
X207518000Y98552000D01*
X186791599Y283362401D02*
X186944000Y283362401D01*
X197205600Y283616400D02*
X199745600Y283616400D01*
X196951601Y283362401D02*
X186944000Y283362401D01*
X21844000Y298704000D02*
X23876000Y300736000D01*
X12954000Y298958000D02*
X13208000Y298704000D01*
X20320000Y298704000D02*
X21844000Y298704000D01*
X171196000Y300736000D02*
X206502000Y300736000D01*
X206502000Y300736000D02*
X207010000Y300228000D01*
X13208000Y298704000D02*
X20320000Y298704000D01*
X11938000Y299974000D02*
X12954000Y298958000D01*
X23876000Y300736000D02*
X171196000Y300736000D01*
X172974000Y301752000D02*
X176022000Y301752000D01*
X198318900Y206498000D02*
X196600000Y206498000D01*
X23114000Y301752000D02*
X172974000Y301752000D01*
X229870000Y207264000D02*
X199084900Y207264000D01*
X22606000Y301244000D02*
X23114000Y301752000D01*
X199084900Y207264000D02*
X198318900Y206498000D01*
X229910435Y207304435D02*
X229870000Y207264000D01*
X191262000Y207264000D02*
X190754000Y207772000D01*
X10668000Y301244000D02*
X13970000Y301244000D01*
X230547986Y207304435D02*
X229910435Y207304435D01*
X10247999Y301664001D02*
X10668000Y301244000D01*
X232410000Y207772000D02*
X231902000Y207264000D01*
X180086000Y301752000D02*
X188214000Y301752000D01*
X20320000Y301244000D02*
X22606000Y301244000D01*
X195834000Y207264000D02*
X191262000Y207264000D01*
X231902000Y207264000D02*
X230588421Y207264000D01*
X176022000Y301752000D02*
X180086000Y301752000D01*
X196600000Y206498000D02*
X195834000Y207264000D01*
X9398000Y302514000D02*
X10247999Y301664001D01*
X13970000Y301244000D02*
X20320000Y301244000D01*
X188214000Y301752000D02*
X188722000Y301244000D01*
X230588421Y207264000D02*
X230547986Y207304435D01*
X189230000Y211328000D02*
X188722000Y211836000D01*
X230924549Y208280000D02*
X231394500Y207810049D01*
X230378000Y208280000D02*
X230924549Y208280000D01*
X200914000Y208280000D02*
X198882000Y210312000D01*
X230378000Y208280000D02*
X200914000Y208280000D01*
X198882000Y210312000D02*
X197866000Y211328000D01*
X197866000Y211328000D02*
X189230000Y211328000D01*
X231902000Y286512000D02*
X231823024Y286590976D01*
X231823024Y286590976D02*
X230759005Y286590976D01*
X230759005Y286590976D02*
X230378000Y286209971D01*
X253238000Y286512000D02*
X253158075Y286591925D01*
X252301925Y286591925D02*
X252222000Y286512000D01*
X242813841Y285749999D02*
X242316001Y285749999D01*
X243575842Y286512000D02*
X242813841Y285749999D01*
X241554000Y286512000D02*
X231902000Y286512000D01*
X253746000Y287020000D02*
X253238000Y286512000D01*
X252222000Y286512000D02*
X243575842Y286512000D01*
X253158075Y286591925D02*
X252301925Y286591925D01*
X242316001Y285749999D02*
X241554000Y286512000D01*
X217170000Y314960000D02*
X239522022Y314960000D01*
X19558000Y307594000D02*
X26924000Y314960000D01*
X26924000Y314960000D02*
X217170000Y314960000D01*
X240538000Y311404000D02*
X240538000Y313944022D01*
X240538000Y313944022D02*
X239522022Y314960000D01*
X234442000Y206756000D02*
X234950000Y206248000D01*
X253238000Y206248000D02*
X253746000Y205740000D01*
X234950000Y206248000D02*
X253238000Y206248000D01*
X253238000Y193040000D02*
X253746000Y192532000D01*
X234685841Y192785999D02*
X234939842Y193040000D01*
X250698000Y193040000D02*
X253238000Y193040000D01*
X229362000Y196596000D02*
X230632000Y195326000D01*
X233172001Y192785999D02*
X234685841Y192785999D01*
X230632000Y195326000D02*
X233172001Y192785999D01*
X234939842Y193040000D02*
X250698000Y193040000D01*
X258826000Y201676000D02*
X258572000Y201422000D01*
X258318000Y201168000D02*
X241046000Y201168000D01*
X239001299Y201168000D02*
X238493299Y200660000D01*
X241046000Y201168000D02*
X239001299Y201168000D01*
X258572000Y201422000D02*
X258318000Y201168000D01*
X238506000Y289052000D02*
X237998000Y289560000D01*
X237998000Y289560000D02*
X228854000Y289560000D01*
X228854000Y289560000D02*
X228346000Y290068000D01*
X238506000Y291084000D02*
X237998000Y291592000D01*
X228854000Y291592000D02*
X228346000Y292100000D01*
X237998000Y291592000D02*
X228854000Y291592000D01*
X251714000Y278892000D02*
X251206000Y278384000D01*
X251206000Y278384000D02*
X242062000Y278384000D01*
X242062000Y278384000D02*
X241554000Y277876000D01*
X236474000Y129540000D02*
X236982000Y129032000D01*
X239014000Y129032000D02*
X236982000Y129032000D01*
X239522000Y128524000D02*
X239014000Y129032000D01*
X263398000Y279400000D02*
X201422000Y279400000D01*
X201168389Y279653611D02*
X201422000Y279400000D01*
X196088000Y288290000D02*
X185464328Y288290000D01*
X180638329Y293115999D02*
X185464328Y288290000D01*
X263398000Y279400000D02*
X263906000Y278892000D01*
X201167999Y279653611D02*
X201168389Y279653611D01*
X200914000Y279907610D02*
X201167999Y279653611D01*
X197104000Y287274000D02*
X196088000Y288290000D01*
X226441003Y280924000D02*
X226961450Y281444447D01*
X229725898Y281432000D02*
X229713451Y281444447D01*
X235966000Y281432000D02*
X229725898Y281432000D01*
X236474000Y280924000D02*
X235966000Y281432000D01*
X229713451Y281444447D02*
X227076000Y281444447D01*
X226961450Y281444447D02*
X227076000Y281444447D01*
X249682000Y210820000D02*
X249174000Y211328000D01*
X241554000Y211836000D02*
X242062000Y211328000D01*
X249174000Y211328000D02*
X242062000Y211328000D01*
X229870000Y212344000D02*
X245110000Y212344000D01*
X229362000Y212852000D02*
X229870000Y212344000D01*
X245618000Y211836000D02*
X245110000Y212344000D01*
X219710000Y212344000D02*
X209550000Y212344000D01*
X220218000Y211836000D02*
X219710000Y212344000D01*
X209550000Y212344000D02*
X209042000Y212852000D01*
X279654000Y286512000D02*
X281686000Y286512000D01*
X258064000Y286512000D02*
X279146000Y286512000D01*
X257556000Y287020000D02*
X258064000Y286512000D01*
X279146000Y286512000D02*
X279654000Y286512000D01*
X281686000Y286512000D02*
X282194000Y287020000D01*
X254762000Y132588000D02*
X254254000Y133096000D01*
X229870000Y133096000D02*
X230886000Y133096000D01*
X228346000Y131572000D02*
X229870000Y133096000D01*
X230886000Y133096000D02*
X254254000Y133096000D01*
X243332000Y152908000D02*
X242570000Y152146000D01*
X243332000Y157226000D02*
X243332000Y152908000D01*
X242570000Y157988000D02*
X243332000Y157226000D01*
X242570000Y152146000D02*
X242570000Y151384000D01*
X243078000Y147320000D02*
X242570000Y146812000D01*
X237998010Y309880000D02*
X239522000Y311403990D01*
X256286000Y147320000D02*
X245872000Y147320000D01*
X256794000Y147828000D02*
X256286000Y147320000D01*
X245872000Y147320000D02*
X243078000Y147320000D01*
X215646000Y309880000D02*
X237998010Y309880000D01*
X215138000Y309372000D02*
X215646000Y309880000D01*
X223774000Y292608000D02*
X237998000Y292608000D01*
X238506000Y293116000D02*
X237998000Y292608000D01*
X223266000Y292100000D02*
X223520000Y292354000D01*
X223520000Y292354000D02*
X223774000Y292608000D01*
X249174000Y261112000D02*
X249682000Y261620000D01*
X248412000Y261112000D02*
X233934000Y261112000D01*
X233934000Y261112000D02*
X233426000Y260604000D01*
X248412000Y261112000D02*
X249174000Y261112000D01*
X231637841Y187832999D02*
X229743001Y187832999D01*
X229743001Y187832999D02*
X229616000Y187960000D01*
X207026417Y187637799D02*
X206687799Y187637799D01*
X229616000Y187960000D02*
X221604845Y187960000D01*
X239522000Y187960000D02*
X231764842Y187960000D01*
X206687799Y187637799D02*
X204978000Y185928000D01*
X220853004Y187832996D02*
X219710000Y188976000D01*
X221604845Y187960000D02*
X221477841Y187832996D01*
X182118000Y185928000D02*
X181610000Y185420000D01*
X240030000Y187452000D02*
X239522000Y187960000D01*
X231764842Y187960000D02*
X231637841Y187832999D01*
X204978000Y185928000D02*
X184912000Y185928000D01*
X208872618Y189484000D02*
X207026417Y187637799D01*
X184912000Y185928000D02*
X182118000Y185928000D01*
X210312000Y189484000D02*
X208872618Y189484000D01*
X219710000Y188976000D02*
X210820000Y188976000D01*
X221477841Y187832996D02*
X220853004Y187832996D01*
X210820000Y188976000D02*
X210312000Y189484000D01*
X224790000Y268224000D02*
X218948000Y268224000D01*
X218694000Y268224000D02*
X218186000Y268732000D01*
X225298000Y267716000D02*
X224790000Y268224000D01*
X218948000Y268224000D02*
X218694000Y268224000D01*
X233934000Y278384000D02*
X224356564Y278384000D01*
X214376000Y278384000D02*
X213868000Y278384000D01*
X224283641Y278456923D02*
X220290923Y278456923D01*
X213868000Y278384000D02*
X213360000Y278892000D01*
X220218000Y278384000D02*
X214376000Y278384000D01*
X213360000Y278892000D02*
X211074000Y278892000D01*
X234442000Y277876000D02*
X233934000Y278384000D01*
X220290923Y278456923D02*
X220218000Y278384000D01*
X224356564Y278384000D02*
X224283641Y278456923D01*
X242570000Y283464000D02*
X242062000Y283464000D01*
X246126000Y283464000D02*
X242570000Y283464000D01*
X242062000Y283464000D02*
X241554000Y282956000D01*
X256286000Y283464000D02*
X247142000Y283464000D01*
X256794000Y282956000D02*
X256286000Y283464000D01*
X247142000Y283464000D02*
X246126000Y283464000D01*
X230886000Y221488000D02*
X251714000Y221488000D01*
X230378000Y220980000D02*
X230886000Y221488000D01*
X252222000Y221488000D02*
X252730000Y221996000D01*
X251714000Y221488000D02*
X252222000Y221488000D01*
X230378000Y228092000D02*
X230886000Y227584000D01*
X246126000Y258064000D02*
X246634000Y258572000D01*
X237998000Y258064000D02*
X246126000Y258064000D01*
X236969298Y227584000D02*
X236220000Y227584000D01*
X236220000Y227584000D02*
X236982000Y227584000D01*
X230886000Y227584000D02*
X236220000Y227584000D01*
X237477298Y228092000D02*
X236969298Y227584000D01*
X237490000Y258572000D02*
X237998000Y258064000D01*
X268742159Y277875999D02*
X271132841Y277875999D01*
X256794000Y278892000D02*
X257302000Y278384000D01*
X283972000Y278384000D02*
X284480000Y277876000D01*
X271640842Y278384000D02*
X283972000Y278384000D01*
X268234158Y278384000D02*
X268742159Y277875999D01*
X257302000Y278384000D02*
X268234158Y278384000D01*
X271132841Y277875999D02*
X271640842Y278384000D01*
X234950000Y132080000D02*
X234442000Y131572000D01*
X235712000Y132080000D02*
X234950000Y132080000D01*
X235712000Y132080000D02*
X255270000Y132080000D01*
X255778000Y132588000D02*
X255270000Y132080000D01*
X217678000Y260096000D02*
X217170000Y260604000D01*
X236474000Y260604000D02*
X235966000Y260096000D01*
X235966000Y260096000D02*
X217678000Y260096000D01*
X235204000Y196342000D02*
X233934000Y196342000D01*
X235458000Y196596000D02*
X235204000Y196342000D01*
X233934000Y196342000D02*
X233680000Y196342000D01*
X233680000Y196342000D02*
X233426000Y196088000D01*
X265430000Y233680000D02*
X265938000Y233172000D01*
X228346000Y236220000D02*
X230886000Y233680000D01*
X230886000Y233680000D02*
X265430000Y233680000D01*
X233426000Y235204000D02*
X233934000Y234696000D01*
X265430000Y234696000D02*
X265938000Y234188000D01*
X233934000Y234696000D02*
X265430000Y234696000D01*
X244602000Y232664000D02*
X266446000Y232664000D01*
X242326159Y231647999D02*
X242813841Y231647999D01*
X241310158Y232664000D02*
X242326159Y231647999D01*
X243559583Y232740201D02*
X244525799Y232740201D01*
X244525799Y232740201D02*
X244602000Y232664000D01*
X266446000Y232664000D02*
X266954000Y232156000D01*
X232410000Y233172000D02*
X232918000Y232664000D01*
X242813841Y231647999D02*
X243078000Y231912158D01*
X243078000Y232258618D02*
X243559583Y232740201D01*
X243078000Y231912158D02*
X243078000Y232258618D01*
X232918000Y232664000D02*
X241310158Y232664000D01*
X235458000Y246380000D02*
X235966000Y245872000D01*
X235458000Y246380000D02*
X234442000Y247396000D01*
X236474000Y241808000D02*
X235966000Y242316000D01*
X235966000Y242316000D02*
X235966000Y245872000D01*
X224790000Y215392000D02*
X241046000Y215392000D01*
X224282000Y215900000D02*
X224790000Y215392000D01*
X241046000Y215392000D02*
X241554000Y215900000D01*
X240538000Y238506000D02*
X217423999Y238506001D01*
X217423999Y238506001D02*
X217170000Y238760000D01*
X241046000Y239014000D02*
X240538000Y238506000D01*
X226314000Y237236000D02*
X241323555Y237236000D01*
X241323555Y237236000D02*
X241847295Y236712260D01*
X225298000Y236220000D02*
X226314000Y237236000D01*
X258318000Y198120000D02*
X250190000Y198120000D01*
X249935999Y197865999D02*
X249682000Y197612000D01*
X258826000Y198628000D02*
X258318000Y198120000D01*
X250190000Y198120000D02*
X249935999Y197865999D01*
X237998000Y202196701D02*
X237756701Y202196701D01*
X238493299Y202692000D02*
X237998000Y202196701D01*
X237744000Y202184000D02*
X221742000Y202184000D01*
X237756701Y202196701D02*
X237744000Y202184000D01*
X221729299Y202196701D02*
X221234000Y202692000D01*
X221742000Y202184000D02*
X221729299Y202196701D01*
X272034000Y288544000D02*
X272542000Y288544000D01*
X275590000Y288544000D02*
X276098000Y288036000D01*
X272542000Y288544000D02*
X275590000Y288544000D01*
X237998000Y288544000D02*
X272034000Y288544000D01*
X226314000Y288036000D02*
X226822000Y288544000D01*
X226822000Y288544000D02*
X237998000Y288544000D01*
X260096000Y289560000D02*
X252476000Y289560000D01*
X270510000Y184912000D02*
X272034000Y186436000D01*
X250318000Y289178000D02*
X248920000Y290576000D01*
X252476000Y289560000D02*
X252094000Y289178000D01*
X267970000Y290068000D02*
X267462000Y289560000D01*
X267462000Y289560000D02*
X261620000Y289560000D01*
X226314000Y291084000D02*
X226822000Y290576000D01*
X254254000Y184912000D02*
X269748000Y184912000D01*
X248412000Y290576000D02*
X248920000Y290576000D01*
X261620000Y289560000D02*
X261366000Y289306000D01*
X261366000Y289306000D02*
X260350000Y289306000D01*
X260350000Y289306000D02*
X260096000Y289560000D01*
X252094000Y289178000D02*
X250318000Y289178000D01*
X253746000Y184404000D02*
X254254000Y184912000D01*
X226822000Y290576000D02*
X248412000Y290576000D01*
X269748000Y184912000D02*
X270510000Y184912000D01*
X250190000Y213360000D02*
X258064000Y213360000D01*
X258064000Y213360000D02*
X258318000Y213360000D01*
X258318000Y213360000D02*
X258826000Y212852000D01*
X249682000Y213867999D02*
X249936000Y213614000D01*
X249936000Y213614000D02*
X250190000Y213360000D01*
X175260000Y4572000D02*
X175260001Y3467999D01*
X242570000Y6604000D02*
X242062000Y7112000D01*
X181102000Y3302000D02*
X183134000Y1270000D01*
X240538000Y7112000D02*
X216408000Y7112000D01*
X214376000Y7620000D02*
X213868000Y7112000D01*
X175260001Y3467999D02*
X175426000Y3302000D01*
X183134000Y1270000D02*
X188976000Y1270000D01*
X216408000Y7112000D02*
X215900000Y7620000D01*
X188976000Y1270000D02*
X194818000Y7112000D01*
X175426000Y3302000D02*
X181102000Y3302000D01*
X242062000Y7112000D02*
X240538000Y7112000D01*
X215900000Y7620000D02*
X214376000Y7620000D01*
X213868000Y7112000D02*
X194818000Y7112000D01*
X191770000Y279907610D02*
X192278000Y280415610D01*
X250190000Y280416000D02*
X250190000Y280415610D01*
X250698000Y280924000D02*
X250190000Y280416000D01*
X192278000Y280415610D02*
X250190000Y280415610D01*
X255270000Y110744000D02*
X260858000Y110744000D01*
X254762000Y110236000D02*
X254254000Y110744000D01*
X252730000Y169164000D02*
X252222000Y168656000D01*
X252222000Y168656000D02*
X235966000Y168656000D01*
X261366000Y110744000D02*
X261874000Y111252000D01*
X252730000Y110744000D02*
X254254000Y110744000D01*
X260858000Y110744000D02*
X261366000Y110744000D01*
X254762000Y110236000D02*
X255270000Y110744000D01*
X235966000Y168656000D02*
X235458000Y169164000D01*
X210312000Y175768000D02*
X207518000Y175768000D01*
X207518000Y175768000D02*
X207010000Y175260000D01*
X229870000Y175768000D02*
X210566000Y175768000D01*
X210566000Y175768000D02*
X210312000Y175768000D01*
X230378000Y176276000D02*
X229870000Y175768000D01*
X171058863Y310896000D02*
X228854000Y310896000D01*
X229108001Y310641999D02*
X229362000Y310388000D01*
X164338000Y308864000D02*
X169026863Y308864000D01*
X169026863Y308864000D02*
X171058863Y310896000D01*
X228854000Y310896000D02*
X229108001Y310641999D01*
X248920000Y239014000D02*
X248412000Y239522000D01*
X248412000Y239522000D02*
X242824000Y239522000D01*
X241554000Y239522000D02*
X228854000Y239522000D01*
X242824000Y239522000D02*
X241554000Y239522000D01*
X228854000Y239522000D02*
X228346000Y239014000D01*
X249657715Y239008479D02*
X249174000Y239492194D01*
X249174000Y239492194D02*
X249174000Y240410991D01*
X227710991Y240918991D02*
X227330000Y240538000D01*
X249174000Y240410991D02*
X248666000Y240918991D01*
X248666000Y240918991D02*
X227710991Y240918991D01*
X168402000Y304292000D02*
X168910000Y304800000D01*
X168910000Y304800000D02*
X227838000Y304800000D01*
X227838000Y304800000D02*
X228854000Y304800000D01*
X228854000Y304800000D02*
X229362000Y305308000D01*
X226822000Y311912000D02*
X169291021Y311912000D01*
X227330000Y311404000D02*
X226822000Y311912000D01*
X168655999Y311276978D02*
X168402000Y311022979D01*
X169291021Y311912000D02*
X168655999Y311276978D01*
X27178000Y313182000D02*
X27940000Y313944000D01*
X27940000Y313944000D02*
X214884000Y313944000D01*
X219710000Y242824000D02*
X220218010Y242824000D01*
X27178000Y310134000D02*
X27178000Y313182000D01*
X214884000Y313944000D02*
X217678000Y313944000D01*
X230378000Y241808000D02*
X229362000Y242824000D01*
X217678000Y313944000D02*
X219202000Y312420000D01*
X229362000Y242824000D02*
X220218010Y242824000D01*
X219202000Y242316000D02*
X219710000Y242824000D01*
X220218000Y241300000D02*
X223266000Y241300000D01*
X32258000Y312166000D02*
X33020000Y312928000D01*
X217678000Y312928000D02*
X218186000Y312420000D01*
X214884000Y312928000D02*
X217678000Y312928000D01*
X228346000Y242062000D02*
X227583999Y241299999D01*
X225044001Y241299999D02*
X224864078Y241479922D01*
X32258000Y310134000D02*
X32258000Y311336081D01*
X227583999Y241299999D02*
X225044001Y241299999D01*
X32258000Y311336081D02*
X32258000Y312166000D01*
X224864078Y241479922D02*
X223445922Y241479922D01*
X33020000Y312928000D02*
X214884000Y312928000D01*
X223445922Y241479922D02*
X223266000Y241300000D01*
X224282000Y243840000D02*
X217678000Y243840000D01*
X225680999Y243714999D02*
X224407001Y243714999D01*
X217678000Y243840000D02*
X216154000Y242316000D01*
X216154000Y242316000D02*
X214122000Y242316000D01*
X226314000Y244348000D02*
X225680999Y243714999D01*
X224407001Y243714999D02*
X224282000Y243840000D01*
X225298500Y206756500D02*
X224794000Y206252000D01*
X203672000Y206252000D02*
X203506000Y206418000D01*
X224794000Y206252000D02*
X203672000Y206252000D01*
X254127000Y100457000D02*
X254127000Y100097790D01*
X243332000Y99822000D02*
X242570000Y99822000D01*
X254127000Y100097790D02*
X253851210Y99822000D01*
X253851210Y99822000D02*
X243332000Y99822000D01*
X249682000Y162052000D02*
X249174000Y161544000D01*
X232156000Y161544000D02*
X231902000Y161544000D01*
X231902000Y161544000D02*
X231394000Y162052000D01*
X240792000Y161544000D02*
X232156000Y161544000D01*
X249174000Y161544000D02*
X240792000Y161544000D01*
X157226000Y305308000D02*
X157734000Y305816000D01*
X157734000Y305816000D02*
X224790000Y305816000D01*
X224790000Y305816000D02*
X225298000Y306324000D01*
X219710000Y219456000D02*
X224790000Y219456000D01*
X224790000Y219456000D02*
X225298000Y219964000D01*
X219202000Y218948000D02*
X219710000Y219456000D01*
X200406000Y259080000D02*
X242062000Y259080000D01*
X244094000Y250952000D02*
X258572000Y250952000D01*
X259839594Y250952000D02*
X260530050Y251642456D01*
X258572000Y250952000D02*
X259839594Y250952000D01*
X243586000Y251460000D02*
X244094000Y250952000D01*
X242062000Y259080000D02*
X243078000Y259080000D01*
X243078000Y259080000D02*
X243586000Y258572000D01*
X199898000Y258572000D02*
X200406000Y259080000D01*
X245110001Y292607999D02*
X245618000Y292100000D01*
X243585999Y292607999D02*
X245110001Y292607999D01*
X241554000Y293116000D02*
X242062001Y292607999D01*
X242062001Y292607999D02*
X243585999Y292607999D01*
X222758000Y218440000D02*
X225806000Y218440000D01*
X225806000Y218440000D02*
X239278158Y218440000D01*
X239278158Y218440000D02*
X239786158Y218948000D01*
X221234000Y216916000D02*
X222758000Y218440000D01*
X239786158Y218948000D02*
X242570000Y218948000D01*
X234177842Y216408000D02*
X227584000Y216408000D01*
X227076000Y216916000D02*
X225552000Y216916000D01*
X235193842Y217424000D02*
X234177842Y216408000D01*
X242062000Y217424000D02*
X235193842Y217424000D01*
X227584000Y216408000D02*
X227330000Y216662000D01*
X225552000Y216916000D02*
X224282000Y216916000D01*
X227330000Y216662000D02*
X227076000Y216916000D01*
X242570000Y216916000D02*
X242062000Y217424000D01*
X225298000Y54389278D02*
X225839278Y53848000D01*
X225839278Y53848000D02*
X251206000Y53848000D01*
X251206000Y53848000D02*
X251714000Y53340000D01*
X225298000Y55880000D02*
X225298000Y54389278D01*
X257048000Y275336000D02*
X257302000Y275336000D01*
X257302000Y275336000D02*
X257810000Y275844000D01*
X250190000Y275336000D02*
X257048000Y275336000D01*
X249682000Y274828000D02*
X250190000Y275336000D01*
X250698000Y262128000D02*
X251206000Y262128000D01*
X222250000Y261620000D02*
X222758000Y262128000D01*
X256389416Y262128000D02*
X256794000Y261723416D01*
X251206000Y262128000D02*
X256389416Y262128000D01*
X222758000Y262128000D02*
X250698000Y262128000D01*
X253403604Y246799604D02*
X254762000Y246799604D01*
X236474000Y244369787D02*
X237257787Y243586000D01*
X237257787Y243586000D02*
X242062000Y243586000D01*
X242062000Y243586000D02*
X242316000Y243840000D01*
X236474000Y244728997D02*
X236474000Y244369787D01*
X242316000Y243840000D02*
X250444000Y243840000D01*
X250444000Y243840000D02*
X253403604Y246799604D01*
X244094000Y263144000D02*
X253238000Y263144000D01*
X243586000Y262636000D02*
X244094000Y263144000D01*
X253238000Y263144000D02*
X253746000Y263652000D01*
X246126000Y282448000D02*
X246634000Y281940000D01*
X239014000Y282448000D02*
X246126000Y282448000D01*
X238506000Y281940000D02*
X239014000Y282448000D01*
X236982000Y281432000D02*
X237998000Y281432000D01*
X237998000Y281432000D02*
X243078000Y281432000D01*
X243078000Y281432000D02*
X243586000Y281940000D01*
X236854999Y281559001D02*
X236474000Y281940000D01*
X236474000Y281940000D02*
X236982000Y281432000D01*
X231140000Y268224000D02*
X241046000Y268224000D01*
X241046000Y268224000D02*
X242570000Y269748000D01*
X230631500Y267715500D02*
X231140000Y268224000D01*
X230471500Y267715500D02*
X230631500Y267715500D01*
G04 #@! TA.AperFunction,NonConductor*
G36*
X72088121Y5079998D02*
G01*
X72134614Y5026342D01*
X72146000Y4974000D01*
X72146000Y1226000D01*
X72125998Y1157879D01*
X72072342Y1111386D01*
X72020000Y1100000D01*
X68272000Y1100000D01*
X68203879Y1120002D01*
X68157386Y1173658D01*
X68146000Y1226000D01*
X68146000Y4104463D01*
X69470351Y4104463D01*
X69470351Y2038881D01*
X70892797Y2038881D01*
X70892797Y4104463D01*
X69470351Y4104463D01*
X68146000Y4104463D01*
X68146000Y4974000D01*
X68166002Y5042121D01*
X68219658Y5088614D01*
X68272000Y5100000D01*
X72020000Y5100000D01*
X72088121Y5079998D01*
G37*
G04 #@! TD.AperFunction*
D23*
X276430000Y-4748000D02*
X276430000Y207000000D01*
X-3570000Y-5450000D02*
X275628000Y-5450000D01*
X176700000Y116142000D02*
X176700000Y205028000D01*
X176700000Y294745000D02*
X-3570000Y294745000D01*
X188180000Y205028000D02*
X188180000Y255047000D01*
X188180000Y255047000D02*
X176700000Y255047000D01*
X176700000Y205028000D02*
X188180000Y205028000D01*
X276430000Y207000000D02*
X285420000Y207000000D01*
X276430000Y289100000D02*
X276430000Y315898000D01*
X276430000Y315898000D02*
X275628000Y316550000D01*
X176700000Y16405000D02*
X-3570000Y16405000D01*
X275628000Y-5450000D02*
X276430000Y-4748000D01*
X-3570000Y316550000D02*
X275628000Y316550000D01*
X176700000Y16405000D02*
X176700000Y66123000D01*
X285420000Y289100000D02*
X285420000Y207000000D01*
X176700000Y66123000D02*
X176700000Y116142000D01*
X-3570000Y294745000D02*
X-3570000Y316550000D01*
X-3570000Y-5450000D02*
X-3570000Y16405000D01*
X176700000Y255047000D02*
X176700000Y294745000D01*
X276430000Y289100000D02*
X285420000Y289100000D01*
M02*
