(kicad_symbol_lib (version 20220914) (generator kicad_symbol_editor)
  (symbol "PI6CV304" (pin_names (offset 1.016)) (in_bom yes) (on_board yes)
    (property "Reference" "U" (at 6.35 -8.89 0)
      (effects (font (size 1.27 1.27)))
    )
    (property "Value" "PI6CV304" (at 5.08 8.89 0)
      (effects (font (size 1.27 1.27)))
    )
    (property "Footprint" "" (at 0 0 0)
      (effects (font (size 1.27 1.27)) hide)
    )
    (property "Datasheet" "" (at 0 0 0)
      (effects (font (size 1.27 1.27)) hide)
    )
    (symbol "PI6CV304_0_1"
      (rectangle (start -7.62 7.62) (end 7.62 -7.62)
        (stroke (width 0) (type solid))
        (fill (type none))
      )
    )
    (symbol "PI6CV304_1_1"
      (pin input line (at -12.7 0 0) (length 5.08)
        (name "IN" (effects (font (size 1.27 1.27))))
        (number "1" (effects (font (size 1.27 1.27))))
      )
      (pin input line (at -12.7 3.81 0) (length 5.08)
        (name "OE" (effects (font (size 1.27 1.27))))
        (number "2" (effects (font (size 1.27 1.27))))
      )
      (pin output line (at 12.7 3.81 180) (length 5.08)
        (name "OUT0" (effects (font (size 1.27 1.27))))
        (number "3" (effects (font (size 1.27 1.27))))
      )
      (pin power_in line (at 0 -12.7 90) (length 5.08)
        (name "GND" (effects (font (size 1.27 1.27))))
        (number "4" (effects (font (size 1.27 1.27))))
      )
      (pin output line (at 12.7 1.27 180) (length 5.08)
        (name "OUT1" (effects (font (size 1.27 1.27))))
        (number "5" (effects (font (size 1.27 1.27))))
      )
      (pin power_in line (at 0 12.7 270) (length 5.08)
        (name "VDD" (effects (font (size 1.27 1.27))))
        (number "6" (effects (font (size 1.27 1.27))))
      )
      (pin output line (at 12.7 -1.27 180) (length 5.08)
        (name "OUT2" (effects (font (size 1.27 1.27))))
        (number "7" (effects (font (size 1.27 1.27))))
      )
      (pin output line (at 12.7 -3.81 180) (length 5.08)
        (name "OUT3" (effects (font (size 1.27 1.27))))
        (number "8" (effects (font (size 1.27 1.27))))
      )
    )
  )
)
