(kicad_sch
	(version 20231120)
	(generator "eeschema")
	(generator_version "8.0")
	(uuid "e39d602d-479f-4604-9991-94332c41ee11")
	(paper "A4")
	(lib_symbols
		(symbol "ATCA_Connectors:FrontPanel"
			(pin_names
				(offset 1.016)
			)
			(exclude_from_sim no)
			(in_bom yes)
			(on_board yes)
			(property "Reference" "A"
				(at -1.27 -7.62 0)
				(effects
					(font
						(size 1.27 1.27)
					)
				)
			)
			(property "Value" "FrontPanel"
				(at 0 5.08 0)
				(effects
					(font
						(size 1.27 1.27)
					)
				)
			)
			(property "Footprint" ""
				(at 0 0 0)
				(effects
					(font
						(size 1.27 1.27)
					)
					(hide yes)
				)
			)
			(property "Datasheet" ""
				(at 0 0 0)
				(effects
					(font
						(size 1.27 1.27)
					)
					(hide yes)
				)
			)
			(property "Description" ""
				(at 0 0 0)
				(effects
					(font
						(size 1.27 1.27)
					)
					(hide yes)
				)
			)
			(symbol "FrontPanel_0_1"
				(rectangle
					(start -2.54 1.27)
					(end 2.54 -1.27)
					(stroke
						(width 0)
						(type solid)
					)
					(fill
						(type none)
					)
				)
			)
		)
		(symbol "ATCA_Connectors:Handle"
			(pin_names
				(offset 1.016)
			)
			(exclude_from_sim no)
			(in_bom yes)
			(on_board yes)
			(property "Reference" "H"
				(at 1.27 -2.54 0)
				(effects
					(font
						(size 1.27 1.27)
					)
				)
			)
			(property "Value" "Handle"
				(at 0 2.54 0)
				(effects
					(font
						(size 1.27 1.27)
					)
				)
			)
			(property "Footprint" ""
				(at 0 0 0)
				(effects
					(font
						(size 1.27 1.27)
					)
					(hide yes)
				)
			)
			(property "Datasheet" ""
				(at 0 0 0)
				(effects
					(font
						(size 1.27 1.27)
					)
					(hide yes)
				)
			)
			(property "Description" ""
				(at 0 0 0)
				(effects
					(font
						(size 1.27 1.27)
					)
					(hide yes)
				)
			)
			(symbol "Handle_0_1"
				(rectangle
					(start -2.54 1.27)
					(end 2.54 -1.27)
					(stroke
						(width 0)
						(type solid)
					)
					(fill
						(type none)
					)
				)
			)
		)
		(symbol "ATCA_Connectors:Handle_ws"
			(pin_names
				(offset 1.016)
			)
			(exclude_from_sim no)
			(in_bom yes)
			(on_board yes)
			(property "Reference" "H"
				(at 5.08 -2.54 0)
				(effects
					(font
						(size 1.27 1.27)
					)
				)
			)
			(property "Value" "Handle_ws"
				(at 0 2.54 0)
				(effects
					(font
						(size 1.27 1.27)
					)
				)
			)
			(property "Footprint" ""
				(at 0 0 0)
				(effects
					(font
						(size 1.27 1.27)
					)
					(hide yes)
				)
			)
			(property "Datasheet" ""
				(at 0 0 0)
				(effects
					(font
						(size 1.27 1.27)
					)
					(hide yes)
				)
			)
			(property "Description" ""
				(at 0 0 0)
				(effects
					(font
						(size 1.27 1.27)
					)
					(hide yes)
				)
			)
			(symbol "Handle_ws_0_1"
				(rectangle
					(start -2.54 1.27)
					(end 2.54 -1.27)
					(stroke
						(width 0)
						(type solid)
					)
					(fill
						(type none)
					)
				)
			)
		)
		(symbol "ATCA_Connectors:Key"
			(pin_names
				(offset 1.016)
			)
			(exclude_from_sim no)
			(in_bom yes)
			(on_board yes)
			(property "Reference" "K"
				(at 7.62 5.08 0)
				(effects
					(font
						(size 1.27 1.27)
					)
				)
			)
			(property "Value" "Key"
				(at 0 0 0)
				(effects
					(font
						(size 1.27 1.27)
					)
				)
			)
			(property "Footprint" ""
				(at -7.62 1.27 0)
				(effects
					(font
						(size 1.27 1.27)
					)
					(hide yes)
				)
			)
			(property "Datasheet" ""
				(at -7.62 1.27 0)
				(effects
					(font
						(size 1.27 1.27)
					)
					(hide yes)
				)
			)
			(property "Description" ""
				(at 0 0 0)
				(effects
					(font
						(size 1.27 1.27)
					)
					(hide yes)
				)
			)
			(symbol "Key_0_1"
				(rectangle
					(start -7.62 3.81)
					(end 7.62 -3.81)
					(stroke
						(width 0)
						(type solid)
					)
					(fill
						(type none)
					)
				)
			)
		)
		(symbol "ATCA_Connectors:MachineScrew"
			(pin_names
				(offset 1.016)
			)
			(exclude_from_sim no)
			(in_bom yes)
			(on_board yes)
			(property "Reference" "MS"
				(at 3.048 -1.27 0)
				(effects
					(font
						(size 1.27 1.27)
					)
				)
			)
			(property "Value" "MachineScrew"
				(at -4.064 3.556 0)
				(effects
					(font
						(size 1.27 1.27)
					)
					(hide yes)
				)
			)
			(property "Footprint" ""
				(at 0 -1.524 0)
				(effects
					(font
						(size 1.27 1.27)
					)
					(hide yes)
				)
			)
			(property "Datasheet" ""
				(at 0 -1.524 0)
				(effects
					(font
						(size 1.27 1.27)
					)
					(hide yes)
				)
			)
			(property "Description" ""
				(at 0 0 0)
				(effects
					(font
						(size 1.27 1.27)
					)
					(hide yes)
				)
			)
			(symbol "MachineScrew_0_1"
				(rectangle
					(start -0.508 0.762)
					(end 0.508 -1.778)
					(stroke
						(width 0)
						(type solid)
					)
					(fill
						(type none)
					)
				)
				(polyline
					(pts
						(xy -1.27 1.016) (xy -0.508 0.762)
					)
					(stroke
						(width 0)
						(type solid)
					)
					(fill
						(type none)
					)
				)
				(polyline
					(pts
						(xy 0.508 -1.524) (xy -0.254 -1.778)
					)
					(stroke
						(width 0)
						(type solid)
					)
					(fill
						(type none)
					)
				)
				(polyline
					(pts
						(xy 0.508 -1.27) (xy -0.508 -1.524)
					)
					(stroke
						(width 0)
						(type solid)
					)
					(fill
						(type none)
					)
				)
				(polyline
					(pts
						(xy 0.508 -1.016) (xy -0.508 -1.27)
					)
					(stroke
						(width 0)
						(type solid)
					)
					(fill
						(type none)
					)
				)
				(polyline
					(pts
						(xy 0.508 -0.762) (xy -0.508 -1.016)
					)
					(stroke
						(width 0)
						(type solid)
					)
					(fill
						(type none)
					)
				)
				(polyline
					(pts
						(xy 0.508 -0.508) (xy -0.508 -0.762)
					)
					(stroke
						(width 0)
						(type solid)
					)
					(fill
						(type none)
					)
				)
				(polyline
					(pts
						(xy 0.508 -0.254) (xy -0.508 -0.508)
					)
					(stroke
						(width 0)
						(type solid)
					)
					(fill
						(type none)
					)
				)
				(polyline
					(pts
						(xy 0.508 0) (xy -0.508 -0.254)
					)
					(stroke
						(width 0)
						(type solid)
					)
					(fill
						(type none)
					)
				)
				(polyline
					(pts
						(xy 0.508 0.254) (xy -0.508 0)
					)
					(stroke
						(width 0)
						(type solid)
					)
					(fill
						(type none)
					)
				)
				(polyline
					(pts
						(xy 0.508 0.762) (xy 1.27 1.016)
					)
					(stroke
						(width 0)
						(type solid)
					)
					(fill
						(type none)
					)
				)
				(polyline
					(pts
						(xy 1.27 1.016) (xy -1.27 1.016)
					)
					(stroke
						(width 0)
						(type solid)
					)
					(fill
						(type none)
					)
				)
				(arc
					(start 1.27 1.016)
					(mid 0 1.5421)
					(end -1.27 1.016)
					(stroke
						(width 0)
						(type solid)
					)
					(fill
						(type none)
					)
				)
			)
		)
		(symbol "HW:MNT_HOLE"
			(pin_names
				(offset 1.016)
			)
			(exclude_from_sim no)
			(in_bom yes)
			(on_board yes)
			(property "Reference" "MP"
				(at 6.35 -3.81 0)
				(effects
					(font
						(size 1.27 1.27)
					)
				)
			)
			(property "Value" "MNT_HOLE"
				(at -1.27 5.08 0)
				(effects
					(font
						(size 1.27 1.27)
					)
				)
			)
			(property "Footprint" ""
				(at 0 0 0)
				(effects
					(font
						(size 1.27 1.27)
					)
					(hide yes)
				)
			)
			(property "Datasheet" ""
				(at 0 0 0)
				(effects
					(font
						(size 1.27 1.27)
					)
					(hide yes)
				)
			)
			(property "Description" ""
				(at 0 0 0)
				(effects
					(font
						(size 1.27 1.27)
					)
					(hide yes)
				)
			)
			(symbol "MNT_HOLE_0_1"
				(circle
					(center 0 0)
					(radius 1.8034)
					(stroke
						(width 0)
						(type solid)
					)
					(fill
						(type none)
					)
				)
				(circle
					(center 0 0)
					(radius 2.8448)
					(stroke
						(width 0)
						(type solid)
					)
					(fill
						(type none)
					)
				)
			)
			(symbol "MNT_HOLE_1_1"
				(pin passive line
					(at -7.62 0 0)
					(length 4.699)
					(name "~"
						(effects
							(font
								(size 1.27 1.27)
							)
						)
					)
					(number "1"
						(effects
							(font
								(size 1.27 1.27)
							)
						)
					)
				)
			)
		)
		(symbol "HW:SPLICE_PLATE"
			(pin_names
				(offset 1.016)
			)
			(exclude_from_sim no)
			(in_bom yes)
			(on_board yes)
			(property "Reference" "H"
				(at -2.54 -3.81 0)
				(effects
					(font
						(size 1.27 1.27)
					)
				)
			)
			(property "Value" "SPLICE_PLATE"
				(at 0 3.81 0)
				(effects
					(font
						(size 1.27 1.27)
					)
				)
			)
			(property "Footprint" ""
				(at 0 0 0)
				(effects
					(font
						(size 1.27 1.27)
					)
					(hide yes)
				)
			)
			(property "Datasheet" ""
				(at 0 0 0)
				(effects
					(font
						(size 1.27 1.27)
					)
					(hide yes)
				)
			)
			(property "Description" ""
				(at 0 0 0)
				(effects
					(font
						(size 1.27 1.27)
					)
					(hide yes)
				)
			)
			(symbol "SPLICE_PLATE_0_1"
				(rectangle
					(start -3.81 2.54)
					(end 3.81 -2.54)
					(stroke
						(width 0)
						(type solid)
					)
					(fill
						(type none)
					)
				)
			)
		)
		(symbol "Mechanical:MountingHole"
			(pin_names
				(offset 1.016)
			)
			(exclude_from_sim yes)
			(in_bom no)
			(on_board yes)
			(property "Reference" "H"
				(at 0 5.08 0)
				(effects
					(font
						(size 1.27 1.27)
					)
				)
			)
			(property "Value" "MountingHole"
				(at 0 3.175 0)
				(effects
					(font
						(size 1.27 1.27)
					)
				)
			)
			(property "Footprint" ""
				(at 0 0 0)
				(effects
					(font
						(size 1.27 1.27)
					)
					(hide yes)
				)
			)
			(property "Datasheet" "~"
				(at 0 0 0)
				(effects
					(font
						(size 1.27 1.27)
					)
					(hide yes)
				)
			)
			(property "Description" "Mounting Hole without connection"
				(at 0 0 0)
				(effects
					(font
						(size 1.27 1.27)
					)
					(hide yes)
				)
			)
			(property "ki_keywords" "mounting hole"
				(at 0 0 0)
				(effects
					(font
						(size 1.27 1.27)
					)
					(hide yes)
				)
			)
			(property "ki_fp_filters" "MountingHole*"
				(at 0 0 0)
				(effects
					(font
						(size 1.27 1.27)
					)
					(hide yes)
				)
			)
			(symbol "MountingHole_0_1"
				(circle
					(center 0 0)
					(radius 1.27)
					(stroke
						(width 1.27)
						(type default)
					)
					(fill
						(type none)
					)
				)
			)
		)
	)
	(no_connect
		(at 78.74 182.88)
		(uuid "0d8a6ef3-caa7-4260-8eb7-89ce34a052f7")
	)
	(no_connect
		(at 78.74 160.02)
		(uuid "0f06b94e-10f6-4248-b97a-109d3cfe1bff")
	)
	(no_connect
		(at 78.74 167.64)
		(uuid "1b5ddf2a-8652-4b9d-9311-18e42acc5dcf")
	)
	(no_connect
		(at 90.17 105.41)
		(uuid "2649f9eb-3545-42f0-8d5f-671a9428aeb1")
	)
	(no_connect
		(at 92.71 58.42)
		(uuid "29173124-dba1-4540-a98b-ba0cf106a130")
	)
	(no_connect
		(at 78.74 144.78)
		(uuid "3c53c66f-2466-467b-8236-ebad22252b36")
	)
	(no_connect
		(at 78.74 190.5)
		(uuid "43056a6d-520c-49fa-a4a3-c1a0cc90fec3")
	)
	(no_connect
		(at 92.71 35.56)
		(uuid "51e439db-6b91-4e82-bb8a-88b7dbee1a6c")
	)
	(no_connect
		(at 78.74 175.26)
		(uuid "5c49e7ef-5964-4704-93e9-5f5d2c37f17e")
	)
	(no_connect
		(at 90.17 97.79)
		(uuid "6acd8c42-5b2b-4a96-8943-09c386edd215")
	)
	(no_connect
		(at 78.74 152.4)
		(uuid "79793bf4-ee1e-4938-8372-bb5e5f7c4f0e")
	)
	(no_connect
		(at 92.71 43.18)
		(uuid "824161a8-1fb0-43e7-9923-aaf10f083065")
	)
	(no_connect
		(at 92.71 50.8)
		(uuid "97876b13-7214-4be8-89c3-2d57822ceada")
	)
	(no_connect
		(at 90.17 113.03)
		(uuid "bd93ed04-b459-4712-832c-5104524fb18f")
	)
	(no_connect
		(at 90.17 120.65)
		(uuid "c19963f0-b734-4481-8606-804790dea6ad")
	)
	(no_connect
		(at 92.71 66.04)
		(uuid "c9fbd541-7463-4c93-aed2-b4a03e8e311f")
	)
	(no_connect
		(at 90.17 90.17)
		(uuid "e88cab0f-cbb7-40a1-89fd-b4743910584a")
	)
	(rectangle
		(start 73.66 132.08)
		(end 142.24 196.215)
		(stroke
			(width 0)
			(type default)
		)
		(fill
			(type none)
		)
		(uuid 870d250b-7093-4e57-93ff-4d249db92b32)
	)
	(rectangle
		(start 88.265 77.47)
		(end 244.475 126.365)
		(stroke
			(width 0)
			(type default)
		)
		(fill
			(type none)
		)
		(uuid bba99253-5210-49a4-aaea-d58b941e7bad)
	)
	(rectangle
		(start 88.265 23.495)
		(end 244.475 72.39)
		(stroke
			(width 0)
			(type default)
		)
		(fill
			(type none)
		)
		(uuid d2d37f71-7ab9-4008-a77a-f2e6f77fc2ce)
	)
	(text "Bottom lid standoffs"
		(exclude_from_sim no)
		(at 108.204 136.652 0)
		(effects
			(font
				(size 1.27 1.27)
			)
		)
		(uuid "0c37fb0d-dce0-4741-980a-c6d31d157186")
	)
	(text "Top lid standoffs with placement aid for bottom lid standoffs.\nWashers are used to bring the total height to 20.5 mm"
		(exclude_from_sim no)
		(at 140.462 82.042 0)
		(effects
			(font
				(size 1.27 1.27)
			)
		)
		(uuid "0e65fdbb-0e07-4aa5-82bd-9834e06adb06")
	)
	(text "Front panel"
		(exclude_from_sim no)
		(at 18.796 156.21 0)
		(effects
			(font
				(size 5.08 5.08)
				(thickness 1.016)
				(bold yes)
			)
			(justify left bottom)
		)
		(uuid "140a7863-13e1-4b14-ac25-6fd3a140d760")
	)
	(text "Top lid standoffs (standalone).\nWashers are used to bring the total height to 20.5 mm"
		(exclude_from_sim no)
		(at 140.462 28.067 0)
		(effects
			(font
				(size 1.27 1.27)
			)
		)
		(uuid "45991f06-990c-42c3-b6e1-d521cf0e2d7c")
	)
	(text "Mezz mounting"
		(exclude_from_sim no)
		(at 19.05 80.01 0)
		(effects
			(font
				(size 5.08 5.08)
				(thickness 1.016)
				(bold yes)
			)
			(justify left bottom)
		)
		(uuid "7671a2a6-d6cd-4101-829b-5e6859165c28")
	)
	(text "Cover mounting"
		(exclude_from_sim no)
		(at 90.678 20.066 0)
		(effects
			(font
				(size 5.08 5.08)
				(thickness 1.016)
				(bold yes)
			)
			(justify left bottom)
		)
		(uuid "94958420-2ad3-4baf-8d52-18e80438aa44")
	)
	(text "ATCA Keying\nconnectors"
		(exclude_from_sim no)
		(at 17.78 31.75 0)
		(effects
			(font
				(size 5.08 5.08)
				(thickness 1.016)
				(bold yes)
			)
			(justify left bottom)
		)
		(uuid "95e0ebc4-1741-4d15-885b-3c61911eb838")
	)
	(text "Handles"
		(exclude_from_sim no)
		(at 18.288 119.634 0)
		(effects
			(font
				(size 5.08 5.08)
				(thickness 1.016)
				(bold yes)
			)
			(justify left bottom)
		)
		(uuid "abed9b98-d2bb-4041-abe4-4ad001ba65fc")
	)
	(symbol
		(lib_id "ATCA_Connectors:Key")
		(at 31.75 43.18 0)
		(unit 1)
		(exclude_from_sim no)
		(in_bom yes)
		(on_board yes)
		(dnp no)
		(uuid "00000000-0000-0000-0000-00005c096aeb")
		(property "Reference" "K1"
			(at 28.702 35.306 0)
			(effects
				(font
					(size 1.27 1.27)
				)
				(justify left)
			)
		)
		(property "Value" "1-1469373-1-ND"
			(at 23.368 37.592 0)
			(effects
				(font
					(size 1.27 1.27)
				)
				(justify left)
			)
		)
		(property "Footprint" "ATCA:Key"
			(at 24.13 41.91 0)
			(effects
				(font
					(size 1.27 1.27)
				)
				(hide yes)
			)
		)
		(property "Datasheet" ""
			(at 24.13 41.91 0)
			(effects
				(font
					(size 1.27 1.27)
				)
				(hide yes)
			)
		)
		(property "Description" ""
			(at 31.75 43.18 0)
			(effects
				(font
					(size 1.27 1.27)
				)
				(hide yes)
			)
		)
		(property "Supplier P/N" "1-1469373-1-ND"
			(at 31.75 43.18 0)
			(effects
				(font
					(size 1.27 1.27)
				)
				(hide yes)
			)
		)
		(property "Supplier" "Digikey"
			(at 31.75 43.18 0)
			(effects
				(font
					(size 1.27 1.27)
				)
				(hide yes)
			)
		)
		(instances
			(project "carrier"
				(path "/c546581a-7b71-4c20-b442-88ef38f8e5a8/00000000-0000-0000-0000-00005c095482"
					(reference "K1")
					(unit 1)
				)
			)
		)
	)
	(symbol
		(lib_id "ATCA_Connectors:Key")
		(at 53.34 43.18 0)
		(unit 1)
		(exclude_from_sim no)
		(in_bom yes)
		(on_board yes)
		(dnp no)
		(uuid "00000000-0000-0000-0000-00005c096b2f")
		(property "Reference" "K2"
			(at 48.514 35.306 0)
			(effects
				(font
					(size 1.27 1.27)
				)
				(justify left)
			)
		)
		(property "Value" "1-1469373-1-ND"
			(at 45.466 37.592 0)
			(effects
				(font
					(size 1.27 1.27)
				)
				(justify left)
			)
		)
		(property "Footprint" "ATCA:Key"
			(at 45.72 41.91 0)
			(effects
				(font
					(size 1.27 1.27)
				)
				(hide yes)
			)
		)
		(property "Datasheet" ""
			(at 45.72 41.91 0)
			(effects
				(font
					(size 1.27 1.27)
				)
				(hide yes)
			)
		)
		(property "Description" ""
			(at 53.34 43.18 0)
			(effects
				(font
					(size 1.27 1.27)
				)
				(hide yes)
			)
		)
		(property "Supplier P/N" "1-1469373-1-ND"
			(at 53.34 43.18 0)
			(effects
				(font
					(size 1.27 1.27)
				)
				(hide yes)
			)
		)
		(property "Supplier" "Digikey"
			(at 53.34 43.18 0)
			(effects
				(font
					(size 1.27 1.27)
				)
				(hide yes)
			)
		)
		(instances
			(project "carrier"
				(path "/c546581a-7b71-4c20-b442-88ef38f8e5a8/00000000-0000-0000-0000-00005c095482"
					(reference "K2")
					(unit 1)
				)
			)
		)
	)
	(symbol
		(lib_id "HW:SPLICE_PLATE")
		(at 29.21 87.63 0)
		(unit 1)
		(exclude_from_sim no)
		(in_bom yes)
		(on_board yes)
		(dnp yes)
		(uuid "00000000-0000-0000-0000-00005c1930b9")
		(property "Reference" "H1"
			(at 33.7312 86.4616 0)
			(effects
				(font
					(size 1.27 1.27)
				)
				(justify left)
			)
		)
		(property "Value" "SPLICE_PLATE"
			(at 33.7312 88.773 0)
			(effects
				(font
					(size 1.27 1.27)
				)
				(justify left)
			)
		)
		(property "Footprint" "CommandModule:New_SplicePlate_Top"
			(at 29.21 87.63 0)
			(effects
				(font
					(size 1.27 1.27)
				)
				(hide yes)
			)
		)
		(property "Datasheet" ""
			(at 29.21 87.63 0)
			(effects
				(font
					(size 1.27 1.27)
				)
				(hide yes)
			)
		)
		(property "Description" ""
			(at 29.21 87.63 0)
			(effects
				(font
					(size 1.27 1.27)
				)
				(hide yes)
			)
		)
		(instances
			(project "carrier"
				(path "/c546581a-7b71-4c20-b442-88ef38f8e5a8/00000000-0000-0000-0000-00005c095482"
					(reference "H1")
					(unit 1)
				)
			)
		)
	)
	(symbol
		(lib_id "HW:SPLICE_PLATE")
		(at 29.21 97.79 0)
		(unit 1)
		(exclude_from_sim no)
		(in_bom yes)
		(on_board yes)
		(dnp yes)
		(uuid "00000000-0000-0000-0000-00005c193146")
		(property "Reference" "H2"
			(at 33.7312 96.6216 0)
			(effects
				(font
					(size 1.27 1.27)
				)
				(justify left)
			)
		)
		(property "Value" "SPLICE_PLATE"
			(at 33.7312 98.933 0)
			(effects
				(font
					(size 1.27 1.27)
				)
				(justify left)
			)
		)
		(property "Footprint" "CommandModule:New_SplicePlate_Bottom"
			(at 29.21 97.79 0)
			(effects
				(font
					(size 1.27 1.27)
				)
				(hide yes)
			)
		)
		(property "Datasheet" ""
			(at 29.21 97.79 0)
			(effects
				(font
					(size 1.27 1.27)
				)
				(hide yes)
			)
		)
		(property "Description" ""
			(at 29.21 97.79 0)
			(effects
				(font
					(size 1.27 1.27)
				)
				(hide yes)
			)
		)
		(instances
			(project "carrier"
				(path "/c546581a-7b71-4c20-b442-88ef38f8e5a8/00000000-0000-0000-0000-00005c095482"
					(reference "H2")
					(unit 1)
				)
			)
		)
	)
	(symbol
		(lib_id "ATCA_Connectors:Handle")
		(at 27.94 124.46 0)
		(unit 1)
		(exclude_from_sim no)
		(in_bom yes)
		(on_board yes)
		(dnp yes)
		(uuid "00000000-0000-0000-0000-00005c196ab9")
		(property "Reference" "H3"
			(at 31.1912 123.2916 0)
			(effects
				(font
					(size 1.27 1.27)
				)
				(justify left)
			)
		)
		(property "Value" "81-300-00"
			(at 31.1912 125.603 0)
			(effects
				(font
					(size 1.27 1.27)
				)
				(justify left)
			)
		)
		(property "Footprint" "ATCA:81-300-00"
			(at 27.94 124.46 0)
			(effects
				(font
					(size 1.27 1.27)
				)
				(hide yes)
			)
		)
		(property "Datasheet" ""
			(at 27.94 124.46 0)
			(effects
				(font
					(size 1.27 1.27)
				)
				(hide yes)
			)
		)
		(property "Description" ""
			(at 27.94 124.46 0)
			(effects
				(font
					(size 1.27 1.27)
				)
				(hide yes)
			)
		)
		(property "Supplier P/N" "81-300-00"
			(at 27.94 124.46 0)
			(effects
				(font
					(size 1.27 1.27)
				)
				(hide yes)
			)
		)
		(property "Supplier" "Elma"
			(at 27.94 124.46 0)
			(effects
				(font
					(size 1.27 1.27)
				)
				(hide yes)
			)
		)
		(instances
			(project "carrier"
				(path "/c546581a-7b71-4c20-b442-88ef38f8e5a8/00000000-0000-0000-0000-00005c095482"
					(reference "H3")
					(unit 1)
				)
			)
		)
	)
	(symbol
		(lib_id "ATCA_Connectors:Handle_ws")
		(at 27.94 129.54 0)
		(unit 1)
		(exclude_from_sim no)
		(in_bom yes)
		(on_board yes)
		(dnp yes)
		(uuid "00000000-0000-0000-0000-00005c196b3f")
		(property "Reference" "H4"
			(at 31.1912 128.3716 0)
			(effects
				(font
					(size 1.27 1.27)
				)
				(justify left)
			)
		)
		(property "Value" "81-301-00"
			(at 31.1912 130.683 0)
			(effects
				(font
					(size 1.27 1.27)
				)
				(justify left)
			)
		)
		(property "Footprint" "ATCA:81-301-00"
			(at 27.94 129.54 0)
			(effects
				(font
					(size 1.27 1.27)
				)
				(hide yes)
			)
		)
		(property "Datasheet" ""
			(at 27.94 129.54 0)
			(effects
				(font
					(size 1.27 1.27)
				)
				(hide yes)
			)
		)
		(property "Description" ""
			(at 27.94 129.54 0)
			(effects
				(font
					(size 1.27 1.27)
				)
				(hide yes)
			)
		)
		(property "Supplier P/N" "81-301-00"
			(at 27.94 129.54 0)
			(effects
				(font
					(size 1.27 1.27)
				)
				(hide yes)
			)
		)
		(property "Supplier" "Elma"
			(at 27.94 129.54 0)
			(effects
				(font
					(size 1.27 1.27)
				)
				(hide yes)
			)
		)
		(instances
			(project "carrier"
				(path "/c546581a-7b71-4c20-b442-88ef38f8e5a8/00000000-0000-0000-0000-00005c095482"
					(reference "H4")
					(unit 1)
				)
			)
		)
	)
	(symbol
		(lib_id "ATCA_Connectors:FrontPanel")
		(at 27.94 160.02 0)
		(unit 1)
		(exclude_from_sim no)
		(in_bom yes)
		(on_board yes)
		(dnp yes)
		(uuid "00000000-0000-0000-0000-00005c197cbc")
		(property "Reference" "A1"
			(at 31.1912 158.8516 0)
			(effects
				(font
					(size 1.27 1.27)
				)
				(justify left)
			)
		)
		(property "Value" "66-535-38"
			(at 31.1912 161.163 0)
			(effects
				(font
					(size 1.27 1.27)
				)
				(justify left)
			)
		)
		(property "Footprint" "ATCA:FrontPanel"
			(at 27.94 160.02 0)
			(effects
				(font
					(size 1.27 1.27)
				)
				(hide yes)
			)
		)
		(property "Datasheet" ""
			(at 27.94 160.02 0)
			(effects
				(font
					(size 1.27 1.27)
				)
				(hide yes)
			)
		)
		(property "Description" ""
			(at 27.94 160.02 0)
			(effects
				(font
					(size 1.27 1.27)
				)
				(hide yes)
			)
		)
		(property "Supplier P/N" "66-535-38"
			(at 27.94 160.02 0)
			(effects
				(font
					(size 1.27 1.27)
				)
				(hide yes)
			)
		)
		(property "Supplier" "Elma"
			(at 27.94 160.02 0)
			(effects
				(font
					(size 1.27 1.27)
				)
				(hide yes)
			)
		)
		(instances
			(project "carrier"
				(path "/c546581a-7b71-4c20-b442-88ef38f8e5a8/00000000-0000-0000-0000-00005c095482"
					(reference "A1")
					(unit 1)
				)
			)
		)
	)
	(symbol
		(lib_id "HW:MNT_HOLE")
		(at 97.79 90.17 0)
		(unit 1)
		(exclude_from_sim no)
		(in_bom yes)
		(on_board yes)
		(dnp yes)
		(uuid "00000000-0000-0000-0000-00005c7ed028")
		(property "Reference" "MP1"
			(at 101.3206 89.0016 0)
			(effects
				(font
					(size 1.27 1.27)
				)
				(justify left)
			)
		)
		(property "Value" "M1267-2545-AL"
			(at 101.3206 91.313 0)
			(effects
				(font
					(size 1.27 1.27)
				)
				(justify left)
			)
		)
		(property "Footprint" "ATCA:Mounting_Hole_rev3"
			(at 97.79 90.17 0)
			(effects
				(font
					(size 1.27 1.27)
				)
				(hide yes)
			)
		)
		(property "Datasheet" ""
			(at 97.79 90.17 0)
			(effects
				(font
					(size 1.27 1.27)
				)
				(hide yes)
			)
		)
		(property "Description" ""
			(at 97.79 90.17 0)
			(effects
				(font
					(size 1.27 1.27)
				)
				(hide yes)
			)
		)
		(pin "1"
			(uuid "d6590ede-2ce9-4dc5-851b-303d1784d202")
		)
		(instances
			(project "carrier"
				(path "/c546581a-7b71-4c20-b442-88ef38f8e5a8/00000000-0000-0000-0000-00005c095482"
					(reference "MP1")
					(unit 1)
				)
			)
		)
	)
	(symbol
		(lib_id "HW:MNT_HOLE")
		(at 97.79 97.79 0)
		(unit 1)
		(exclude_from_sim no)
		(in_bom yes)
		(on_board yes)
		(dnp yes)
		(uuid "00000000-0000-0000-0000-00005c7edb78")
		(property "Reference" "MP2"
			(at 101.3206 96.6216 0)
			(effects
				(font
					(size 1.27 1.27)
				)
				(justify left)
			)
		)
		(property "Value" "M1267-2545-AL"
			(at 101.3206 98.933 0)
			(effects
				(font
					(size 1.27 1.27)
				)
				(justify left)
			)
		)
		(property "Footprint" "ATCA:Mounting_Hole_rev3"
			(at 97.79 97.79 0)
			(effects
				(font
					(size 1.27 1.27)
				)
				(hide yes)
			)
		)
		(property "Datasheet" ""
			(at 97.79 97.79 0)
			(effects
				(font
					(size 1.27 1.27)
				)
				(hide yes)
			)
		)
		(property "Description" ""
			(at 97.79 97.79 0)
			(effects
				(font
					(size 1.27 1.27)
				)
				(hide yes)
			)
		)
		(pin "1"
			(uuid "ecda3a35-33a2-417e-8e78-f29b53e7377b")
		)
		(instances
			(project "carrier"
				(path "/c546581a-7b71-4c20-b442-88ef38f8e5a8/00000000-0000-0000-0000-00005c095482"
					(reference "MP2")
					(unit 1)
				)
			)
		)
	)
	(symbol
		(lib_id "HW:MNT_HOLE")
		(at 97.79 105.41 0)
		(unit 1)
		(exclude_from_sim no)
		(in_bom yes)
		(on_board yes)
		(dnp yes)
		(uuid "00000000-0000-0000-0000-00005c7edd2d")
		(property "Reference" "MP3"
			(at 101.3206 104.2416 0)
			(effects
				(font
					(size 1.27 1.27)
				)
				(justify left)
			)
		)
		(property "Value" "M1267-2545-AL"
			(at 101.3206 106.553 0)
			(effects
				(font
					(size 1.27 1.27)
				)
				(justify left)
			)
		)
		(property "Footprint" "ATCA:Mounting_Hole_rev3"
			(at 97.79 105.41 0)
			(effects
				(font
					(size 1.27 1.27)
				)
				(hide yes)
			)
		)
		(property "Datasheet" ""
			(at 97.79 105.41 0)
			(effects
				(font
					(size 1.27 1.27)
				)
				(hide yes)
			)
		)
		(property "Description" ""
			(at 97.79 105.41 0)
			(effects
				(font
					(size 1.27 1.27)
				)
				(hide yes)
			)
		)
		(pin "1"
			(uuid "af7a699e-3a2d-4a88-966c-0e3acb968c50")
		)
		(instances
			(project "carrier"
				(path "/c546581a-7b71-4c20-b442-88ef38f8e5a8/00000000-0000-0000-0000-00005c095482"
					(reference "MP3")
					(unit 1)
				)
			)
		)
	)
	(symbol
		(lib_id "HW:MNT_HOLE")
		(at 97.79 113.03 0)
		(unit 1)
		(exclude_from_sim no)
		(in_bom yes)
		(on_board yes)
		(dnp yes)
		(uuid "00000000-0000-0000-0000-00005c7eddbe")
		(property "Reference" "MP4"
			(at 101.3206 111.8616 0)
			(effects
				(font
					(size 1.27 1.27)
				)
				(justify left)
			)
		)
		(property "Value" "M1267-2545-AL"
			(at 101.3206 114.173 0)
			(effects
				(font
					(size 1.27 1.27)
				)
				(justify left)
			)
		)
		(property "Footprint" "ATCA:Mounting_Hole_rev3"
			(at 97.79 113.03 0)
			(effects
				(font
					(size 1.27 1.27)
				)
				(hide yes)
			)
		)
		(property "Datasheet" ""
			(at 97.79 113.03 0)
			(effects
				(font
					(size 1.27 1.27)
				)
				(hide yes)
			)
		)
		(property "Description" ""
			(at 97.79 113.03 0)
			(effects
				(font
					(size 1.27 1.27)
				)
				(hide yes)
			)
		)
		(pin "1"
			(uuid "6eed3265-3466-4cf3-a27b-bdc74615eef4")
		)
		(instances
			(project "carrier"
				(path "/c546581a-7b71-4c20-b442-88ef38f8e5a8/00000000-0000-0000-0000-00005c095482"
					(reference "MP4")
					(unit 1)
				)
			)
		)
	)
	(symbol
		(lib_id "HW:MNT_HOLE")
		(at 100.33 35.56 0)
		(unit 1)
		(exclude_from_sim no)
		(in_bom yes)
		(on_board yes)
		(dnp yes)
		(uuid "00000000-0000-0000-0000-00005c7ede23")
		(property "Reference" "MP5"
			(at 103.8606 34.3916 0)
			(effects
				(font
					(size 1.27 1.27)
				)
				(justify left)
			)
		)
		(property "Value" "M1267-2545-AL"
			(at 103.8606 36.703 0)
			(effects
				(font
					(size 1.27 1.27)
				)
				(justify left)
			)
		)
		(property "Footprint" "ATCA:Mounting_Hole_rev3_top"
			(at 100.33 35.56 0)
			(effects
				(font
					(size 1.27 1.27)
				)
				(hide yes)
			)
		)
		(property "Datasheet" ""
			(at 100.33 35.56 0)
			(effects
				(font
					(size 1.27 1.27)
				)
				(hide yes)
			)
		)
		(property "Description" ""
			(at 100.33 35.56 0)
			(effects
				(font
					(size 1.27 1.27)
				)
				(hide yes)
			)
		)
		(pin "1"
			(uuid "aeac68d0-8aa1-4d27-98bb-eba4570467ee")
		)
		(instances
			(project "carrier"
				(path "/c546581a-7b71-4c20-b442-88ef38f8e5a8/00000000-0000-0000-0000-00005c095482"
					(reference "MP5")
					(unit 1)
				)
			)
		)
	)
	(symbol
		(lib_id "HW:MNT_HOLE")
		(at 100.33 43.18 0)
		(unit 1)
		(exclude_from_sim no)
		(in_bom yes)
		(on_board yes)
		(dnp yes)
		(uuid "00000000-0000-0000-0000-00005c7ede2a")
		(property "Reference" "MP6"
			(at 103.8606 42.0116 0)
			(effects
				(font
					(size 1.27 1.27)
				)
				(justify left)
			)
		)
		(property "Value" "M1267-2545-AL"
			(at 103.8606 44.323 0)
			(effects
				(font
					(size 1.27 1.27)
				)
				(justify left)
			)
		)
		(property "Footprint" "ATCA:Mounting_Hole_rev3_top"
			(at 100.33 43.18 0)
			(effects
				(font
					(size 1.27 1.27)
				)
				(hide yes)
			)
		)
		(property "Datasheet" ""
			(at 100.33 43.18 0)
			(effects
				(font
					(size 1.27 1.27)
				)
				(hide yes)
			)
		)
		(property "Description" ""
			(at 100.33 43.18 0)
			(effects
				(font
					(size 1.27 1.27)
				)
				(hide yes)
			)
		)
		(pin "1"
			(uuid "13fc8375-15db-4a0f-b72e-8191ed82c8d4")
		)
		(instances
			(project "carrier"
				(path "/c546581a-7b71-4c20-b442-88ef38f8e5a8/00000000-0000-0000-0000-00005c095482"
					(reference "MP6")
					(unit 1)
				)
			)
		)
	)
	(symbol
		(lib_id "HW:MNT_HOLE")
		(at 100.33 50.8 0)
		(unit 1)
		(exclude_from_sim no)
		(in_bom yes)
		(on_board yes)
		(dnp yes)
		(uuid "00000000-0000-0000-0000-00005c7ede31")
		(property "Reference" "MP7"
			(at 103.8606 49.6316 0)
			(effects
				(font
					(size 1.27 1.27)
				)
				(justify left)
			)
		)
		(property "Value" "M1267-2545-AL"
			(at 103.8606 51.943 0)
			(effects
				(font
					(size 1.27 1.27)
				)
				(justify left)
			)
		)
		(property "Footprint" "ATCA:Mounting_Hole_rev3_top"
			(at 100.33 50.8 0)
			(effects
				(font
					(size 1.27 1.27)
				)
				(hide yes)
			)
		)
		(property "Datasheet" ""
			(at 100.33 50.8 0)
			(effects
				(font
					(size 1.27 1.27)
				)
				(hide yes)
			)
		)
		(property "Description" ""
			(at 100.33 50.8 0)
			(effects
				(font
					(size 1.27 1.27)
				)
				(hide yes)
			)
		)
		(pin "1"
			(uuid "61dc289c-be26-4cd7-9fde-39a06a547f8a")
		)
		(instances
			(project "carrier"
				(path "/c546581a-7b71-4c20-b442-88ef38f8e5a8/00000000-0000-0000-0000-00005c095482"
					(reference "MP7")
					(unit 1)
				)
			)
		)
	)
	(symbol
		(lib_id "HW:MNT_HOLE")
		(at 97.79 120.65 0)
		(unit 1)
		(exclude_from_sim no)
		(in_bom yes)
		(on_board yes)
		(dnp yes)
		(uuid "00000000-0000-0000-0000-00005ee00571")
		(property "Reference" "MP8"
			(at 101.3206 119.4816 0)
			(effects
				(font
					(size 1.27 1.27)
				)
				(justify left)
			)
		)
		(property "Value" "M1267-2545-AL"
			(at 101.3206 121.793 0)
			(effects
				(font
					(size 1.27 1.27)
				)
				(justify left)
			)
		)
		(property "Footprint" "ATCA:Mounting_Hole_rev3"
			(at 97.79 120.65 0)
			(effects
				(font
					(size 1.27 1.27)
				)
				(hide yes)
			)
		)
		(property "Datasheet" ""
			(at 97.79 120.65 0)
			(effects
				(font
					(size 1.27 1.27)
				)
				(hide yes)
			)
		)
		(property "Description" ""
			(at 97.79 120.65 0)
			(effects
				(font
					(size 1.27 1.27)
				)
				(hide yes)
			)
		)
		(pin "1"
			(uuid "4bb506d6-4362-4d07-a7b2-06c6b4cdeaf0")
		)
		(instances
			(project "carrier"
				(path "/c546581a-7b71-4c20-b442-88ef38f8e5a8/00000000-0000-0000-0000-00005c095482"
					(reference "MP8")
					(unit 1)
				)
			)
		)
	)
	(symbol
		(lib_id "HW:MNT_HOLE")
		(at 100.33 58.42 0)
		(unit 1)
		(exclude_from_sim no)
		(in_bom yes)
		(on_board yes)
		(dnp yes)
		(uuid "00000000-0000-0000-0000-00005ef6ca4b")
		(property "Reference" "MP9"
			(at 103.8606 57.2516 0)
			(effects
				(font
					(size 1.27 1.27)
				)
				(justify left)
			)
		)
		(property "Value" "M1267-2545-AL"
			(at 103.8606 59.563 0)
			(effects
				(font
					(size 1.27 1.27)
				)
				(justify left)
			)
		)
		(property "Footprint" "ATCA:Mounting_Hole_Simple"
			(at 100.33 58.42 0)
			(effects
				(font
					(size 1.27 1.27)
				)
				(hide yes)
			)
		)
		(property "Datasheet" ""
			(at 100.33 58.42 0)
			(effects
				(font
					(size 1.27 1.27)
				)
				(hide yes)
			)
		)
		(property "Description" ""
			(at 100.33 58.42 0)
			(effects
				(font
					(size 1.27 1.27)
				)
				(hide yes)
			)
		)
		(pin "1"
			(uuid "3601939b-c195-4f1c-9609-a374cf2e946d")
		)
		(instances
			(project "carrier"
				(path "/c546581a-7b71-4c20-b442-88ef38f8e5a8/00000000-0000-0000-0000-00005c095482"
					(reference "MP9")
					(unit 1)
				)
			)
		)
	)
	(symbol
		(lib_id "HW:MNT_HOLE")
		(at 100.33 66.04 0)
		(unit 1)
		(exclude_from_sim no)
		(in_bom yes)
		(on_board yes)
		(dnp yes)
		(uuid "00000000-0000-0000-0000-00005ef6cce5")
		(property "Reference" "MP10"
			(at 103.8606 64.8716 0)
			(effects
				(font
					(size 1.27 1.27)
				)
				(justify left)
			)
		)
		(property "Value" "M1267-2545-AL"
			(at 103.8606 67.183 0)
			(effects
				(font
					(size 1.27 1.27)
				)
				(justify left)
			)
		)
		(property "Footprint" "ATCA:Mounting_Hole_Simple"
			(at 100.33 66.04 0)
			(effects
				(font
					(size 1.27 1.27)
				)
				(hide yes)
			)
		)
		(property "Datasheet" ""
			(at 100.33 66.04 0)
			(effects
				(font
					(size 1.27 1.27)
				)
				(hide yes)
			)
		)
		(property "Description" ""
			(at 100.33 66.04 0)
			(effects
				(font
					(size 1.27 1.27)
				)
				(hide yes)
			)
		)
		(pin "1"
			(uuid "9309a8f5-4e10-4be0-a14b-d5e4f098d5ee")
		)
		(instances
			(project "carrier"
				(path "/c546581a-7b71-4c20-b442-88ef38f8e5a8/00000000-0000-0000-0000-00005c095482"
					(reference "MP10")
					(unit 1)
				)
			)
		)
	)
	(symbol
		(lib_id "ATCA_Connectors:MachineScrew")
		(at 33.02 52.07 0)
		(unit 1)
		(exclude_from_sim no)
		(in_bom yes)
		(on_board no)
		(dnp no)
		(uuid "00000000-0000-0000-0000-00005fb99bf4")
		(property "Reference" "MS201"
			(at 35.0012 51.0032 0)
			(effects
				(font
					(size 1.27 1.27)
				)
				(justify left)
			)
		)
		(property "Value" "M2.5x8 pan head screw for K1 & K2"
			(at 19.304 56.134 0)
			(effects
				(font
					(size 1.27 1.27)
				)
				(justify left)
			)
		)
		(property "Footprint" ""
			(at 33.02 53.594 0)
			(effects
				(font
					(size 1.27 1.27)
				)
				(hide yes)
			)
		)
		(property "Datasheet" ""
			(at 33.02 53.594 0)
			(effects
				(font
					(size 1.27 1.27)
				)
				(hide yes)
			)
		)
		(property "Description" ""
			(at 33.02 52.07 0)
			(effects
				(font
					(size 1.27 1.27)
				)
				(hide yes)
			)
		)
		(instances
			(project "carrier"
				(path "/c546581a-7b71-4c20-b442-88ef38f8e5a8/00000000-0000-0000-0000-00005c095482"
					(reference "MS201")
					(unit 1)
				)
			)
		)
	)
	(symbol
		(lib_id "ATCA_Connectors:MachineScrew")
		(at 50.8 52.07 0)
		(unit 1)
		(exclude_from_sim no)
		(in_bom yes)
		(on_board no)
		(dnp no)
		(uuid "00000000-0000-0000-0000-00005fb99dce")
		(property "Reference" "MS202"
			(at 52.7812 51.0032 0)
			(effects
				(font
					(size 1.27 1.27)
				)
				(justify left)
			)
		)
		(property "Value" "M2.5x8 pan head screw for K1 & K2"
			(at 42.672 58.928 0)
			(effects
				(font
					(size 1.27 1.27)
				)
				(justify left)
			)
		)
		(property "Footprint" ""
			(at 50.8 53.594 0)
			(effects
				(font
					(size 1.27 1.27)
				)
				(hide yes)
			)
		)
		(property "Datasheet" ""
			(at 50.8 53.594 0)
			(effects
				(font
					(size 1.27 1.27)
				)
				(hide yes)
			)
		)
		(property "Description" ""
			(at 50.8 52.07 0)
			(effects
				(font
					(size 1.27 1.27)
				)
				(hide yes)
			)
		)
		(instances
			(project "carrier"
				(path "/c546581a-7b71-4c20-b442-88ef38f8e5a8/00000000-0000-0000-0000-00005c095482"
					(reference "MS202")
					(unit 1)
				)
			)
		)
	)
	(symbol
		(lib_id "HW:MNT_HOLE")
		(at 86.36 175.26 0)
		(unit 1)
		(exclude_from_sim no)
		(in_bom yes)
		(on_board yes)
		(dnp no)
		(fields_autoplaced yes)
		(uuid "05a7e229-2fbf-490e-8ad8-e9613b5a7625")
		(property "Reference" "MP18"
			(at 90.17 173.9899 0)
			(effects
				(font
					(size 1.27 1.27)
				)
				(justify left)
			)
		)
		(property "Value" "SMTSO-M3-3ET"
			(at 90.17 176.5299 0)
			(effects
				(font
					(size 1.27 1.27)
				)
				(justify left)
			)
		)
		(property "Footprint" "SMTSO-M3-2ET:PEM_SMTSO-M3-2ET"
			(at 86.36 175.26 0)
			(effects
				(font
					(size 1.27 1.27)
				)
				(hide yes)
			)
		)
		(property "Datasheet" ""
			(at 86.36 175.26 0)
			(effects
				(font
					(size 1.27 1.27)
				)
				(hide yes)
			)
		)
		(property "Description" ""
			(at 86.36 175.26 0)
			(effects
				(font
					(size 1.27 1.27)
				)
				(hide yes)
			)
		)
		(pin "1"
			(uuid "28b25387-9ff8-4c51-8533-cef1f0f4e6ee")
		)
		(instances
			(project "carrier"
				(path "/c546581a-7b71-4c20-b442-88ef38f8e5a8/00000000-0000-0000-0000-00005c095482"
					(reference "MP18")
					(unit 1)
				)
			)
		)
	)
	(symbol
		(lib_id "ATCA_Connectors:MachineScrew")
		(at 162.56 119.38 0)
		(unit 1)
		(exclude_from_sim yes)
		(in_bom yes)
		(on_board no)
		(dnp yes)
		(uuid "108ee477-1013-43d5-816d-7ceeac9b362b")
		(property "Reference" "MS28"
			(at 165.1 119.4978 0)
			(effects
				(font
					(size 1.27 1.27)
				)
				(justify left)
			)
		)
		(property "Value" "M2.5x6 pan head screw"
			(at 176.53 121.92 0)
			(effects
				(font
					(size 1.27 1.27)
				)
			)
		)
		(property "Footprint" ""
			(at 162.56 120.904 0)
			(effects
				(font
					(size 1.27 1.27)
				)
				(hide yes)
			)
		)
		(property "Datasheet" ""
			(at 162.56 120.904 0)
			(effects
				(font
					(size 1.27 1.27)
				)
				(hide yes)
			)
		)
		(property "Description" ""
			(at 162.56 119.38 0)
			(effects
				(font
					(size 1.27 1.27)
				)
				(hide yes)
			)
		)
		(instances
			(project "carrier"
				(path "/c546581a-7b71-4c20-b442-88ef38f8e5a8/00000000-0000-0000-0000-00005c095482"
					(reference "MS28")
					(unit 1)
				)
			)
		)
	)
	(symbol
		(lib_id "ATCA_Connectors:MachineScrew")
		(at 127 49.53 0)
		(unit 1)
		(exclude_from_sim yes)
		(in_bom yes)
		(on_board no)
		(dnp yes)
		(uuid "1955d78e-5928-466f-bece-f9977b906b07")
		(property "Reference" "MS16"
			(at 129.54 49.6478 0)
			(effects
				(font
					(size 1.27 1.27)
				)
				(justify left)
			)
		)
		(property "Value" "M2.5x4 flat head screw"
			(at 140.97 52.07 0)
			(effects
				(font
					(size 1.27 1.27)
				)
			)
		)
		(property "Footprint" ""
			(at 127 51.054 0)
			(effects
				(font
					(size 1.27 1.27)
				)
				(hide yes)
			)
		)
		(property "Datasheet" ""
			(at 127 51.054 0)
			(effects
				(font
					(size 1.27 1.27)
				)
				(hide yes)
			)
		)
		(property "Description" ""
			(at 127 49.53 0)
			(effects
				(font
					(size 1.27 1.27)
				)
				(hide yes)
			)
		)
		(instances
			(project "carrier"
				(path "/c546581a-7b71-4c20-b442-88ef38f8e5a8/00000000-0000-0000-0000-00005c095482"
					(reference "MS16")
					(unit 1)
				)
			)
		)
	)
	(symbol
		(lib_id "ATCA_Connectors:MachineScrew")
		(at 127 88.9 0)
		(unit 1)
		(exclude_from_sim yes)
		(in_bom yes)
		(on_board no)
		(dnp yes)
		(uuid "1df02854-23b6-4694-bea0-d1f24cbfd28e")
		(property "Reference" "MS9"
			(at 129.54 89.0178 0)
			(effects
				(font
					(size 1.27 1.27)
				)
				(justify left)
			)
		)
		(property "Value" "M2.5x4 flat head screw"
			(at 140.97 91.44 0)
			(effects
				(font
					(size 1.27 1.27)
				)
			)
		)
		(property "Footprint" ""
			(at 127 90.424 0)
			(effects
				(font
					(size 1.27 1.27)
				)
				(hide yes)
			)
		)
		(property "Datasheet" ""
			(at 127 90.424 0)
			(effects
				(font
					(size 1.27 1.27)
				)
				(hide yes)
			)
		)
		(property "Description" ""
			(at 127 88.9 0)
			(effects
				(font
					(size 1.27 1.27)
				)
				(hide yes)
			)
		)
		(instances
			(project "carrier"
				(path "/c546581a-7b71-4c20-b442-88ef38f8e5a8/00000000-0000-0000-0000-00005c095482"
					(reference "MS9")
					(unit 1)
				)
			)
		)
	)
	(symbol
		(lib_id "Mechanical:MountingHole")
		(at 210.82 120.65 0)
		(unit 1)
		(exclude_from_sim yes)
		(in_bom yes)
		(on_board no)
		(dnp yes)
		(fields_autoplaced yes)
		(uuid "2453bf22-cd98-449b-af89-038eccdb763a")
		(property "Reference" "H9"
			(at 213.36 119.3799 0)
			(effects
				(font
					(size 1.27 1.27)
				)
				(justify left)
			)
		)
		(property "Value" "washer M2.5 0.5 mm thick"
			(at 213.36 121.9199 0)
			(effects
				(font
					(size 1.27 1.27)
				)
				(justify left)
			)
		)
		(property "Footprint" ""
			(at 210.82 120.65 0)
			(effects
				(font
					(size 1.27 1.27)
				)
				(hide yes)
			)
		)
		(property "Datasheet" "~"
			(at 210.82 120.65 0)
			(effects
				(font
					(size 1.27 1.27)
				)
				(hide yes)
			)
		)
		(property "Description" "Mounting Hole without connection"
			(at 210.82 120.65 0)
			(effects
				(font
					(size 1.27 1.27)
				)
				(hide yes)
			)
		)
		(instances
			(project "carrier"
				(path "/c546581a-7b71-4c20-b442-88ef38f8e5a8/00000000-0000-0000-0000-00005c095482"
					(reference "H9")
					(unit 1)
				)
			)
		)
	)
	(symbol
		(lib_id "ATCA_Connectors:MachineScrew")
		(at 127 57.15 0)
		(unit 1)
		(exclude_from_sim yes)
		(in_bom yes)
		(on_board no)
		(dnp yes)
		(uuid "28ad83bd-be6e-4c90-b96a-ca38c18c8bc8")
		(property "Reference" "MS17"
			(at 129.54 57.2678 0)
			(effects
				(font
					(size 1.27 1.27)
				)
				(justify left)
			)
		)
		(property "Value" "M2.5x4 flat head screw"
			(at 140.97 59.69 0)
			(effects
				(font
					(size 1.27 1.27)
				)
			)
		)
		(property "Footprint" ""
			(at 127 58.674 0)
			(effects
				(font
					(size 1.27 1.27)
				)
				(hide yes)
			)
		)
		(property "Datasheet" ""
			(at 127 58.674 0)
			(effects
				(font
					(size 1.27 1.27)
				)
				(hide yes)
			)
		)
		(property "Description" ""
			(at 127 57.15 0)
			(effects
				(font
					(size 1.27 1.27)
				)
				(hide yes)
			)
		)
		(instances
			(project "carrier"
				(path "/c546581a-7b71-4c20-b442-88ef38f8e5a8/00000000-0000-0000-0000-00005c095482"
					(reference "MS17")
					(unit 1)
				)
			)
		)
	)
	(symbol
		(lib_id "ATCA_Connectors:MachineScrew")
		(at 162.56 34.29 0)
		(unit 1)
		(exclude_from_sim yes)
		(in_bom yes)
		(on_board no)
		(dnp yes)
		(uuid "2adac9ee-86c9-427c-8f23-ec7af45ed63c")
		(property "Reference" "MS19"
			(at 165.1 34.4078 0)
			(effects
				(font
					(size 1.27 1.27)
				)
				(justify left)
			)
		)
		(property "Value" "M2.5x6 pan head screw"
			(at 176.53 36.83 0)
			(effects
				(font
					(size 1.27 1.27)
				)
			)
		)
		(property "Footprint" ""
			(at 162.56 35.814 0)
			(effects
				(font
					(size 1.27 1.27)
				)
				(hide yes)
			)
		)
		(property "Datasheet" ""
			(at 162.56 35.814 0)
			(effects
				(font
					(size 1.27 1.27)
				)
				(hide yes)
			)
		)
		(property "Description" ""
			(at 162.56 34.29 0)
			(effects
				(font
					(size 1.27 1.27)
				)
				(hide yes)
			)
		)
		(instances
			(project "carrier"
				(path "/c546581a-7b71-4c20-b442-88ef38f8e5a8/00000000-0000-0000-0000-00005c095482"
					(reference "MS19")
					(unit 1)
				)
			)
		)
	)
	(symbol
		(lib_id "ATCA_Connectors:MachineScrew")
		(at 127 34.29 0)
		(unit 1)
		(exclude_from_sim yes)
		(in_bom yes)
		(on_board no)
		(dnp yes)
		(uuid "2e969186-1ac7-4c1d-bb01-ed206991d91e")
		(property "Reference" "MS14"
			(at 129.54 34.4078 0)
			(effects
				(font
					(size 1.27 1.27)
				)
				(justify left)
			)
		)
		(property "Value" "M2.5x4 flat head screw"
			(at 140.97 36.83 0)
			(effects
				(font
					(size 1.27 1.27)
				)
			)
		)
		(property "Footprint" ""
			(at 127 35.814 0)
			(effects
				(font
					(size 1.27 1.27)
				)
				(hide yes)
			)
		)
		(property "Datasheet" ""
			(at 127 35.814 0)
			(effects
				(font
					(size 1.27 1.27)
				)
				(hide yes)
			)
		)
		(property "Description" ""
			(at 127 34.29 0)
			(effects
				(font
					(size 1.27 1.27)
				)
				(hide yes)
			)
		)
		(instances
			(project "carrier"
				(path "/c546581a-7b71-4c20-b442-88ef38f8e5a8/00000000-0000-0000-0000-00005c095482"
					(reference "MS14")
					(unit 1)
				)
			)
		)
	)
	(symbol
		(lib_id "ATCA_Connectors:MachineScrew")
		(at 162.56 96.52 0)
		(unit 1)
		(exclude_from_sim yes)
		(in_bom yes)
		(on_board no)
		(dnp yes)
		(uuid "311b1501-a0e1-447b-91bf-ef41d65688a6")
		(property "Reference" "MS25"
			(at 165.1 96.6378 0)
			(effects
				(font
					(size 1.27 1.27)
				)
				(justify left)
			)
		)
		(property "Value" "M2.5x6 pan head screw"
			(at 176.53 99.06 0)
			(effects
				(font
					(size 1.27 1.27)
				)
			)
		)
		(property "Footprint" ""
			(at 162.56 98.044 0)
			(effects
				(font
					(size 1.27 1.27)
				)
				(hide yes)
			)
		)
		(property "Datasheet" ""
			(at 162.56 98.044 0)
			(effects
				(font
					(size 1.27 1.27)
				)
				(hide yes)
			)
		)
		(property "Description" ""
			(at 162.56 96.52 0)
			(effects
				(font
					(size 1.27 1.27)
				)
				(hide yes)
			)
		)
		(instances
			(project "carrier"
				(path "/c546581a-7b71-4c20-b442-88ef38f8e5a8/00000000-0000-0000-0000-00005c095482"
					(reference "MS25")
					(unit 1)
				)
			)
		)
	)
	(symbol
		(lib_id "ATCA_Connectors:MachineScrew")
		(at 110.49 182.88 0)
		(unit 1)
		(exclude_from_sim yes)
		(in_bom yes)
		(on_board no)
		(dnp yes)
		(uuid "37c66885-1f1d-4453-962e-2cfbaaf2d247")
		(property "Reference" "MS7"
			(at 113.03 182.9978 0)
			(effects
				(font
					(size 1.27 1.27)
				)
				(justify left)
			)
		)
		(property "Value" "M3x4 flat head screw"
			(at 124.46 185.42 0)
			(effects
				(font
					(size 1.27 1.27)
				)
			)
		)
		(property "Footprint" ""
			(at 110.49 184.404 0)
			(effects
				(font
					(size 1.27 1.27)
				)
				(hide yes)
			)
		)
		(property "Datasheet" ""
			(at 110.49 184.404 0)
			(effects
				(font
					(size 1.27 1.27)
				)
				(hide yes)
			)
		)
		(property "Description" ""
			(at 110.49 182.88 0)
			(effects
				(font
					(size 1.27 1.27)
				)
				(hide yes)
			)
		)
		(instances
			(project "carrier"
				(path "/c546581a-7b71-4c20-b442-88ef38f8e5a8/00000000-0000-0000-0000-00005c095482"
					(reference "MS7")
					(unit 1)
				)
			)
		)
	)
	(symbol
		(lib_id "Mechanical:MountingHole")
		(at 210.82 58.42 0)
		(unit 1)
		(exclude_from_sim yes)
		(in_bom yes)
		(on_board no)
		(dnp yes)
		(fields_autoplaced yes)
		(uuid "3c0033dd-459d-4cfc-b145-d814c2e7431b")
		(property "Reference" "H13"
			(at 213.36 57.1499 0)
			(effects
				(font
					(size 1.27 1.27)
				)
				(justify left)
			)
		)
		(property "Value" "washer M2.5 0.5 mm thick"
			(at 213.36 59.6899 0)
			(effects
				(font
					(size 1.27 1.27)
				)
				(justify left)
			)
		)
		(property "Footprint" ""
			(at 210.82 58.42 0)
			(effects
				(font
					(size 1.27 1.27)
				)
				(hide yes)
			)
		)
		(property "Datasheet" "~"
			(at 210.82 58.42 0)
			(effects
				(font
					(size 1.27 1.27)
				)
				(hide yes)
			)
		)
		(property "Description" "Mounting Hole without connection"
			(at 210.82 58.42 0)
			(effects
				(font
					(size 1.27 1.27)
				)
				(hide yes)
			)
		)
		(instances
			(project "carrier"
				(path "/c546581a-7b71-4c20-b442-88ef38f8e5a8/00000000-0000-0000-0000-00005c095482"
					(reference "H13")
					(unit 1)
				)
			)
		)
	)
	(symbol
		(lib_id "ATCA_Connectors:MachineScrew")
		(at 162.56 41.91 0)
		(unit 1)
		(exclude_from_sim yes)
		(in_bom yes)
		(on_board no)
		(dnp yes)
		(uuid "40b62ac5-0583-4f6a-8279-c9a4da1a238c")
		(property "Reference" "MS20"
			(at 165.1 42.0278 0)
			(effects
				(font
					(size 1.27 1.27)
				)
				(justify left)
			)
		)
		(property "Value" "M2.5x6 pan head screw"
			(at 176.53 44.45 0)
			(effects
				(font
					(size 1.27 1.27)
				)
			)
		)
		(property "Footprint" ""
			(at 162.56 43.434 0)
			(effects
				(font
					(size 1.27 1.27)
				)
				(hide yes)
			)
		)
		(property "Datasheet" ""
			(at 162.56 43.434 0)
			(effects
				(font
					(size 1.27 1.27)
				)
				(hide yes)
			)
		)
		(property "Description" ""
			(at 162.56 41.91 0)
			(effects
				(font
					(size 1.27 1.27)
				)
				(hide yes)
			)
		)
		(instances
			(project "carrier"
				(path "/c546581a-7b71-4c20-b442-88ef38f8e5a8/00000000-0000-0000-0000-00005c095482"
					(reference "MS20")
					(unit 1)
				)
			)
		)
	)
	(symbol
		(lib_id "ATCA_Connectors:MachineScrew")
		(at 110.49 166.37 0)
		(unit 1)
		(exclude_from_sim yes)
		(in_bom yes)
		(on_board no)
		(dnp yes)
		(uuid "446dfd8a-141a-4cab-b136-4f24d40882d2")
		(property "Reference" "MS5"
			(at 113.03 166.4878 0)
			(effects
				(font
					(size 1.27 1.27)
				)
				(justify left)
			)
		)
		(property "Value" "M3x4 flat head screw"
			(at 124.46 168.91 0)
			(effects
				(font
					(size 1.27 1.27)
				)
			)
		)
		(property "Footprint" ""
			(at 110.49 167.894 0)
			(effects
				(font
					(size 1.27 1.27)
				)
				(hide yes)
			)
		)
		(property "Datasheet" ""
			(at 110.49 167.894 0)
			(effects
				(font
					(size 1.27 1.27)
				)
				(hide yes)
			)
		)
		(property "Description" ""
			(at 110.49 166.37 0)
			(effects
				(font
					(size 1.27 1.27)
				)
				(hide yes)
			)
		)
		(instances
			(project "carrier"
				(path "/c546581a-7b71-4c20-b442-88ef38f8e5a8/00000000-0000-0000-0000-00005c095482"
					(reference "MS5")
					(unit 1)
				)
			)
		)
	)
	(symbol
		(lib_id "HW:MNT_HOLE")
		(at 86.36 152.4 0)
		(unit 1)
		(exclude_from_sim no)
		(in_bom yes)
		(on_board yes)
		(dnp no)
		(fields_autoplaced yes)
		(uuid "52eb2e27-a889-43ed-a9a7-9cc95fb86178")
		(property "Reference" "MP15"
			(at 90.17 151.1299 0)
			(effects
				(font
					(size 1.27 1.27)
				)
				(justify left)
			)
		)
		(property "Value" "SMTSO-M3-3ET"
			(at 90.17 153.6699 0)
			(effects
				(font
					(size 1.27 1.27)
				)
				(justify left)
			)
		)
		(property "Footprint" "SMTSO-M3-2ET:PEM_SMTSO-M3-2ET"
			(at 86.36 152.4 0)
			(effects
				(font
					(size 1.27 1.27)
				)
				(hide yes)
			)
		)
		(property "Datasheet" ""
			(at 86.36 152.4 0)
			(effects
				(font
					(size 1.27 1.27)
				)
				(hide yes)
			)
		)
		(property "Description" ""
			(at 86.36 152.4 0)
			(effects
				(font
					(size 1.27 1.27)
				)
				(hide yes)
			)
		)
		(pin "1"
			(uuid "ef5601bb-5ea8-496a-ab02-74541b17784a")
		)
		(instances
			(project "carrier"
				(path "/c546581a-7b71-4c20-b442-88ef38f8e5a8/00000000-0000-0000-0000-00005c095482"
					(reference "MP15")
					(unit 1)
				)
			)
		)
	)
	(symbol
		(lib_id "ATCA_Connectors:MachineScrew")
		(at 162.56 104.14 0)
		(unit 1)
		(exclude_from_sim yes)
		(in_bom yes)
		(on_board no)
		(dnp yes)
		(uuid "55c6e91a-e3d7-4a12-a5d3-064dde24ea6c")
		(property "Reference" "MS26"
			(at 165.1 104.2578 0)
			(effects
				(font
					(size 1.27 1.27)
				)
				(justify left)
			)
		)
		(property "Value" "M2.5x6 pan head screw"
			(at 176.53 106.68 0)
			(effects
				(font
					(size 1.27 1.27)
				)
			)
		)
		(property "Footprint" ""
			(at 162.56 105.664 0)
			(effects
				(font
					(size 1.27 1.27)
				)
				(hide yes)
			)
		)
		(property "Datasheet" ""
			(at 162.56 105.664 0)
			(effects
				(font
					(size 1.27 1.27)
				)
				(hide yes)
			)
		)
		(property "Description" ""
			(at 162.56 104.14 0)
			(effects
				(font
					(size 1.27 1.27)
				)
				(hide yes)
			)
		)
		(instances
			(project "carrier"
				(path "/c546581a-7b71-4c20-b442-88ef38f8e5a8/00000000-0000-0000-0000-00005c095482"
					(reference "MS26")
					(unit 1)
				)
			)
		)
	)
	(symbol
		(lib_id "ATCA_Connectors:MachineScrew")
		(at 127 111.76 0)
		(unit 1)
		(exclude_from_sim yes)
		(in_bom yes)
		(on_board no)
		(dnp yes)
		(uuid "5ab74cef-65bc-4815-b039-49623351eb49")
		(property "Reference" "MS12"
			(at 129.54 111.8778 0)
			(effects
				(font
					(size 1.27 1.27)
				)
				(justify left)
			)
		)
		(property "Value" "M2.5x4 flat head screw"
			(at 140.97 114.3 0)
			(effects
				(font
					(size 1.27 1.27)
				)
			)
		)
		(property "Footprint" ""
			(at 127 113.284 0)
			(effects
				(font
					(size 1.27 1.27)
				)
				(hide yes)
			)
		)
		(property "Datasheet" ""
			(at 127 113.284 0)
			(effects
				(font
					(size 1.27 1.27)
				)
				(hide yes)
			)
		)
		(property "Description" ""
			(at 127 111.76 0)
			(effects
				(font
					(size 1.27 1.27)
				)
				(hide yes)
			)
		)
		(instances
			(project "carrier"
				(path "/c546581a-7b71-4c20-b442-88ef38f8e5a8/00000000-0000-0000-0000-00005c095482"
					(reference "MS12")
					(unit 1)
				)
			)
		)
	)
	(symbol
		(lib_id "Mechanical:MountingHole")
		(at 210.82 35.56 0)
		(unit 1)
		(exclude_from_sim yes)
		(in_bom yes)
		(on_board no)
		(dnp yes)
		(fields_autoplaced yes)
		(uuid "5b69cb47-a4d4-45b1-86f2-e1f7aa240ad8")
		(property "Reference" "H10"
			(at 213.36 34.2899 0)
			(effects
				(font
					(size 1.27 1.27)
				)
				(justify left)
			)
		)
		(property "Value" "washer M2.5 0.5 mm thick"
			(at 213.36 36.8299 0)
			(effects
				(font
					(size 1.27 1.27)
				)
				(justify left)
			)
		)
		(property "Footprint" ""
			(at 210.82 35.56 0)
			(effects
				(font
					(size 1.27 1.27)
				)
				(hide yes)
			)
		)
		(property "Datasheet" "~"
			(at 210.82 35.56 0)
			(effects
				(font
					(size 1.27 1.27)
				)
				(hide yes)
			)
		)
		(property "Description" "Mounting Hole without connection"
			(at 210.82 35.56 0)
			(effects
				(font
					(size 1.27 1.27)
				)
				(hide yes)
			)
		)
		(instances
			(project "carrier"
				(path "/c546581a-7b71-4c20-b442-88ef38f8e5a8/00000000-0000-0000-0000-00005c095482"
					(reference "H10")
					(unit 1)
				)
			)
		)
	)
	(symbol
		(lib_id "ATCA_Connectors:MachineScrew")
		(at 127 96.52 0)
		(unit 1)
		(exclude_from_sim yes)
		(in_bom yes)
		(on_board no)
		(dnp yes)
		(uuid "6d444454-d5bc-4dfd-9cf9-d518c541e233")
		(property "Reference" "MS10"
			(at 129.54 96.6378 0)
			(effects
				(font
					(size 1.27 1.27)
				)
				(justify left)
			)
		)
		(property "Value" "M2.5x4 flat head screw"
			(at 140.97 99.06 0)
			(effects
				(font
					(size 1.27 1.27)
				)
			)
		)
		(property "Footprint" ""
			(at 127 98.044 0)
			(effects
				(font
					(size 1.27 1.27)
				)
				(hide yes)
			)
		)
		(property "Datasheet" ""
			(at 127 98.044 0)
			(effects
				(font
					(size 1.27 1.27)
				)
				(hide yes)
			)
		)
		(property "Description" ""
			(at 127 96.52 0)
			(effects
				(font
					(size 1.27 1.27)
				)
				(hide yes)
			)
		)
		(instances
			(project "carrier"
				(path "/c546581a-7b71-4c20-b442-88ef38f8e5a8/00000000-0000-0000-0000-00005c095482"
					(reference "MS10")
					(unit 1)
				)
			)
		)
	)
	(symbol
		(lib_id "ATCA_Connectors:MachineScrew")
		(at 162.56 64.77 0)
		(unit 1)
		(exclude_from_sim yes)
		(in_bom yes)
		(on_board no)
		(dnp yes)
		(uuid "6ecf74cc-accc-44eb-8021-09f526eddee4")
		(property "Reference" "MS23"
			(at 165.1 64.8878 0)
			(effects
				(font
					(size 1.27 1.27)
				)
				(justify left)
			)
		)
		(property "Value" "M2.5x6 pan head screw"
			(at 176.53 67.31 0)
			(effects
				(font
					(size 1.27 1.27)
				)
			)
		)
		(property "Footprint" ""
			(at 162.56 66.294 0)
			(effects
				(font
					(size 1.27 1.27)
				)
				(hide yes)
			)
		)
		(property "Datasheet" ""
			(at 162.56 66.294 0)
			(effects
				(font
					(size 1.27 1.27)
				)
				(hide yes)
			)
		)
		(property "Description" ""
			(at 162.56 64.77 0)
			(effects
				(font
					(size 1.27 1.27)
				)
				(hide yes)
			)
		)
		(instances
			(project "carrier"
				(path "/c546581a-7b71-4c20-b442-88ef38f8e5a8/00000000-0000-0000-0000-00005c095482"
					(reference "MS23")
					(unit 1)
				)
			)
		)
	)
	(symbol
		(lib_id "ATCA_Connectors:MachineScrew")
		(at 162.56 88.9 0)
		(unit 1)
		(exclude_from_sim yes)
		(in_bom yes)
		(on_board no)
		(dnp yes)
		(uuid "73698c9e-5537-4c68-bea8-5254b03ae1fb")
		(property "Reference" "MS24"
			(at 165.1 89.0178 0)
			(effects
				(font
					(size 1.27 1.27)
				)
				(justify left)
			)
		)
		(property "Value" "M2.5x6 pan head screw"
			(at 176.53 91.44 0)
			(effects
				(font
					(size 1.27 1.27)
				)
			)
		)
		(property "Footprint" ""
			(at 162.56 90.424 0)
			(effects
				(font
					(size 1.27 1.27)
				)
				(hide yes)
			)
		)
		(property "Datasheet" ""
			(at 162.56 90.424 0)
			(effects
				(font
					(size 1.27 1.27)
				)
				(hide yes)
			)
		)
		(property "Description" ""
			(at 162.56 88.9 0)
			(effects
				(font
					(size 1.27 1.27)
				)
				(hide yes)
			)
		)
		(instances
			(project "carrier"
				(path "/c546581a-7b71-4c20-b442-88ef38f8e5a8/00000000-0000-0000-0000-00005c095482"
					(reference "MS24")
					(unit 1)
				)
			)
		)
	)
	(symbol
		(lib_id "Mechanical:MountingHole")
		(at 210.82 50.8 0)
		(unit 1)
		(exclude_from_sim yes)
		(in_bom yes)
		(on_board no)
		(dnp yes)
		(fields_autoplaced yes)
		(uuid "7634e91a-0243-4587-925e-d14d37eb1e26")
		(property "Reference" "H12"
			(at 213.36 49.5299 0)
			(effects
				(font
					(size 1.27 1.27)
				)
				(justify left)
			)
		)
		(property "Value" "washer M2.5 0.5 mm thick"
			(at 213.36 52.0699 0)
			(effects
				(font
					(size 1.27 1.27)
				)
				(justify left)
			)
		)
		(property "Footprint" ""
			(at 210.82 50.8 0)
			(effects
				(font
					(size 1.27 1.27)
				)
				(hide yes)
			)
		)
		(property "Datasheet" "~"
			(at 210.82 50.8 0)
			(effects
				(font
					(size 1.27 1.27)
				)
				(hide yes)
			)
		)
		(property "Description" "Mounting Hole without connection"
			(at 210.82 50.8 0)
			(effects
				(font
					(size 1.27 1.27)
				)
				(hide yes)
			)
		)
		(instances
			(project "carrier"
				(path "/c546581a-7b71-4c20-b442-88ef38f8e5a8/00000000-0000-0000-0000-00005c095482"
					(reference "H12")
					(unit 1)
				)
			)
		)
	)
	(symbol
		(lib_id "ATCA_Connectors:MachineScrew")
		(at 110.49 158.75 0)
		(unit 1)
		(exclude_from_sim yes)
		(in_bom yes)
		(on_board no)
		(dnp yes)
		(uuid "7b773b74-0e6d-459f-816e-fee2a9e4418c")
		(property "Reference" "MS4"
			(at 113.03 158.8678 0)
			(effects
				(font
					(size 1.27 1.27)
				)
				(justify left)
			)
		)
		(property "Value" "M3x4 flat head screw"
			(at 124.46 161.29 0)
			(effects
				(font
					(size 1.27 1.27)
				)
			)
		)
		(property "Footprint" ""
			(at 110.49 160.274 0)
			(effects
				(font
					(size 1.27 1.27)
				)
				(hide yes)
			)
		)
		(property "Datasheet" ""
			(at 110.49 160.274 0)
			(effects
				(font
					(size 1.27 1.27)
				)
				(hide yes)
			)
		)
		(property "Description" ""
			(at 110.49 158.75 0)
			(effects
				(font
					(size 1.27 1.27)
				)
				(hide yes)
			)
		)
		(instances
			(project "carrier"
				(path "/c546581a-7b71-4c20-b442-88ef38f8e5a8/00000000-0000-0000-0000-00005c095482"
					(reference "MS4")
					(unit 1)
				)
			)
		)
	)
	(symbol
		(lib_id "ATCA_Connectors:MachineScrew")
		(at 110.49 190.5 0)
		(unit 1)
		(exclude_from_sim yes)
		(in_bom yes)
		(on_board no)
		(dnp yes)
		(uuid "886b0f27-9c7a-44c3-9d76-45a7d513d0dd")
		(property "Reference" "MS8"
			(at 113.03 190.6178 0)
			(effects
				(font
					(size 1.27 1.27)
				)
				(justify left)
			)
		)
		(property "Value" "M3x4 flat head screw"
			(at 124.46 193.04 0)
			(effects
				(font
					(size 1.27 1.27)
				)
			)
		)
		(property "Footprint" ""
			(at 110.49 192.024 0)
			(effects
				(font
					(size 1.27 1.27)
				)
				(hide yes)
			)
		)
		(property "Datasheet" ""
			(at 110.49 192.024 0)
			(effects
				(font
					(size 1.27 1.27)
				)
				(hide yes)
			)
		)
		(property "Description" ""
			(at 110.49 190.5 0)
			(effects
				(font
					(size 1.27 1.27)
				)
				(hide yes)
			)
		)
		(instances
			(project "carrier"
				(path "/c546581a-7b71-4c20-b442-88ef38f8e5a8/00000000-0000-0000-0000-00005c095482"
					(reference "MS8")
					(unit 1)
				)
			)
		)
	)
	(symbol
		(lib_id "ATCA_Connectors:MachineScrew")
		(at 162.56 111.76 0)
		(unit 1)
		(exclude_from_sim yes)
		(in_bom yes)
		(on_board no)
		(dnp yes)
		(uuid "8bdf7505-9016-4c20-85f0-d2900175e7a1")
		(property "Reference" "MS27"
			(at 165.1 111.8778 0)
			(effects
				(font
					(size 1.27 1.27)
				)
				(justify left)
			)
		)
		(property "Value" "M2.5x6 pan head screw"
			(at 176.53 114.3 0)
			(effects
				(font
					(size 1.27 1.27)
				)
			)
		)
		(property "Footprint" ""
			(at 162.56 113.284 0)
			(effects
				(font
					(size 1.27 1.27)
				)
				(hide yes)
			)
		)
		(property "Datasheet" ""
			(at 162.56 113.284 0)
			(effects
				(font
					(size 1.27 1.27)
				)
				(hide yes)
			)
		)
		(property "Description" ""
			(at 162.56 111.76 0)
			(effects
				(font
					(size 1.27 1.27)
				)
				(hide yes)
			)
		)
		(instances
			(project "carrier"
				(path "/c546581a-7b71-4c20-b442-88ef38f8e5a8/00000000-0000-0000-0000-00005c095482"
					(reference "MS27")
					(unit 1)
				)
			)
		)
	)
	(symbol
		(lib_id "ATCA_Connectors:MachineScrew")
		(at 127 64.77 0)
		(unit 1)
		(exclude_from_sim yes)
		(in_bom yes)
		(on_board no)
		(dnp yes)
		(uuid "964032cf-a141-45a4-b15d-4bbc1de17742")
		(property "Reference" "MS18"
			(at 129.54 64.8878 0)
			(effects
				(font
					(size 1.27 1.27)
				)
				(justify left)
			)
		)
		(property "Value" "M2.5x4 flat head screw"
			(at 140.97 67.31 0)
			(effects
				(font
					(size 1.27 1.27)
				)
			)
		)
		(property "Footprint" ""
			(at 127 66.294 0)
			(effects
				(font
					(size 1.27 1.27)
				)
				(hide yes)
			)
		)
		(property "Datasheet" ""
			(at 127 66.294 0)
			(effects
				(font
					(size 1.27 1.27)
				)
				(hide yes)
			)
		)
		(property "Description" ""
			(at 127 64.77 0)
			(effects
				(font
					(size 1.27 1.27)
				)
				(hide yes)
			)
		)
		(instances
			(project "carrier"
				(path "/c546581a-7b71-4c20-b442-88ef38f8e5a8/00000000-0000-0000-0000-00005c095482"
					(reference "MS18")
					(unit 1)
				)
			)
		)
	)
	(symbol
		(lib_id "ATCA_Connectors:MachineScrew")
		(at 110.49 143.51 0)
		(unit 1)
		(exclude_from_sim yes)
		(in_bom yes)
		(on_board no)
		(dnp yes)
		(uuid "97f9c0e4-f83c-403b-94f4-079999bbc16e")
		(property "Reference" "MS2"
			(at 113.03 143.6278 0)
			(effects
				(font
					(size 1.27 1.27)
				)
				(justify left)
			)
		)
		(property "Value" "M3x4 flat head screw"
			(at 124.46 146.05 0)
			(effects
				(font
					(size 1.27 1.27)
				)
			)
		)
		(property "Footprint" ""
			(at 110.49 145.034 0)
			(effects
				(font
					(size 1.27 1.27)
				)
				(hide yes)
			)
		)
		(property "Datasheet" ""
			(at 110.49 145.034 0)
			(effects
				(font
					(size 1.27 1.27)
				)
				(hide yes)
			)
		)
		(property "Description" ""
			(at 110.49 143.51 0)
			(effects
				(font
					(size 1.27 1.27)
				)
				(hide yes)
			)
		)
		(instances
			(project "carrier"
				(path "/c546581a-7b71-4c20-b442-88ef38f8e5a8/00000000-0000-0000-0000-00005c095482"
					(reference "MS2")
					(unit 1)
				)
			)
		)
	)
	(symbol
		(lib_id "Mechanical:MountingHole")
		(at 210.82 105.41 0)
		(unit 1)
		(exclude_from_sim yes)
		(in_bom yes)
		(on_board no)
		(dnp yes)
		(fields_autoplaced yes)
		(uuid "9c35a8c1-f06b-4288-9308-7a14ba2e51fc")
		(property "Reference" "H7"
			(at 213.36 104.1399 0)
			(effects
				(font
					(size 1.27 1.27)
				)
				(justify left)
			)
		)
		(property "Value" "washer M2.5 0.5 mm thick"
			(at 213.36 106.6799 0)
			(effects
				(font
					(size 1.27 1.27)
				)
				(justify left)
			)
		)
		(property "Footprint" ""
			(at 210.82 105.41 0)
			(effects
				(font
					(size 1.27 1.27)
				)
				(hide yes)
			)
		)
		(property "Datasheet" "~"
			(at 210.82 105.41 0)
			(effects
				(font
					(size 1.27 1.27)
				)
				(hide yes)
			)
		)
		(property "Description" "Mounting Hole without connection"
			(at 210.82 105.41 0)
			(effects
				(font
					(size 1.27 1.27)
				)
				(hide yes)
			)
		)
		(instances
			(project "carrier"
				(path "/c546581a-7b71-4c20-b442-88ef38f8e5a8/00000000-0000-0000-0000-00005c095482"
					(reference "H7")
					(unit 1)
				)
			)
		)
	)
	(symbol
		(lib_id "ATCA_Connectors:MachineScrew")
		(at 110.49 173.99 0)
		(unit 1)
		(exclude_from_sim yes)
		(in_bom yes)
		(on_board no)
		(dnp yes)
		(uuid "9eba1117-1116-4911-99d0-33679d27c703")
		(property "Reference" "MS6"
			(at 113.03 174.1078 0)
			(effects
				(font
					(size 1.27 1.27)
				)
				(justify left)
			)
		)
		(property "Value" "M3x4 flat head screw"
			(at 124.46 176.53 0)
			(effects
				(font
					(size 1.27 1.27)
				)
			)
		)
		(property "Footprint" ""
			(at 110.49 175.514 0)
			(effects
				(font
					(size 1.27 1.27)
				)
				(hide yes)
			)
		)
		(property "Datasheet" ""
			(at 110.49 175.514 0)
			(effects
				(font
					(size 1.27 1.27)
				)
				(hide yes)
			)
		)
		(property "Description" ""
			(at 110.49 173.99 0)
			(effects
				(font
					(size 1.27 1.27)
				)
				(hide yes)
			)
		)
		(instances
			(project "carrier"
				(path "/c546581a-7b71-4c20-b442-88ef38f8e5a8/00000000-0000-0000-0000-00005c095482"
					(reference "MS6")
					(unit 1)
				)
			)
		)
	)
	(symbol
		(lib_id "HW:MNT_HOLE")
		(at 86.36 144.78 0)
		(unit 1)
		(exclude_from_sim no)
		(in_bom yes)
		(on_board yes)
		(dnp no)
		(fields_autoplaced yes)
		(uuid "a2c80ea8-b543-435e-a25d-6fafa9c66ea6")
		(property "Reference" "MP14"
			(at 90.17 143.5099 0)
			(effects
				(font
					(size 1.27 1.27)
				)
				(justify left)
			)
		)
		(property "Value" "SMTSO-M3-3ET"
			(at 90.17 146.0499 0)
			(effects
				(font
					(size 1.27 1.27)
				)
				(justify left)
			)
		)
		(property "Footprint" "SMTSO-M3-2ET:PEM_SMTSO-M3-2ET"
			(at 86.36 144.78 0)
			(effects
				(font
					(size 1.27 1.27)
				)
				(hide yes)
			)
		)
		(property "Datasheet" ""
			(at 86.36 144.78 0)
			(effects
				(font
					(size 1.27 1.27)
				)
				(hide yes)
			)
		)
		(property "Description" ""
			(at 86.36 144.78 0)
			(effects
				(font
					(size 1.27 1.27)
				)
				(hide yes)
			)
		)
		(pin "1"
			(uuid "03b58795-0aa8-4f12-b9a9-02e0895c0413")
		)
		(instances
			(project "carrier"
				(path "/c546581a-7b71-4c20-b442-88ef38f8e5a8/00000000-0000-0000-0000-00005c095482"
					(reference "MP14")
					(unit 1)
				)
			)
		)
	)
	(symbol
		(lib_id "Mechanical:MountingHole")
		(at 210.82 113.03 0)
		(unit 1)
		(exclude_from_sim yes)
		(in_bom yes)
		(on_board no)
		(dnp yes)
		(fields_autoplaced yes)
		(uuid "a4319abb-cd28-4bf5-bc64-5700479ff817")
		(property "Reference" "H8"
			(at 213.36 111.7599 0)
			(effects
				(font
					(size 1.27 1.27)
				)
				(justify left)
			)
		)
		(property "Value" "washer M2.5 0.5 mm thick"
			(at 213.36 114.2999 0)
			(effects
				(font
					(size 1.27 1.27)
				)
				(justify left)
			)
		)
		(property "Footprint" ""
			(at 210.82 113.03 0)
			(effects
				(font
					(size 1.27 1.27)
				)
				(hide yes)
			)
		)
		(property "Datasheet" "~"
			(at 210.82 113.03 0)
			(effects
				(font
					(size 1.27 1.27)
				)
				(hide yes)
			)
		)
		(property "Description" "Mounting Hole without connection"
			(at 210.82 113.03 0)
			(effects
				(font
					(size 1.27 1.27)
				)
				(hide yes)
			)
		)
		(instances
			(project "carrier"
				(path "/c546581a-7b71-4c20-b442-88ef38f8e5a8/00000000-0000-0000-0000-00005c095482"
					(reference "H8")
					(unit 1)
				)
			)
		)
	)
	(symbol
		(lib_id "ATCA_Connectors:MachineScrew")
		(at 127 119.38 0)
		(unit 1)
		(exclude_from_sim yes)
		(in_bom yes)
		(on_board no)
		(dnp yes)
		(uuid "ab4f218f-4822-4b13-985d-efd9d002e53f")
		(property "Reference" "MS13"
			(at 129.54 119.4978 0)
			(effects
				(font
					(size 1.27 1.27)
				)
				(justify left)
			)
		)
		(property "Value" "M2.5x4 flat head screw"
			(at 140.97 121.92 0)
			(effects
				(font
					(size 1.27 1.27)
				)
			)
		)
		(property "Footprint" ""
			(at 127 120.904 0)
			(effects
				(font
					(size 1.27 1.27)
				)
				(hide yes)
			)
		)
		(property "Datasheet" ""
			(at 127 120.904 0)
			(effects
				(font
					(size 1.27 1.27)
				)
				(hide yes)
			)
		)
		(property "Description" ""
			(at 127 119.38 0)
			(effects
				(font
					(size 1.27 1.27)
				)
				(hide yes)
			)
		)
		(instances
			(project "carrier"
				(path "/c546581a-7b71-4c20-b442-88ef38f8e5a8/00000000-0000-0000-0000-00005c095482"
					(reference "MS13")
					(unit 1)
				)
			)
		)
	)
	(symbol
		(lib_id "Mechanical:MountingHole")
		(at 210.82 90.17 0)
		(unit 1)
		(exclude_from_sim yes)
		(in_bom yes)
		(on_board no)
		(dnp yes)
		(fields_autoplaced yes)
		(uuid "ac7f7d0c-42bc-4d93-a9ab-8e5b40cafd1f")
		(property "Reference" "H5"
			(at 213.36 88.8999 0)
			(effects
				(font
					(size 1.27 1.27)
				)
				(justify left)
			)
		)
		(property "Value" "washer M2.5 0.5 mm thick"
			(at 213.36 91.4399 0)
			(effects
				(font
					(size 1.27 1.27)
				)
				(justify left)
			)
		)
		(property "Footprint" ""
			(at 210.82 90.17 0)
			(effects
				(font
					(size 1.27 1.27)
				)
				(hide yes)
			)
		)
		(property "Datasheet" "~"
			(at 210.82 90.17 0)
			(effects
				(font
					(size 1.27 1.27)
				)
				(hide yes)
			)
		)
		(property "Description" "Mounting Hole without connection"
			(at 210.82 90.17 0)
			(effects
				(font
					(size 1.27 1.27)
				)
				(hide yes)
			)
		)
		(instances
			(project ""
				(path "/c546581a-7b71-4c20-b442-88ef38f8e5a8/00000000-0000-0000-0000-00005c095482"
					(reference "H5")
					(unit 1)
				)
			)
		)
	)
	(symbol
		(lib_id "Mechanical:MountingHole")
		(at 210.82 66.04 0)
		(unit 1)
		(exclude_from_sim yes)
		(in_bom yes)
		(on_board no)
		(dnp yes)
		(fields_autoplaced yes)
		(uuid "ad48eff7-0121-4820-b0bb-9e00d56a4ef5")
		(property "Reference" "H14"
			(at 213.36 64.7699 0)
			(effects
				(font
					(size 1.27 1.27)
				)
				(justify left)
			)
		)
		(property "Value" "washer M2.5 0.5 mm thick"
			(at 213.36 67.3099 0)
			(effects
				(font
					(size 1.27 1.27)
				)
				(justify left)
			)
		)
		(property "Footprint" ""
			(at 210.82 66.04 0)
			(effects
				(font
					(size 1.27 1.27)
				)
				(hide yes)
			)
		)
		(property "Datasheet" "~"
			(at 210.82 66.04 0)
			(effects
				(font
					(size 1.27 1.27)
				)
				(hide yes)
			)
		)
		(property "Description" "Mounting Hole without connection"
			(at 210.82 66.04 0)
			(effects
				(font
					(size 1.27 1.27)
				)
				(hide yes)
			)
		)
		(instances
			(project "carrier"
				(path "/c546581a-7b71-4c20-b442-88ef38f8e5a8/00000000-0000-0000-0000-00005c095482"
					(reference "H14")
					(unit 1)
				)
			)
		)
	)
	(symbol
		(lib_id "ATCA_Connectors:MachineScrew")
		(at 127 41.91 0)
		(unit 1)
		(exclude_from_sim yes)
		(in_bom yes)
		(on_board no)
		(dnp yes)
		(uuid "b281edfe-12cf-4772-bacd-6413f1c0432d")
		(property "Reference" "MS15"
			(at 129.54 42.0278 0)
			(effects
				(font
					(size 1.27 1.27)
				)
				(justify left)
			)
		)
		(property "Value" "M2.5x4 flat head screw"
			(at 140.97 44.45 0)
			(effects
				(font
					(size 1.27 1.27)
				)
			)
		)
		(property "Footprint" ""
			(at 127 43.434 0)
			(effects
				(font
					(size 1.27 1.27)
				)
				(hide yes)
			)
		)
		(property "Datasheet" ""
			(at 127 43.434 0)
			(effects
				(font
					(size 1.27 1.27)
				)
				(hide yes)
			)
		)
		(property "Description" ""
			(at 127 41.91 0)
			(effects
				(font
					(size 1.27 1.27)
				)
				(hide yes)
			)
		)
		(instances
			(project "carrier"
				(path "/c546581a-7b71-4c20-b442-88ef38f8e5a8/00000000-0000-0000-0000-00005c095482"
					(reference "MS15")
					(unit 1)
				)
			)
		)
	)
	(symbol
		(lib_id "HW:MNT_HOLE")
		(at 86.36 190.5 0)
		(unit 1)
		(exclude_from_sim no)
		(in_bom yes)
		(on_board yes)
		(dnp no)
		(uuid "b3c89b71-7c48-4b28-8e93-cbd0a5b0025b")
		(property "Reference" "MP12"
			(at 89.8906 189.3316 0)
			(effects
				(font
					(size 1.27 1.27)
				)
				(justify left)
			)
		)
		(property "Value" "SMTSO-M3-3ET"
			(at 89.8906 191.643 0)
			(effects
				(font
					(size 1.27 1.27)
				)
				(justify left)
			)
		)
		(property "Footprint" "SMTSO-M3-2ET:PEM_SMTSO-M3-2ET"
			(at 86.36 190.5 0)
			(effects
				(font
					(size 1.27 1.27)
				)
				(hide yes)
			)
		)
		(property "Datasheet" ""
			(at 86.36 190.5 0)
			(effects
				(font
					(size 1.27 1.27)
				)
				(hide yes)
			)
		)
		(property "Description" ""
			(at 86.36 190.5 0)
			(effects
				(font
					(size 1.27 1.27)
				)
				(hide yes)
			)
		)
		(pin "1"
			(uuid "e78b3d58-90dc-447c-9440-b979633a15c5")
		)
		(instances
			(project "carrier"
				(path "/c546581a-7b71-4c20-b442-88ef38f8e5a8/00000000-0000-0000-0000-00005c095482"
					(reference "MP12")
					(unit 1)
				)
			)
		)
	)
	(symbol
		(lib_id "ATCA_Connectors:MachineScrew")
		(at 110.49 151.13 0)
		(unit 1)
		(exclude_from_sim yes)
		(in_bom yes)
		(on_board no)
		(dnp yes)
		(uuid "ccb008fa-1624-4054-9e06-c7cb018d2bca")
		(property "Reference" "MS3"
			(at 113.03 151.2478 0)
			(effects
				(font
					(size 1.27 1.27)
				)
				(justify left)
			)
		)
		(property "Value" "M3x4 flat head screw"
			(at 124.46 153.67 0)
			(effects
				(font
					(size 1.27 1.27)
				)
			)
		)
		(property "Footprint" ""
			(at 110.49 152.654 0)
			(effects
				(font
					(size 1.27 1.27)
				)
				(hide yes)
			)
		)
		(property "Datasheet" ""
			(at 110.49 152.654 0)
			(effects
				(font
					(size 1.27 1.27)
				)
				(hide yes)
			)
		)
		(property "Description" ""
			(at 110.49 151.13 0)
			(effects
				(font
					(size 1.27 1.27)
				)
				(hide yes)
			)
		)
		(instances
			(project "carrier"
				(path "/c546581a-7b71-4c20-b442-88ef38f8e5a8/00000000-0000-0000-0000-00005c095482"
					(reference "MS3")
					(unit 1)
				)
			)
		)
	)
	(symbol
		(lib_id "HW:MNT_HOLE")
		(at 86.36 182.88 0)
		(unit 1)
		(exclude_from_sim no)
		(in_bom yes)
		(on_board yes)
		(dnp no)
		(uuid "cf4b47a9-86a3-4bd8-949d-e9fab91791ba")
		(property "Reference" "MP11"
			(at 89.8906 181.7116 0)
			(effects
				(font
					(size 1.27 1.27)
				)
				(justify left)
			)
		)
		(property "Value" "SMTSO-M3-3ET"
			(at 89.8906 184.023 0)
			(effects
				(font
					(size 1.27 1.27)
				)
				(justify left)
			)
		)
		(property "Footprint" "SMTSO-M3-2ET:PEM_SMTSO-M3-2ET"
			(at 86.36 182.88 0)
			(effects
				(font
					(size 1.27 1.27)
				)
				(hide yes)
			)
		)
		(property "Datasheet" ""
			(at 86.36 182.88 0)
			(effects
				(font
					(size 1.27 1.27)
				)
				(hide yes)
			)
		)
		(property "Description" ""
			(at 86.36 182.88 0)
			(effects
				(font
					(size 1.27 1.27)
				)
				(hide yes)
			)
		)
		(pin "1"
			(uuid "915462f7-4bde-4b8e-a4e2-e528e33575a5")
		)
		(instances
			(project "carrier"
				(path "/c546581a-7b71-4c20-b442-88ef38f8e5a8/00000000-0000-0000-0000-00005c095482"
					(reference "MP11")
					(unit 1)
				)
			)
		)
	)
	(symbol
		(lib_id "Mechanical:MountingHole")
		(at 210.82 43.18 0)
		(unit 1)
		(exclude_from_sim yes)
		(in_bom yes)
		(on_board no)
		(dnp yes)
		(fields_autoplaced yes)
		(uuid "d1ecc841-9172-46e1-ae21-acb80625018d")
		(property "Reference" "H11"
			(at 213.36 41.9099 0)
			(effects
				(font
					(size 1.27 1.27)
				)
				(justify left)
			)
		)
		(property "Value" "washer M2.5 0.5 mm thick"
			(at 213.36 44.4499 0)
			(effects
				(font
					(size 1.27 1.27)
				)
				(justify left)
			)
		)
		(property "Footprint" ""
			(at 210.82 43.18 0)
			(effects
				(font
					(size 1.27 1.27)
				)
				(hide yes)
			)
		)
		(property "Datasheet" "~"
			(at 210.82 43.18 0)
			(effects
				(font
					(size 1.27 1.27)
				)
				(hide yes)
			)
		)
		(property "Description" "Mounting Hole without connection"
			(at 210.82 43.18 0)
			(effects
				(font
					(size 1.27 1.27)
				)
				(hide yes)
			)
		)
		(instances
			(project "carrier"
				(path "/c546581a-7b71-4c20-b442-88ef38f8e5a8/00000000-0000-0000-0000-00005c095482"
					(reference "H11")
					(unit 1)
				)
			)
		)
	)
	(symbol
		(lib_id "HW:MNT_HOLE")
		(at 86.36 167.64 0)
		(unit 1)
		(exclude_from_sim no)
		(in_bom yes)
		(on_board yes)
		(dnp no)
		(fields_autoplaced yes)
		(uuid "d4152f1c-e509-4fb3-9b15-08adffcad586")
		(property "Reference" "MP17"
			(at 90.17 166.3699 0)
			(effects
				(font
					(size 1.27 1.27)
				)
				(justify left)
			)
		)
		(property "Value" "SMTSO-M3-3ET"
			(at 90.17 168.9099 0)
			(effects
				(font
					(size 1.27 1.27)
				)
				(justify left)
			)
		)
		(property "Footprint" "SMTSO-M3-2ET:PEM_SMTSO-M3-2ET"
			(at 86.36 167.64 0)
			(effects
				(font
					(size 1.27 1.27)
				)
				(hide yes)
			)
		)
		(property "Datasheet" ""
			(at 86.36 167.64 0)
			(effects
				(font
					(size 1.27 1.27)
				)
				(hide yes)
			)
		)
		(property "Description" ""
			(at 86.36 167.64 0)
			(effects
				(font
					(size 1.27 1.27)
				)
				(hide yes)
			)
		)
		(pin "1"
			(uuid "761f3d0f-11a7-46b0-b2f0-7c7db08dac7e")
		)
		(instances
			(project "carrier"
				(path "/c546581a-7b71-4c20-b442-88ef38f8e5a8/00000000-0000-0000-0000-00005c095482"
					(reference "MP17")
					(unit 1)
				)
			)
		)
	)
	(symbol
		(lib_id "ATCA_Connectors:MachineScrew")
		(at 127 104.14 0)
		(unit 1)
		(exclude_from_sim yes)
		(in_bom yes)
		(on_board no)
		(dnp yes)
		(uuid "e546d408-9ad6-423b-8079-2bf63140a8d0")
		(property "Reference" "MS11"
			(at 129.54 104.2578 0)
			(effects
				(font
					(size 1.27 1.27)
				)
				(justify left)
			)
		)
		(property "Value" "M2.5x4 flat head screw"
			(at 140.97 106.68 0)
			(effects
				(font
					(size 1.27 1.27)
				)
			)
		)
		(property "Footprint" ""
			(at 127 105.664 0)
			(effects
				(font
					(size 1.27 1.27)
				)
				(hide yes)
			)
		)
		(property "Datasheet" ""
			(at 127 105.664 0)
			(effects
				(font
					(size 1.27 1.27)
				)
				(hide yes)
			)
		)
		(property "Description" ""
			(at 127 104.14 0)
			(effects
				(font
					(size 1.27 1.27)
				)
				(hide yes)
			)
		)
		(instances
			(project "carrier"
				(path "/c546581a-7b71-4c20-b442-88ef38f8e5a8/00000000-0000-0000-0000-00005c095482"
					(reference "MS11")
					(unit 1)
				)
			)
		)
	)
	(symbol
		(lib_id "ATCA_Connectors:MachineScrew")
		(at 162.56 49.53 0)
		(unit 1)
		(exclude_from_sim yes)
		(in_bom yes)
		(on_board no)
		(dnp yes)
		(uuid "e99acf78-e2c2-404b-b488-936f18f558e0")
		(property "Reference" "MS21"
			(at 165.1 49.6478 0)
			(effects
				(font
					(size 1.27 1.27)
				)
				(justify left)
			)
		)
		(property "Value" "M2.5x6 pan head screw"
			(at 176.53 52.07 0)
			(effects
				(font
					(size 1.27 1.27)
				)
			)
		)
		(property "Footprint" ""
			(at 162.56 51.054 0)
			(effects
				(font
					(size 1.27 1.27)
				)
				(hide yes)
			)
		)
		(property "Datasheet" ""
			(at 162.56 51.054 0)
			(effects
				(font
					(size 1.27 1.27)
				)
				(hide yes)
			)
		)
		(property "Description" ""
			(at 162.56 49.53 0)
			(effects
				(font
					(size 1.27 1.27)
				)
				(hide yes)
			)
		)
		(instances
			(project "carrier"
				(path "/c546581a-7b71-4c20-b442-88ef38f8e5a8/00000000-0000-0000-0000-00005c095482"
					(reference "MS21")
					(unit 1)
				)
			)
		)
	)
	(symbol
		(lib_id "HW:MNT_HOLE")
		(at 86.36 160.02 0)
		(unit 1)
		(exclude_from_sim no)
		(in_bom yes)
		(on_board yes)
		(dnp no)
		(fields_autoplaced yes)
		(uuid "ed18343d-bdf8-479d-85c4-a8e1bd777cd4")
		(property "Reference" "MP16"
			(at 90.17 158.7499 0)
			(effects
				(font
					(size 1.27 1.27)
				)
				(justify left)
			)
		)
		(property "Value" "SMTSO-M3-3ET"
			(at 90.17 161.2899 0)
			(effects
				(font
					(size 1.27 1.27)
				)
				(justify left)
			)
		)
		(property "Footprint" "SMTSO-M3-2ET:PEM_SMTSO-M3-2ET"
			(at 86.36 160.02 0)
			(effects
				(font
					(size 1.27 1.27)
				)
				(hide yes)
			)
		)
		(property "Datasheet" ""
			(at 86.36 160.02 0)
			(effects
				(font
					(size 1.27 1.27)
				)
				(hide yes)
			)
		)
		(property "Description" ""
			(at 86.36 160.02 0)
			(effects
				(font
					(size 1.27 1.27)
				)
				(hide yes)
			)
		)
		(pin "1"
			(uuid "dfd0b95a-192f-4312-992e-786468f36b8b")
		)
		(instances
			(project "carrier"
				(path "/c546581a-7b71-4c20-b442-88ef38f8e5a8/00000000-0000-0000-0000-00005c095482"
					(reference "MP16")
					(unit 1)
				)
			)
		)
	)
	(symbol
		(lib_id "Mechanical:MountingHole")
		(at 210.82 97.79 0)
		(unit 1)
		(exclude_from_sim yes)
		(in_bom yes)
		(on_board no)
		(dnp yes)
		(fields_autoplaced yes)
		(uuid "f074f5a7-b60f-4fc1-9fd0-40d0085b9e95")
		(property "Reference" "H6"
			(at 213.36 96.5199 0)
			(effects
				(font
					(size 1.27 1.27)
				)
				(justify left)
			)
		)
		(property "Value" "washer M2.5 0.5 mm thick"
			(at 213.36 99.0599 0)
			(effects
				(font
					(size 1.27 1.27)
				)
				(justify left)
			)
		)
		(property "Footprint" ""
			(at 210.82 97.79 0)
			(effects
				(font
					(size 1.27 1.27)
				)
				(hide yes)
			)
		)
		(property "Datasheet" "~"
			(at 210.82 97.79 0)
			(effects
				(font
					(size 1.27 1.27)
				)
				(hide yes)
			)
		)
		(property "Description" "Mounting Hole without connection"
			(at 210.82 97.79 0)
			(effects
				(font
					(size 1.27 1.27)
				)
				(hide yes)
			)
		)
		(instances
			(project "carrier"
				(path "/c546581a-7b71-4c20-b442-88ef38f8e5a8/00000000-0000-0000-0000-00005c095482"
					(reference "H6")
					(unit 1)
				)
			)
		)
	)
	(symbol
		(lib_id "ATCA_Connectors:MachineScrew")
		(at 162.56 57.15 0)
		(unit 1)
		(exclude_from_sim yes)
		(in_bom yes)
		(on_board no)
		(dnp yes)
		(uuid "f5144517-f091-4248-a669-76073483abda")
		(property "Reference" "MS22"
			(at 165.1 57.2678 0)
			(effects
				(font
					(size 1.27 1.27)
				)
				(justify left)
			)
		)
		(property "Value" "M2.5x6 pan head screw"
			(at 176.53 59.69 0)
			(effects
				(font
					(size 1.27 1.27)
				)
			)
		)
		(property "Footprint" ""
			(at 162.56 58.674 0)
			(effects
				(font
					(size 1.27 1.27)
				)
				(hide yes)
			)
		)
		(property "Datasheet" ""
			(at 162.56 58.674 0)
			(effects
				(font
					(size 1.27 1.27)
				)
				(hide yes)
			)
		)
		(property "Description" ""
			(at 162.56 57.15 0)
			(effects
				(font
					(size 1.27 1.27)
				)
				(hide yes)
			)
		)
		(instances
			(project "carrier"
				(path "/c546581a-7b71-4c20-b442-88ef38f8e5a8/00000000-0000-0000-0000-00005c095482"
					(reference "MS22")
					(unit 1)
				)
			)
		)
	)
)
