(module PI3DBS16412ZHEX (layer F.Cu) (tedit 5EFE2EF3)
  (fp_text reference U215 (at 0 -6) (layer F.SilkS)
    (effects (font (size 1 1) (thickness 0.15)))
  )
  (fp_text value PI3DBS16412 (at 26.75382 -2.4003) (layer F.Fab)
    (effects (font (size 1 1) (thickness 0.15)))
  )
  (fp_circle (center -2.11836 -4.85648) (end -2.08788 -4.87934) (layer F.SilkS) (width 0.15))
  (fp_line (start -1.5 -4.5) (end -1.75 -4.25) (layer F.SilkS) (width 0.15))
  (fp_line (start -1.25 -4.5) (end -1.5 -4.5) (layer F.SilkS) (width 0.15))
  (fp_line (start -1.25 4.5) (end -1.75 4.5) (layer F.SilkS) (width 0.15))
  (fp_line (start 1.75 4.25) (end 1.75 4.5) (layer F.SilkS) (width 0.15))
  (fp_line (start -1.75 4.5) (end -1.75 4.25) (layer F.SilkS) (width 0.15))
  (fp_line (start 1.75 4.5) (end 1.25 4.5) (layer F.SilkS) (width 0.15))
  (fp_line (start 1.75 -4.5) (end 1.75 -4.25) (layer F.SilkS) (width 0.15))
  (fp_line (start 1.25 -4.5) (end 1.75 -4.5) (layer F.SilkS) (width 0.15))
  (pad ~ smd rect (at 0.36 -2.25) (size 0.5 1.5) (layers F.Paste))
  (pad ~ smd rect (at -0.36 -2.25) (size 0.5 1.5) (layers F.Paste))
  (pad ~ smd rect (at 0.36 0) (size 0.5 1.5) (layers F.Paste))
  (pad ~ smd rect (at -0.36 0) (size 0.5 1.5) (layers F.Paste))
  (pad ~ smd rect (at 0.36 2.25) (size 0.5 1.5) (layers F.Paste))
  (pad ~ smd rect (at -0.36 2.25) (size 0.5 1.5) (layers F.Paste))
  (pad PAD thru_hole circle (at 0.6 3.2) (size 0.4 0.4) (drill 0.3) (layers *.Cu *.Mask)
    (thermal_width 0.25654))
  (pad PAD thru_hole circle (at -0.6 3.2) (size 0.4 0.4) (drill 0.3) (layers *.Cu *.Mask)
    (thermal_width 0.25654))
  (pad PAD thru_hole circle (at 0.6 2.4) (size 0.4 0.4) (drill 0.3) (layers *.Cu *.Mask)
    (thermal_width 0.25654))
  (pad PAD thru_hole circle (at -0.6 2.4) (size 0.4 0.4) (drill 0.3) (layers *.Cu *.Mask)
    (thermal_width 0.25654))
  (pad PAD thru_hole circle (at 0.6 1.6) (size 0.4 0.4) (drill 0.3) (layers *.Cu *.Mask)
    (thermal_width 0.25654))
  (pad PAD thru_hole circle (at -0.6 1.6) (size 0.4 0.4) (drill 0.3) (layers *.Cu *.Mask)
    (thermal_width 0.25654))
  (pad PAD thru_hole circle (at 0.6 0.8) (size 0.4 0.4) (drill 0.3) (layers *.Cu *.Mask)
    (thermal_width 0.25654))
  (pad PAD thru_hole circle (at -0.6 0.8) (size 0.4 0.4) (drill 0.3) (layers *.Cu *.Mask)
    (thermal_width 0.25654))
  (pad PAD thru_hole circle (at 0.6 0) (size 0.4 0.4) (drill 0.3) (layers *.Cu *.Mask)
    (thermal_width 0.25654))
  (pad PAD thru_hole circle (at -0.6 0) (size 0.4 0.4) (drill 0.3) (layers *.Cu *.Mask)
    (thermal_width 0.25654))
  (pad PAD thru_hole circle (at 0.6 -0.8) (size 0.4 0.4) (drill 0.3) (layers *.Cu *.Mask)
    (thermal_width 0.25654))
  (pad PAD thru_hole circle (at -0.6 -0.8) (size 0.4 0.4) (drill 0.3) (layers *.Cu *.Mask)
    (thermal_width 0.25654))
  (pad PAD thru_hole circle (at 0.6 -1.6) (size 0.4 0.4) (drill 0.3) (layers *.Cu *.Mask)
    (thermal_width 0.25654))
  (pad PAD thru_hole circle (at -0.6 -1.6) (size 0.4 0.4) (drill 0.3) (layers *.Cu *.Mask)
    (thermal_width 0.25654))
  (pad PAD thru_hole circle (at 0.6 -2.4) (size 0.4 0.4) (drill 0.3) (layers *.Cu *.Mask)
    (thermal_width 0.25654))
  (pad PAD thru_hole circle (at -0.6 -2.4) (size 0.4 0.4) (drill 0.3) (layers *.Cu *.Mask)
    (thermal_width 0.25654))
  (pad PAD thru_hole circle (at 0.6 -3.2) (size 0.4 0.4) (drill 0.3) (layers *.Cu *.Mask)
    (thermal_width 0.25654))
  (pad PAD thru_hole circle (at -0.6 -3.2) (size 0.4 0.4) (drill 0.3) (layers *.Cu *.Mask)
    (thermal_width 0.25654))
  (pad PAD smd rect (at 0 0) (size 1.8 7) (layers F.Cu F.Mask))
  (pad 42 smd rect (at -0.75 -4.34) (size 0.28 0.63) (layers F.Cu F.Paste F.Mask))
  (pad 41 smd rect (at -0.25 -4.34) (size 0.28 0.63) (layers F.Cu F.Paste F.Mask))
  (pad 40 smd rect (at 0.25 -4.34) (size 0.28 0.63) (layers F.Cu F.Paste F.Mask))
  (pad 39 smd rect (at 0.75 -4.34) (size 0.28 0.63) (layers F.Cu F.Paste F.Mask))
  (pad 38 smd rect (at 1.509 -4) (size 0.63 0.28) (layers F.Cu F.Paste F.Mask))
  (pad 37 smd rect (at 1.509 -3.5) (size 0.63 0.28) (layers F.Cu F.Paste F.Mask))
  (pad 36 smd rect (at 1.509 -3) (size 0.63 0.28) (layers F.Cu F.Paste F.Mask))
  (pad 35 smd rect (at 1.509 -2.5) (size 0.63 0.28) (layers F.Cu F.Paste F.Mask))
  (pad 34 smd rect (at 1.509 -2) (size 0.63 0.28) (layers F.Cu F.Paste F.Mask))
  (pad 33 smd rect (at 1.509 -1.5) (size 0.63 0.28) (layers F.Cu F.Paste F.Mask))
  (pad 32 smd rect (at 1.509 -1) (size 0.63 0.28) (layers F.Cu F.Paste F.Mask))
  (pad 31 smd rect (at 1.509 -0.5) (size 0.63 0.28) (layers F.Cu F.Paste F.Mask))
  (pad 30 smd rect (at 1.509 0) (size 0.63 0.28) (layers F.Cu F.Paste F.Mask))
  (pad 29 smd rect (at 1.509 0.5) (size 0.63 0.28) (layers F.Cu F.Paste F.Mask))
  (pad 28 smd rect (at 1.509 1) (size 0.63 0.28) (layers F.Cu F.Paste F.Mask))
  (pad 27 smd rect (at 1.509 1.5) (size 0.63 0.28) (layers F.Cu F.Paste F.Mask))
  (pad 26 smd rect (at 1.509 2) (size 0.63 0.28) (layers F.Cu F.Paste F.Mask))
  (pad 25 smd rect (at 1.509 2.5) (size 0.63 0.28) (layers F.Cu F.Paste F.Mask))
  (pad 24 smd rect (at 1.509 3) (size 0.63 0.28) (layers F.Cu F.Paste F.Mask))
  (pad 23 smd rect (at 1.509 3.5) (size 0.63 0.28) (layers F.Cu F.Paste F.Mask))
  (pad 21 smd rect (at 0.75 4.34) (size 0.28 0.63) (layers F.Cu F.Paste F.Mask))
  (pad 20 smd rect (at 0.25 4.34) (size 0.28 0.63) (layers F.Cu F.Paste F.Mask))
  (pad 19 smd rect (at -0.25 4.34) (size 0.28 0.63) (layers F.Cu F.Paste F.Mask))
  (pad 18 smd rect (at -0.75 4.34) (size 0.28 0.63) (layers F.Cu F.Paste F.Mask))
  (pad 22 smd rect (at 1.509 4) (size 0.63 0.28) (layers F.Cu F.Paste F.Mask))
  (pad 17 smd rect (at -1.509 4) (size 0.63 0.28) (layers F.Cu F.Paste F.Mask))
  (pad 16 smd rect (at -1.509 3.5) (size 0.63 0.28) (layers F.Cu F.Paste F.Mask))
  (pad 15 smd rect (at -1.509 3) (size 0.63 0.28) (layers F.Cu F.Paste F.Mask))
  (pad 14 smd rect (at -1.509 2.5) (size 0.63 0.28) (layers F.Cu F.Paste F.Mask))
  (pad 13 smd rect (at -1.509 2) (size 0.63 0.28) (layers F.Cu F.Paste F.Mask))
  (pad 12 smd rect (at -1.509 1.5) (size 0.63 0.28) (layers F.Cu F.Paste F.Mask))
  (pad 11 smd rect (at -1.509 1) (size 0.63 0.28) (layers F.Cu F.Paste F.Mask))
  (pad 10 smd rect (at -1.509 0.5) (size 0.63 0.28) (layers F.Cu F.Paste F.Mask))
  (pad 9 smd rect (at -1.509 0) (size 0.63 0.28) (layers F.Cu F.Paste F.Mask))
  (pad 8 smd rect (at -1.509 -0.5) (size 0.63 0.28) (layers F.Cu F.Paste F.Mask))
  (pad 7 smd rect (at -1.509 -1) (size 0.63 0.28) (layers F.Cu F.Paste F.Mask))
  (pad 6 smd rect (at -1.509 -1.5) (size 0.63 0.28) (layers F.Cu F.Paste F.Mask))
  (pad 5 smd rect (at -1.509 -2) (size 0.63 0.28) (layers F.Cu F.Paste F.Mask))
  (pad 4 smd rect (at -1.509 -2.5) (size 0.63 0.28) (layers F.Cu F.Paste F.Mask))
  (pad 3 smd rect (at -1.509 -3) (size 0.63 0.28) (layers F.Cu F.Paste F.Mask))
  (pad 2 smd rect (at -1.509 -3.5) (size 0.63 0.28) (layers F.Cu F.Paste F.Mask))
  (pad 1 smd rect (at -1.509 -4) (size 0.63 0.28) (layers F.Cu F.Paste F.Mask))
  (model ${KIPRJMOD}/mod/PI3DBS16412ZHEX.pretty/mod_3D/PI3DBS16412ZHEX.step
    (offset (xyz -1.785 4.5 0.02))
    (scale (xyz 1 1 1))
    (rotate (xyz 0 0 90))
  )
)
