(kicad_symbol_lib (version 20220914) (generator kicad_symbol_editor)
  (symbol "M24512-DFDW6TP" (pin_names (offset 1.016)) (in_bom yes) (on_board yes)
    (property "Reference" "U" (at 16.51 -13.97 0)
      (effects (font (size 1.27 1.27)))
    )
    (property "Value" "M24512-DFDW6TP" (at -21.59 -10.16 0)
      (effects (font (size 1.27 1.27)))
    )
    (property "Footprint" "" (at 0 0 0)
      (effects (font (size 1.27 1.27)) hide)
    )
    (property "Datasheet" "" (at 0 0 0)
      (effects (font (size 1.27 1.27)) hide)
    )
    (symbol "M24512-DFDW6TP_0_1"
      (rectangle (start -6.35 8.89) (end 6.35 -8.89)
        (stroke (width 0) (type solid))
        (fill (type none))
      )
    )
    (symbol "M24512-DFDW6TP_1_1"
      (pin input line (at -10.16 -5.08 0) (length 3.81)
        (name "A0" (effects (font (size 1.27 1.27))))
        (number "1" (effects (font (size 1.27 1.27))))
      )
      (pin input line (at -10.16 -2.54 0) (length 3.81)
        (name "A1" (effects (font (size 1.27 1.27))))
        (number "2" (effects (font (size 1.27 1.27))))
      )
      (pin input line (at -10.16 0 0) (length 3.81)
        (name "A2" (effects (font (size 1.27 1.27))))
        (number "3" (effects (font (size 1.27 1.27))))
      )
      (pin power_in line (at 0 -12.7 90) (length 3.81)
        (name "GND" (effects (font (size 1.27 1.27))))
        (number "4" (effects (font (size 1.27 1.27))))
      )
      (pin bidirectional line (at 10.16 2.54 180) (length 3.81)
        (name "SDA" (effects (font (size 1.27 1.27))))
        (number "5" (effects (font (size 1.27 1.27))))
      )
      (pin bidirectional line (at 10.16 5.08 180) (length 3.81)
        (name "SCL" (effects (font (size 1.27 1.27))))
        (number "6" (effects (font (size 1.27 1.27))))
      )
      (pin input inverted (at -10.16 5.08 0) (length 3.81)
        (name "WE" (effects (font (size 1.27 1.27))))
        (number "7" (effects (font (size 1.27 1.27))))
      )
      (pin power_in line (at 0 12.7 270) (length 3.81)
        (name "VCC" (effects (font (size 1.27 1.27))))
        (number "8" (effects (font (size 1.27 1.27))))
      )
    )
  )
)
