(module QFN50P500X500X100-33N (layer F.Cu) (tedit 5EB494F9)
  (fp_text reference REF** (at -0.135 -4.74) (layer F.SilkS)
    (effects (font (size 1 1) (thickness 0.015)))
  )
  (fp_text value QFN50P500X500X100-33N (at 10.025 4.74) (layer F.Fab)
    (effects (font (size 1 1) (thickness 0.015)))
  )
  (fp_poly (pts (xy -1.6002 -1.6002) (xy -0.254 -1.6002) (xy -0.254 -0.254) (xy -1.6002 -0.254)) (layer F.Paste) (width 0.01))
  (fp_circle (center -3.46 -1.75) (end -3.36 -1.75) (layer F.SilkS) (width 0.2))
  (fp_circle (center -3.46 -1.75) (end -3.36 -1.75) (layer F.Fab) (width 0.2))
  (fp_line (start 2.5 2.5) (end -2.5 2.5) (layer F.Fab) (width 0.127))
  (fp_line (start 2.5 -2.5) (end -2.5 -2.5) (layer F.Fab) (width 0.127))
  (fp_line (start 2.5 2.5) (end 2.5 -2.5) (layer F.Fab) (width 0.127))
  (fp_line (start -2.5 2.5) (end -2.5 -2.5) (layer F.Fab) (width 0.127))
  (fp_line (start 2.5 2.5) (end 2.2 2.5) (layer F.SilkS) (width 0.127))
  (fp_line (start 2.5 -2.5) (end 2.2 -2.5) (layer F.SilkS) (width 0.127))
  (fp_line (start -2.5 2.5) (end -2.2 2.5) (layer F.SilkS) (width 0.127))
  (fp_line (start -2.5 -2.5) (end -2.2 -2.5) (layer F.SilkS) (width 0.127))
  (fp_line (start 2.5 2.5) (end 2.5 2.2) (layer F.SilkS) (width 0.127))
  (fp_line (start 2.5 -2.5) (end 2.5 -2.2) (layer F.SilkS) (width 0.127))
  (fp_line (start -2.5 2.5) (end -2.5 2.2) (layer F.SilkS) (width 0.127))
  (fp_line (start -2.5 -2.5) (end -2.5 -2.2) (layer F.SilkS) (width 0.127))
  (fp_line (start -3.105 3.105) (end 3.105 3.105) (layer F.CrtYd) (width 0.05))
  (fp_line (start -3.105 -3.105) (end 3.105 -3.105) (layer F.CrtYd) (width 0.05))
  (fp_line (start -3.105 3.105) (end -3.105 -3.105) (layer F.CrtYd) (width 0.05))
  (fp_line (start 3.105 3.105) (end 3.105 -3.105) (layer F.CrtYd) (width 0.05))
  (fp_poly (pts (xy 0.254 -1.6002) (xy 1.6002 -1.6002) (xy 1.6002 -0.254) (xy 0.254 -0.254)) (layer F.Paste) (width 0.01))
  (fp_poly (pts (xy -1.6002 0.254) (xy -0.254 0.254) (xy -0.254 1.6002) (xy -1.6002 1.6002)) (layer F.Paste) (width 0.01))
  (fp_poly (pts (xy 0.254 0.254) (xy 1.6002 0.254) (xy 1.6002 1.6002) (xy 0.254 1.6002)) (layer F.Paste) (width 0.01))
  (pad 9 smd rect (at -1.75 2.45) (size 0.26 0.81) (layers F.Cu F.Paste F.Mask))
  (pad 10 smd rect (at -1.25 2.45) (size 0.26 0.81) (layers F.Cu F.Paste F.Mask))
  (pad 11 smd rect (at -0.75 2.45) (size 0.26 0.81) (layers F.Cu F.Paste F.Mask))
  (pad 12 smd rect (at -0.25 2.45) (size 0.26 0.81) (layers F.Cu F.Paste F.Mask))
  (pad 13 smd rect (at 0.25 2.45) (size 0.26 0.81) (layers F.Cu F.Paste F.Mask))
  (pad 14 smd rect (at 0.75 2.45) (size 0.26 0.81) (layers F.Cu F.Paste F.Mask))
  (pad 15 smd rect (at 1.25 2.45) (size 0.26 0.81) (layers F.Cu F.Paste F.Mask))
  (pad 16 smd rect (at 1.75 2.45) (size 0.26 0.81) (layers F.Cu F.Paste F.Mask))
  (pad 25 smd rect (at 1.75 -2.45) (size 0.26 0.81) (layers F.Cu F.Paste F.Mask))
  (pad 26 smd rect (at 1.25 -2.45) (size 0.26 0.81) (layers F.Cu F.Paste F.Mask))
  (pad 27 smd rect (at 0.75 -2.45) (size 0.26 0.81) (layers F.Cu F.Paste F.Mask))
  (pad 28 smd rect (at 0.25 -2.45) (size 0.26 0.81) (layers F.Cu F.Paste F.Mask))
  (pad 29 smd rect (at -0.25 -2.45) (size 0.26 0.81) (layers F.Cu F.Paste F.Mask))
  (pad 30 smd rect (at -0.75 -2.45) (size 0.26 0.81) (layers F.Cu F.Paste F.Mask))
  (pad 31 smd rect (at -1.25 -2.45) (size 0.26 0.81) (layers F.Cu F.Paste F.Mask))
  (pad 32 smd rect (at -1.75 -2.45) (size 0.26 0.81) (layers F.Cu F.Paste F.Mask))
  (pad 1 smd rect (at -2.45 -1.75) (size 0.81 0.26) (layers F.Cu F.Paste F.Mask))
  (pad 2 smd rect (at -2.45 -1.25) (size 0.81 0.26) (layers F.Cu F.Paste F.Mask))
  (pad 3 smd rect (at -2.45 -0.75) (size 0.81 0.26) (layers F.Cu F.Paste F.Mask))
  (pad 4 smd rect (at -2.45 -0.25) (size 0.81 0.26) (layers F.Cu F.Paste F.Mask))
  (pad 5 smd rect (at -2.45 0.25) (size 0.81 0.26) (layers F.Cu F.Paste F.Mask))
  (pad 6 smd rect (at -2.45 0.75) (size 0.81 0.26) (layers F.Cu F.Paste F.Mask))
  (pad 7 smd rect (at -2.45 1.25) (size 0.81 0.26) (layers F.Cu F.Paste F.Mask))
  (pad 8 smd rect (at -2.45 1.75) (size 0.81 0.26) (layers F.Cu F.Paste F.Mask))
  (pad 17 smd rect (at 2.45 1.75) (size 0.81 0.26) (layers F.Cu F.Paste F.Mask))
  (pad 18 smd rect (at 2.45 1.25) (size 0.81 0.26) (layers F.Cu F.Paste F.Mask))
  (pad 19 smd rect (at 2.45 0.75) (size 0.81 0.26) (layers F.Cu F.Paste F.Mask))
  (pad 20 smd rect (at 2.45 0.25) (size 0.81 0.26) (layers F.Cu F.Paste F.Mask))
  (pad 21 smd rect (at 2.45 -0.25) (size 0.81 0.26) (layers F.Cu F.Paste F.Mask))
  (pad 22 smd rect (at 2.45 -0.75) (size 0.81 0.26) (layers F.Cu F.Paste F.Mask))
  (pad 23 smd rect (at 2.45 -1.25) (size 0.81 0.26) (layers F.Cu F.Paste F.Mask))
  (pad 24 smd rect (at 2.45 -1.75) (size 0.81 0.26) (layers F.Cu F.Paste F.Mask))
  (pad PAD smd rect (at 0 0) (size 3.7 3.7) (layers F.Cu F.Mask))
  (model "${KIPRJMOD}/mod/ADN2814ACPZ.pretty/mod_3D/NA__MO-220-VHHD-4__ANALOG DEVICES__LFCSP-32__HMC1169--3DModel-Eagle-1.STEP"
    (at (xyz 0 0 0))
    (scale (xyz 1 1 1))
    (rotate (xyz 0 0 0))
  )
)
