(module ET60T-D02-3-08-000-L-R1-S (layer F.Cu) (tedit 5C17DEE9)
  (fp_text reference REF** (at 0.23 -6.95) (layer F.SilkS)
    (effects (font (size 1 1) (thickness 0.15)))
  )
  (fp_text value ET60T-D02-3-08-000-L-R1-S (at 28.61 6.02) (layer F.Fab)
    (effects (font (size 1 1) (thickness 0.15)))
  )
  (fp_line (start -3.32 -5.6) (end 46.44 -5.6) (layer F.SilkS) (width 0.15))
  (fp_line (start 46.44 -5.6) (end 46.44 9.4) (layer F.SilkS) (width 0.15))
  (fp_line (start 46.44 9.4) (end 42.76 23.65) (layer F.SilkS) (width 0.15))
  (fp_line (start 0 23.65) (end 42.76 23.65) (layer F.SilkS) (width 0.15))
  (fp_line (start 0 23.65) (end -3.32 9.4) (layer F.SilkS) (width 0.15))
  (fp_line (start -3.32 9.4) (end -3.32 -5.6) (layer F.SilkS) (width 0.15))
  (fp_line (start -3.32 7.9) (end 46.44 7.9) (layer F.SilkS) (width 0.15))
  (pad "" np_thru_hole circle (at 0 0) (size 3.2 3.2) (drill 3.2) (layers *.Cu *.Mask))
  (pad P1-1 thru_hole circle (at 5.5 5) (size 2 2) (drill 1.02) (layers *.Cu *.Mask))
  (pad P1-2 thru_hole circle (at 8.5 5) (size 2 2) (drill 1.02) (layers *.Cu *.Mask))
  (pad P1-3 thru_hole circle (at 5.5 2.5) (size 2 2) (drill 1.02) (layers *.Cu *.Mask))
  (pad P1-4 thru_hole circle (at 8.5 2.5) (size 2 2) (drill 1.02) (layers *.Cu *.Mask))
  (pad P1-5 thru_hole circle (at 5.5 0) (size 2 2) (drill 1.02) (layers *.Cu *.Mask))
  (pad P1-6 thru_hole circle (at 8.5 0) (size 2 2) (drill 1.02) (layers *.Cu *.Mask))
  (pad P1-7 thru_hole circle (at 5.5 -2.5) (size 2 2) (drill 1.02) (layers *.Cu *.Mask))
  (pad P1-8 thru_hole circle (at 8.5 -2.5) (size 2 2) (drill 1.02) (layers *.Cu *.Mask))
  (pad 9 thru_hole circle (at 5.5 -5) (size 2 2) (drill 1.02) (layers *.Cu *.Mask))
  (pad 10 thru_hole circle (at 8.5 -5) (size 2 2) (drill 1.02) (layers *.Cu *.Mask))
  (pad P2-1 thru_hole circle (at 11 5) (size 2 2) (drill 1.02) (layers *.Cu *.Mask))
  (pad P2-2 thru_hole circle (at 14 5) (size 2 2) (drill 1.02) (layers *.Cu *.Mask))
  (pad P2-3 thru_hole circle (at 11 2.5) (size 2 2) (drill 1.02) (layers *.Cu *.Mask))
  (pad P2-4 thru_hole circle (at 14 2.5) (size 2 2) (drill 1.02) (layers *.Cu *.Mask))
  (pad P2-5 thru_hole circle (at 11 0) (size 2 2) (drill 1.02) (layers *.Cu *.Mask))
  (pad P2-6 thru_hole circle (at 14 0) (size 2 2) (drill 1.02) (layers *.Cu *.Mask))
  (pad P2-7 thru_hole circle (at 11 -2.5) (size 2 2) (drill 1.02) (layers *.Cu *.Mask))
  (pad P2-8 thru_hole circle (at 14 -2.5) (size 2 2) (drill 1.02) (layers *.Cu *.Mask))
  (pad 9 thru_hole circle (at 11 -5) (size 2 2) (drill 1.02) (layers *.Cu *.Mask))
  (pad 10 thru_hole circle (at 14 -5) (size 2 2) (drill 1.02) (layers *.Cu *.Mask))
  (pad A1 thru_hole circle (at 19.17 3.5) (size 2 2) (drill 1.02) (layers *.Cu *.Mask))
  (pad B1 thru_hole circle (at 19.17 0.96) (size 2 2) (drill 1.02) (layers *.Cu *.Mask))
  (pad C1 thru_hole circle (at 19.17 -1.58) (size 2 2) (drill 1.02) (layers *.Cu *.Mask))
  (pad A2 thru_hole circle (at 21.71 3.5) (size 2 2) (drill 1.02) (layers *.Cu *.Mask))
  (pad B2 thru_hole circle (at 21.71 0.96) (size 2 2) (drill 1.02) (layers *.Cu *.Mask))
  (pad C2 thru_hole circle (at 21.71 -1.58) (size 2 2) (drill 1.02) (layers *.Cu *.Mask))
  (pad A3 thru_hole circle (at 24.25 3.5) (size 2 2) (drill 1.02) (layers *.Cu *.Mask))
  (pad B3 thru_hole circle (at 24.25 0.96) (size 2 2) (drill 1.02) (layers *.Cu *.Mask))
  (pad C3 thru_hole circle (at 24.25 -1.58) (size 2 2) (drill 1.02) (layers *.Cu *.Mask))
  (pad A4 thru_hole circle (at 26.79 3.5) (size 2 2) (drill 1.02) (layers *.Cu *.Mask))
  (pad B4 thru_hole circle (at 26.79 0.96) (size 2 2) (drill 1.02) (layers *.Cu *.Mask))
  (pad C4 thru_hole circle (at 26.79 -1.58) (size 2 2) (drill 1.02) (layers *.Cu *.Mask))
  (pad A5 thru_hole circle (at 29.33 3.5) (size 2 2) (drill 1.02) (layers *.Cu *.Mask))
  (pad B5 thru_hole circle (at 29.33 0.96) (size 2 2) (drill 1.02) (layers *.Cu *.Mask))
  (pad C5 thru_hole circle (at 29.33 -1.58) (size 2 2) (drill 1.02) (layers *.Cu *.Mask))
  (pad A6 thru_hole circle (at 31.87 3.5) (size 2 2) (drill 1.02) (layers *.Cu *.Mask))
  (pad B6 thru_hole circle (at 31.87 0.96) (size 2 2) (drill 1.02) (layers *.Cu *.Mask))
  (pad C6 thru_hole circle (at 31.87 -1.58) (size 2 2) (drill 1.02) (layers *.Cu *.Mask))
  (pad A7 thru_hole circle (at 34.41 3.5) (size 2 2) (drill 1.02) (layers *.Cu *.Mask))
  (pad B7 thru_hole circle (at 34.41 0.96) (size 2 2) (drill 1.02) (layers *.Cu *.Mask))
  (pad C7 thru_hole circle (at 34.41 -1.58) (size 2 2) (drill 1.02) (layers *.Cu *.Mask))
  (pad A8 thru_hole circle (at 36.95 3.5) (size 2 2) (drill 1.02) (layers *.Cu *.Mask))
  (pad B8 thru_hole circle (at 36.95 0.96) (size 2 2) (drill 1.02) (layers *.Cu *.Mask))
  (pad C8 thru_hole circle (at 36.95 -1.58) (size 2 2) (drill 1.02) (layers *.Cu *.Mask))
  (pad "" np_thru_hole circle (at 42.76 0) (size 3.2 3.2) (drill 3.2) (layers *.Cu *.Mask))
  (model ${KIPRJMOD}/mod/Samtec.pretty/mod_3D/ET60T-D02-3-08-000-L-R1-S.stp
    (offset (xyz 28.05 5.6 5.05))
    (scale (xyz 1 1 1))
    (rotate (xyz 180 0 0))
  )
)
