(module 81-301-00 (layer F.Cu) (tedit 5E861314)
  (fp_text reference REF** (at -2.25 2.25) (layer F.SilkS)
    (effects (font (size 1 1) (thickness 0.15)))
  )
  (fp_text value 81-301-00 (at 0 -2) (layer F.Fab)
    (effects (font (size 1 1) (thickness 0.15)))
  )
  (fp_circle (center 0 0) (end 1.25 0) (layer F.SilkS) (width 0.15))
  (model ${KIPRJMOD}/mod/ATCA.pretty/mod_3D/81-301-00-3D-STEP.stp
    (offset (xyz -6.1 -32.25 -104))
    (scale (xyz 1 1 1))
    (rotate (xyz 0 90 0))
  )
)
