G04 #@! TF.GenerationSoftware,KiCad,Pcbnew,7.0.8*
G04 #@! TF.CreationDate,2024-03-01T18:25:40-05:00*
G04 #@! TF.ProjectId,carrier,63617272-6965-4722-9e6b-696361645f70,rev?*
G04 #@! TF.SameCoordinates,PX795bdf0PY16b59940*
G04 #@! TF.FileFunction,Other,User*
%FSLAX46Y46*%
G04 Gerber Fmt 4.6, Leading zero omitted, Abs format (unit mm)*
G04 Created by KiCad (PCBNEW 7.0.8) date 2024-03-01 18:25:40*
%MOMM*%
%LPD*%
G01*
G04 APERTURE LIST*
%ADD10C,0.100000*%
G04 #@! TA.AperFunction,Profile*
%ADD11C,0.152400*%
G04 #@! TD*
G04 APERTURE END LIST*
D10*
X257286050Y66040000D02*
G75*
G03*
X257286050Y66040000I-1000050J0D01*
G01*
X269351050Y293243000D02*
G75*
G03*
X269351050Y293243000I-1000050J0D01*
G01*
X184896050Y8382000D02*
G75*
G03*
X184896050Y8382000I-1000050J0D01*
G01*
X185912050Y161702000D02*
G75*
G03*
X185912050Y161702000I-1000050J0D01*
G01*
X269478050Y171196000D02*
G75*
G03*
X269478050Y171196000I-1000050J0D01*
G01*
X141716050Y5080000D02*
G75*
G03*
X141716050Y5080000I-1000050J0D01*
G01*
X51546050Y5080000D02*
G75*
G03*
X51546050Y5080000I-1000050J0D01*
G01*
X181594050Y285242000D02*
G75*
G03*
X181594050Y285242000I-1000050J0D01*
G01*
X141716050Y307975000D02*
G75*
G03*
X141716050Y307975000I-1000050J0D01*
G01*
X51546050Y307975000D02*
G75*
G03*
X51546050Y307975000I-1000050J0D01*
G01*
D11*
X276430000Y-4748000D02*
X276430000Y207000000D01*
X-3570000Y-5450000D02*
X275628000Y-5450000D01*
X176700000Y116142000D02*
X176700000Y205028000D01*
X176700000Y294745000D02*
X-3570000Y294745000D01*
X188180000Y205028000D02*
X188180000Y255047000D01*
X188180000Y255047000D02*
X176700000Y255047000D01*
X176700000Y205028000D02*
X188180000Y205028000D01*
X276430000Y207000000D02*
X285420000Y207000000D01*
X276430000Y289100000D02*
X276430000Y315898000D01*
X276430000Y315898000D02*
X275628000Y316550000D01*
X176700000Y16405000D02*
X-3570000Y16405000D01*
X275628000Y-5450000D02*
X276430000Y-4748000D01*
X-3570000Y316550000D02*
X275628000Y316550000D01*
X176700000Y16405000D02*
X176700000Y66123000D01*
X285420000Y289100000D02*
X285420000Y207000000D01*
X176700000Y66123000D02*
X176700000Y116142000D01*
X-3570000Y294745000D02*
X-3570000Y316550000D01*
X-3570000Y-5450000D02*
X-3570000Y16405000D01*
X176700000Y255047000D02*
X176700000Y294745000D01*
X276430000Y289100000D02*
X285420000Y289100000D01*
M02*
