{
    "id": 3,
    "gridPos": {
      "h": 9,
      "w": 10,
      "x": 0,
      "y": 5
    },
    "type": "graph",
    "title": "Schroff Fan Tray Temperatures",
    "alert": {
      "alertRuleTags": {},
      "conditions": [
        {
          "evaluator": {
            "params": [
              45
            ],
            "type": "gt"
          },
          "operator": {
            "type": "and"
          },
          "query": {
            "params": [
              "A",
              "5m",
              "now"
            ]
          },
          "reducer": {
            "params": [],
            "type": "max"
          },
          "type": "query"
        }
      ],
      "executionErrorState": "alerting",
      "for": "0m",
      "frequency": "30s",
      "handler": 1,
      "message": "Schroff over temp",
      "name": "Schroff Fan Tray Temperatures alert",
      "noDataState": "no_data",
      "notifications": [
        {
          "uid": "h_lQ1km7z"
        }
      ]
    },
    "datasource": {
      "type": "graphite",
      "uid": "000000002"
    },
    "thresholds": [
      {
        "colorMode": "critical",
        "fill": true,
        "line": true,
        "op": "gt",
        "value": 45,
        "yaxis": "left"
      }
    ],
    "pluginVersion": "9.2.4",
    "legend": {
      "alignAsTable": false,
      "avg": false,
      "current": false,
      "max": false,
      "min": false,
      "rightSide": false,
      "show": true,
      "sideWidth": 100,
      "total": false,
      "values": false
    },
    "aliasColors": {},
    "bars": false,
    "dashLength": 10,
    "dashes": false,
    "fieldConfig": {
      "defaults": {
        "links": []
      },
      "overrides": []
    },
    "fill": 1,
    "fillGradient": 0,
    "hiddenSeries": false,
    "lines": true,
    "linewidth": 1,
    "nullPointMode": "null",
    "options": {
      "alertThreshold": true
    },
    "percentage": false,
    "pointradius": 2,
    "points": false,
    "renderer": "flot",
    "seriesOverrides": [],
    "spaceLength": 10,
    "stack": false,
    "steppedLine": false,
    "targets": [
      {
        "datasource": {
          "type": "graphite",
          "uid": "000000002"
        },
        "refCount": 0,
        "refId": "A",
        "target": "aliasByNode(Shelf.SCHROFF.TEMP.*, 3)",
        "textEditor": false
      }
    ],
    "timeRegions": [],
    "tooltip": {
      "shared": true,
      "sort": 0,
      "value_type": "individual"
    },
    "xaxis": {
      "mode": "time",
      "show": true,
      "values": [],
      "name": null,
      "buckets": null
    },
    "yaxes": [
      {
        "$$hashKey": "object:297",
        "format": "celsius",
        "logBase": 1,
        "show": true
      },
      {
        "$$hashKey": "object:298",
        "format": "short",
        "logBase": 1,
        "show": true
      }
    ],
    "yaxis": {
      "align": false
    },
    "timeFrom": null,
    "timeShift": null
  }