{
    "id": 5,
    "gridPos": {
      "h": 8,
      "w": 10,
      "x": 10,
      "y": 18
    },
    "type": "graph",
    "title": "Comtel Fan Speeds",
    "alert": {
      "alertRuleTags": {},
      "conditions": [
        {
          "evaluator": {
            "params": [
              95
            ],
            "type": "gt"
          },
          "operator": {
            "type": "and"
          },
          "query": {
            "params": [
              "A",
              "5m",
              "now"
            ]
          },
          "reducer": {
            "params": [],
            "type": "avg"
          },
          "type": "query"
        }
      ],
      "executionErrorState": "alerting",
      "for": "5m",
      "frequency": "1m",
      "handler": 1,
      "name": "Comtel Fan Speeds alert",
      "noDataState": "no_data",
      "notifications": [
        {
          "uid": "h_lQ1km7z"
        }
      ]
    },
    "datasource": {
      "type": "graphite",
      "uid": "000000002"
    },
    "thresholds": [
      {
        "colorMode": "critical",
        "fill": true,
        "line": true,
        "op": "gt",
        "value": 95
      }
    ],
    "pluginVersion": "9.2.4",
    "legend": {
      "alignAsTable": false,
      "avg": false,
      "current": false,
      "max": false,
      "min": false,
      "rightSide": false,
      "show": true,
      "sideWidth": 100,
      "total": false,
      "values": false
    },
    "aliasColors": {},
    "annotate": {
      "enable": false
    },
    "dashLength": 10,
    "editable": true,
    "fieldConfig": {
      "defaults": {
        "links": []
      },
      "overrides": []
    },
    "fill": 1,
    "grid": {
      "min": 0
    },
    "lines": true,
    "linewidth": 1,
    "nullPointMode": "null",
    "options": {
      "alertThreshold": true
    },
    "pointradius": 5,
    "renderer": "flot",
    "resolution": 100,
    "scale": 1,
    "seriesOverrides": [],
    "spaceLength": 10,
    "targets": [
      {
        "datasource": {
          "type": "graphite",
          "uid": "000000002"
        },
        "refCount": 0,
        "refId": "A",
        "target": "aliasByNode(Shelf.COMTEL.SPEED.*, 3)"
      }
    ],
    "timeRegions": [],
    "tooltip": {
      "query_as_alias": true,
      "shared": false,
      "sort": 0,
      "value_type": "cumulative"
    },
    "xaxis": {
      "mode": "time",
      "show": true,
      "values": [],
      "name": null,
      "buckets": null
    },
    "yaxes": [
      {
        "$$hashKey": "object:413",
        "format": "percent",
        "logBase": 1,
        "show": true
      },
      {
        "$$hashKey": "object:414",
        "format": "short",
        "logBase": 1,
        "show": true
      }
    ],
    "yaxis": {
      "align": false
    },
    "zerofill": true,
    "bars": false,
    "dashes": false,
    "fillGradient": 0,
    "hiddenSeries": false,
    "loadingEditor": false,
    "percentage": false,
    "points": false,
    "stack": false,
    "steppedLine": false,
    "timeFrom": null,
    "timeShift": null
  }