<?xml version="1.0"?>
<robot xmlns:xacro="http://www.ros.org/wiki/xacro" name="raven">
  <xacro:property name="PI" value="3.1415926535897931"/>

  <!-- Plugin for setting tilt position -->
  <gazebo>
    <plugin name="tilt_plugin" filename="libtilt_plugin.so">
      <initial_position> -0.3 </initial_position>
      <rotation_rate> 0.5 </rotation_rate>
      <controlled_joint> tilt_joint </controlled_joint>
    </plugin>
  </gazebo>

  <!-- Publish joint state messages corresponding to tilt joint -->
  <gazebo>
    <plugin name="gazebo_ros_control" filename="libgazebo_ros_control.so">
      <robotNamespace>raven</robotNamespace>
    </plugin>
  </gazebo>


  <!-- Plugin for reporting state information (tf + odom for robot's position)
       * link must match to a ENU frame in the URDF.
       * gazebo_frame will be the world frame used by gazebo (ENU)
       * publish_frame will be the child of the gazebo frame (also ENU). -->
  <gazebo>
    <plugin name="oracle_plugin" filename="liboracle_plugin.so">
      <world_frame>world_gazebo</world_frame>
      <odom_frame>world</odom_frame>
      <vehicle_frame>raven/base_link</vehicle_frame>
      <updateRate>10.0</updateRate>
    </plugin>
  </gazebo>

 <!-- Specify material properties for any links without Collada meshes -->
  <gazebo reference="raven/base_link">
    <material>Gazebo/Orange</material>
  </gazebo>

  <gazebo reference="raven/sensor_head">
    <material>Gazebo/Orange</material>
  </gazebo>

  <!-- Gazebo will lump together all fixed joints by default. This is a

      problem given that I want plugins to refer to indiv links.
  -->
  <!-- Not currently using ned joint, but may need to in future. -->
  <!--
  <gazebo reference="ned_joint">
    <disableFixedJointLumping>true</disableFixedJointLumping>
  </gazebo>
  -->
  <gazebo reference="stereo_left_joint">
    <disableFixedJointLumping>true</disableFixedJointLumping>
  </gazebo>
  <gazebo reference="stereo_right_joint">
    <disableFixedJointLumping>true</disableFixedJointLumping>
  </gazebo>
  <gazebo reference="oculus_joint">
    <disableFixedJointLumping>true</disableFixedJointLumping>
  </gazebo>
  <gazebo reference="imu_joint">
    <disableFixedJointLumping>true</disableFixedJointLumping>
  </gazebo>

  <!-- Adding this caused seg faults in an earlier iteration, regardless
       of whether the DVL plugin as enabled. Seems OK now? -->
  <gazebo reference="dvl_joint">
    <disableFixedJointLumping>true</disableFixedJointLumping>
  </gazebo>



</robot>
