<?xml version="1.0" encoding="UTF-8"?>
<!-- Do not edit this file with editors other than draw.io -->
<!DOCTYPE svg PUBLIC "-//W3C//DTD SVG 1.1//EN" "http://www.w3.org/Graphics/SVG/1.1/DTD/svg11.dtd">
<svg xmlns="http://www.w3.org/2000/svg" xmlns:xlink="http://www.w3.org/1999/xlink" version="1.1" width="929px" height="768px" viewBox="-0.5 -0.5 929 768" content="&lt;mxfile host=&quot;Electron&quot; modified=&quot;2024-03-21T18:28:06.375Z&quot; agent=&quot;Mozilla/5.0 (Macintosh; Intel Mac OS X 10_15_7) AppleWebKit/537.36 (KHTML, like Gecko) draw.io/24.0.4 Chrome/120.0.6099.109 Electron/28.1.0 Safari/537.36&quot; etag=&quot;UXsOogf6YC3NIiV21ZAi&quot; version=&quot;24.0.4&quot; type=&quot;device&quot;&gt;&#10;  &lt;diagram id=&quot;C5RBs43oDa-KdzZeNtuy&quot; name=&quot;Page-1&quot;&gt;&#10;    &lt;mxGraphModel dx=&quot;891&quot; dy=&quot;1968&quot; grid=&quot;1&quot; gridSize=&quot;10&quot; guides=&quot;1&quot; tooltips=&quot;1&quot; connect=&quot;1&quot; arrows=&quot;1&quot; fold=&quot;1&quot; page=&quot;1&quot; pageScale=&quot;1&quot; pageWidth=&quot;827&quot; pageHeight=&quot;1169&quot; math=&quot;0&quot; shadow=&quot;0&quot;&gt;&#10;      &lt;root&gt;&#10;        &lt;mxCell id=&quot;WIyWlLk6GJQsqaUBKTNV-0&quot; /&gt;&#10;        &lt;mxCell id=&quot;WIyWlLk6GJQsqaUBKTNV-1&quot; parent=&quot;WIyWlLk6GJQsqaUBKTNV-0&quot; /&gt;&#10;        &lt;mxCell id=&quot;JE-gUsl_tAw7CFqOJm1K-4&quot; value=&quot;&amp;lt;u style=&amp;quot;font-size: 13px;&amp;quot;&amp;gt;stereo_image_proc.launch&amp;lt;/u&amp;gt;&quot; style=&quot;rounded=1;whiteSpace=wrap;html=1;align=left;verticalAlign=top;fillColor=#1ba1e2;fontColor=#ffffff;strokeColor=#006EAF;fontSize=13;fontFamily=Courier New;&quot; vertex=&quot;1&quot; parent=&quot;WIyWlLk6GJQsqaUBKTNV-1&quot;&gt;&#10;          &lt;mxGeometry x=&quot;42.5&quot; y=&quot;480&quot; width=&quot;400&quot; height=&quot;120&quot; as=&quot;geometry&quot; /&gt;&#10;        &lt;/mxCell&gt;&#10;        &lt;mxCell id=&quot;JE-gUsl_tAw7CFqOJm1K-5&quot; value=&quot;&amp;lt;u style=&amp;quot;font-size: 13px;&amp;quot;&amp;gt;gpu_stereo_image_proc.launch&amp;lt;/u&amp;gt;&quot; style=&quot;rounded=1;whiteSpace=wrap;html=1;align=left;verticalAlign=top;fillColor=#1ba1e2;fontColor=#ffffff;strokeColor=#006EAF;fontSize=13;fontFamily=Courier New;&quot; vertex=&quot;1&quot; parent=&quot;WIyWlLk6GJQsqaUBKTNV-1&quot;&gt;&#10;          &lt;mxGeometry x=&quot;480&quot; y=&quot;480&quot; width=&quot;400&quot; height=&quot;120&quot; as=&quot;geometry&quot; /&gt;&#10;        &lt;/mxCell&gt;&#10;        &lt;mxCell id=&quot;JE-gUsl_tAw7CFqOJm1K-3&quot; value=&quot;&amp;lt;u style=&amp;quot;font-size: 13px;&amp;quot;&amp;gt;opal_stereo_proc_local&amp;lt;/u&amp;gt;&amp;lt;u style=&amp;quot;background-color: initial; font-size: 13px;&amp;quot;&amp;gt;.launch&amp;lt;/u&amp;gt;&quot; style=&quot;rounded=1;whiteSpace=wrap;html=1;align=left;verticalAlign=top;fillColor=#1ba1e2;fontColor=#ffffff;strokeColor=#006EAF;fontSize=13;fontFamily=Courier New;&quot; vertex=&quot;1&quot; parent=&quot;WIyWlLk6GJQsqaUBKTNV-1&quot;&gt;&#10;          &lt;mxGeometry x=&quot;40&quot; y=&quot;320&quot; width=&quot;400&quot; height=&quot;120&quot; as=&quot;geometry&quot; /&gt;&#10;        &lt;/mxCell&gt;&#10;        &lt;mxCell id=&quot;JE-gUsl_tAw7CFqOJm1K-1&quot; value=&quot;&amp;lt;u style=&amp;quot;font-size: 13px;&amp;quot;&amp;gt;opal_stereo_proc.launch&amp;lt;/u&amp;gt;&quot; style=&quot;rounded=1;whiteSpace=wrap;html=1;align=left;verticalAlign=top;fillColor=#1ba1e2;fontColor=#ffffff;strokeColor=#006EAF;fontSize=13;fontFamily=Courier New;&quot; vertex=&quot;1&quot; parent=&quot;WIyWlLk6GJQsqaUBKTNV-1&quot;&gt;&#10;          &lt;mxGeometry x=&quot;40&quot; y=&quot;160&quot; width=&quot;400&quot; height=&quot;120&quot; as=&quot;geometry&quot; /&gt;&#10;        &lt;/mxCell&gt;&#10;        &lt;mxCell id=&quot;JE-gUsl_tAw7CFqOJm1K-2&quot; value=&quot;&amp;lt;u style=&amp;quot;font-size: 13px;&amp;quot;&amp;gt;run_in_docker.sh&amp;lt;/u&amp;gt;&quot; style=&quot;rounded=1;whiteSpace=wrap;html=1;align=left;verticalAlign=top;fillColor=#1ba1e2;fontColor=#ffffff;strokeColor=#006EAF;fontSize=13;fontFamily=Courier New;&quot; vertex=&quot;1&quot; parent=&quot;WIyWlLk6GJQsqaUBKTNV-1&quot;&gt;&#10;          &lt;mxGeometry x=&quot;520&quot; y=&quot;160&quot; width=&quot;400&quot; height=&quot;120&quot; as=&quot;geometry&quot; /&gt;&#10;        &lt;/mxCell&gt;&#10;        &lt;mxCell id=&quot;WIyWlLk6GJQsqaUBKTNV-2&quot; value=&quot;&quot; style=&quot;rounded=0;html=1;jettySize=auto;orthogonalLoop=1;fontSize=11;endArrow=block;endFill=0;endSize=8;strokeWidth=1;shadow=0;labelBackgroundColor=none;edgeStyle=orthogonalEdgeStyle;exitX=0.5;exitY=1;exitDx=0;exitDy=0;&quot; parent=&quot;WIyWlLk6GJQsqaUBKTNV-1&quot; source=&quot;JE-gUsl_tAw7CFqOJm1K-10&quot; target=&quot;WIyWlLk6GJQsqaUBKTNV-6&quot; edge=&quot;1&quot;&gt;&#10;          &lt;mxGeometry relative=&quot;1&quot; as=&quot;geometry&quot;&gt;&#10;            &lt;mxPoint x=&quot;242.5&quot; y=&quot;120&quot; as=&quot;sourcePoint&quot; /&gt;&#10;          &lt;/mxGeometry&gt;&#10;        &lt;/mxCell&gt;&#10;        &lt;mxCell id=&quot;WIyWlLk6GJQsqaUBKTNV-4&quot; value=&quot;false&quot; style=&quot;rounded=0;html=1;jettySize=auto;orthogonalLoop=1;fontSize=11;endArrow=block;endFill=0;endSize=8;strokeWidth=1;shadow=0;labelBackgroundColor=none;edgeStyle=orthogonalEdgeStyle;&quot; parent=&quot;WIyWlLk6GJQsqaUBKTNV-1&quot; source=&quot;WIyWlLk6GJQsqaUBKTNV-6&quot; target=&quot;WIyWlLk6GJQsqaUBKTNV-10&quot; edge=&quot;1&quot;&gt;&#10;          &lt;mxGeometry x=&quot;-1&quot; y=&quot;16&quot; relative=&quot;1&quot; as=&quot;geometry&quot;&gt;&#10;            &lt;mxPoint as=&quot;offset&quot; /&gt;&#10;          &lt;/mxGeometry&gt;&#10;        &lt;/mxCell&gt;&#10;        &lt;mxCell id=&quot;WIyWlLk6GJQsqaUBKTNV-5&quot; value=&quot;true&quot; style=&quot;edgeStyle=orthogonalEdgeStyle;rounded=0;html=1;jettySize=auto;orthogonalLoop=1;fontSize=11;endArrow=block;endFill=0;endSize=8;strokeWidth=1;shadow=0;labelBackgroundColor=none;entryX=0;entryY=0.5;entryDx=0;entryDy=0;labelPosition=left;verticalLabelPosition=middle;align=right;verticalAlign=middle;&quot; parent=&quot;WIyWlLk6GJQsqaUBKTNV-1&quot; source=&quot;WIyWlLk6GJQsqaUBKTNV-6&quot; target=&quot;JE-gUsl_tAw7CFqOJm1K-11&quot; edge=&quot;1&quot;&gt;&#10;          &lt;mxGeometry x=&quot;-0.8228&quot; y=&quot;10&quot; relative=&quot;1&quot; as=&quot;geometry&quot;&gt;&#10;            &lt;mxPoint as=&quot;offset&quot; /&gt;&#10;            &lt;mxPoint x=&quot;597&quot; y=&quot;100&quot; as=&quot;targetPoint&quot; /&gt;&#10;            &lt;Array as=&quot;points&quot;&gt;&#10;              &lt;mxPoint x=&quot;480&quot; y=&quot;210&quot; /&gt;&#10;              &lt;mxPoint x=&quot;480&quot; y=&quot;90&quot; /&gt;&#10;            &lt;/Array&gt;&#10;          &lt;/mxGeometry&gt;&#10;        &lt;/mxCell&gt;&#10;        &lt;mxCell id=&quot;WIyWlLk6GJQsqaUBKTNV-6&quot; value=&quot;run_docker&quot; style=&quot;rhombus;whiteSpace=wrap;html=1;shadow=0;fontFamily=Helvetica;fontSize=12;align=center;strokeWidth=1;spacing=6;spacingTop=-4;fillColor=#cdeb8b;strokeColor=#36393d;fontColor=#000000;&quot; parent=&quot;WIyWlLk6GJQsqaUBKTNV-1&quot; vertex=&quot;1&quot;&gt;&#10;          &lt;mxGeometry x=&quot;253.75&quot; y=&quot;170&quot; width=&quot;100&quot; height=&quot;80&quot; as=&quot;geometry&quot; /&gt;&#10;        &lt;/mxCell&gt;&#10;        &lt;mxCell id=&quot;WIyWlLk6GJQsqaUBKTNV-8&quot; value=&quot;ros&quot; style=&quot;rounded=0;html=1;jettySize=auto;orthogonalLoop=1;fontSize=11;endArrow=block;endFill=0;endSize=8;strokeWidth=1;shadow=0;labelBackgroundColor=none;edgeStyle=orthogonalEdgeStyle;&quot; parent=&quot;WIyWlLk6GJQsqaUBKTNV-1&quot; source=&quot;WIyWlLk6GJQsqaUBKTNV-10&quot; target=&quot;WIyWlLk6GJQsqaUBKTNV-11&quot; edge=&quot;1&quot;&gt;&#10;          &lt;mxGeometry x=&quot;-0.9993&quot; y=&quot;16&quot; relative=&quot;1&quot; as=&quot;geometry&quot;&gt;&#10;            &lt;mxPoint as=&quot;offset&quot; /&gt;&#10;          &lt;/mxGeometry&gt;&#10;        &lt;/mxCell&gt;&#10;        &lt;mxCell id=&quot;WIyWlLk6GJQsqaUBKTNV-9&quot; value=&quot;vpi&quot; style=&quot;edgeStyle=orthogonalEdgeStyle;rounded=0;html=1;jettySize=auto;orthogonalLoop=1;fontSize=11;endArrow=block;endFill=0;endSize=8;strokeWidth=1;shadow=0;labelBackgroundColor=none;&quot; parent=&quot;WIyWlLk6GJQsqaUBKTNV-1&quot; source=&quot;WIyWlLk6GJQsqaUBKTNV-10&quot; target=&quot;WIyWlLk6GJQsqaUBKTNV-12&quot; edge=&quot;1&quot;&gt;&#10;          &lt;mxGeometry x=&quot;-0.9738&quot; y=&quot;10&quot; relative=&quot;1&quot; as=&quot;geometry&quot;&gt;&#10;            &lt;mxPoint as=&quot;offset&quot; /&gt;&#10;          &lt;/mxGeometry&gt;&#10;        &lt;/mxCell&gt;&#10;        &lt;mxCell id=&quot;WIyWlLk6GJQsqaUBKTNV-10&quot; value=&quot;stereo_matcher&quot; style=&quot;rhombus;whiteSpace=wrap;html=1;shadow=0;fontFamily=Helvetica;fontSize=12;align=center;strokeWidth=1;spacing=6;spacingTop=-4;fillColor=#cdeb8b;strokeColor=#36393d;fontColor=#000000;&quot; parent=&quot;WIyWlLk6GJQsqaUBKTNV-1&quot; vertex=&quot;1&quot;&gt;&#10;          &lt;mxGeometry x=&quot;253.75&quot; y=&quot;340&quot; width=&quot;100&quot; height=&quot;80&quot; as=&quot;geometry&quot; /&gt;&#10;        &lt;/mxCell&gt;&#10;        &lt;mxCell id=&quot;WIyWlLk6GJQsqaUBKTNV-11&quot; value=&quot;Run ROS stereo_image_proc&amp;lt;div&amp;gt;on CPU&amp;lt;/div&amp;gt;&quot; style=&quot;rounded=1;whiteSpace=wrap;html=1;fontSize=12;glass=0;strokeWidth=1;shadow=0;fillColor=#cdeb8b;strokeColor=#36393d;fontColor=#000000;&quot; parent=&quot;WIyWlLk6GJQsqaUBKTNV-1&quot; vertex=&quot;1&quot;&gt;&#10;          &lt;mxGeometry x=&quot;210&quot; y=&quot;530&quot; width=&quot;187.5&quot; height=&quot;40&quot; as=&quot;geometry&quot; /&gt;&#10;        &lt;/mxCell&gt;&#10;        &lt;mxCell id=&quot;WIyWlLk6GJQsqaUBKTNV-12&quot; value=&quot;Run gpu_stereo_image_proc&amp;lt;div&amp;gt;on GPU&amp;lt;/div&amp;gt;&quot; style=&quot;rounded=1;whiteSpace=wrap;html=1;fontSize=12;glass=0;strokeWidth=1;shadow=0;fillColor=#cdeb8b;strokeColor=#36393d;fontColor=#000000;&quot; parent=&quot;WIyWlLk6GJQsqaUBKTNV-1&quot; vertex=&quot;1&quot;&gt;&#10;          &lt;mxGeometry x=&quot;585&quot; y=&quot;530&quot; width=&quot;190&quot; height=&quot;40&quot; as=&quot;geometry&quot; /&gt;&#10;        &lt;/mxCell&gt;&#10;        &lt;mxCell id=&quot;JE-gUsl_tAw7CFqOJm1K-6&quot; value=&quot;Launch Docker Container&amp;lt;div&amp;gt;Run &amp;quot;roslaunch&amp;quot; in container&amp;lt;br&amp;gt;&amp;lt;/div&amp;gt;&quot; style=&quot;rounded=1;whiteSpace=wrap;html=1;fontSize=12;glass=0;strokeWidth=1;shadow=0;fillColor=#cdeb8b;strokeColor=#36393d;fontColor=#000000;&quot; vertex=&quot;1&quot; parent=&quot;WIyWlLk6GJQsqaUBKTNV-1&quot;&gt;&#10;          &lt;mxGeometry x=&quot;617&quot; y=&quot;200&quot; width=&quot;190&quot; height=&quot;40&quot; as=&quot;geometry&quot; /&gt;&#10;        &lt;/mxCell&gt;&#10;        &lt;mxCell id=&quot;JE-gUsl_tAw7CFqOJm1K-7&quot; value=&quot;&quot; style=&quot;endArrow=classic;html=1;rounded=0;exitX=0.5;exitY=1;exitDx=0;exitDy=0;&quot; edge=&quot;1&quot; parent=&quot;WIyWlLk6GJQsqaUBKTNV-1&quot; target=&quot;JE-gUsl_tAw7CFqOJm1K-6&quot;&gt;&#10;          &lt;mxGeometry width=&quot;50&quot; height=&quot;50&quot; relative=&quot;1&quot; as=&quot;geometry&quot;&gt;&#10;            &lt;mxPoint x=&quot;712&quot; y=&quot;120&quot; as=&quot;sourcePoint&quot; /&gt;&#10;            &lt;mxPoint x=&quot;440&quot; y=&quot;490&quot; as=&quot;targetPoint&quot; /&gt;&#10;          &lt;/mxGeometry&gt;&#10;        &lt;/mxCell&gt;&#10;        &lt;mxCell id=&quot;JE-gUsl_tAw7CFqOJm1K-9&quot; style=&quot;edgeStyle=orthogonalEdgeStyle;rounded=0;orthogonalLoop=1;jettySize=auto;html=1;exitX=0.5;exitY=1;exitDx=0;exitDy=0;entryX=0.5;entryY=0;entryDx=0;entryDy=0;&quot; edge=&quot;1&quot; parent=&quot;WIyWlLk6GJQsqaUBKTNV-1&quot; source=&quot;JE-gUsl_tAw7CFqOJm1K-6&quot; target=&quot;JE-gUsl_tAw7CFqOJm1K-10&quot;&gt;&#10;          &lt;mxGeometry relative=&quot;1&quot; as=&quot;geometry&quot;&gt;&#10;            &lt;mxPoint x=&quot;236.82999999999993&quot; y=&quot;80.51999999999998&quot; as=&quot;targetPoint&quot; /&gt;&#10;            &lt;Array as=&quot;points&quot;&gt;&#10;              &lt;mxPoint x=&quot;712&quot; y=&quot;320&quot; /&gt;&#10;              &lt;mxPoint x=&quot;960&quot; y=&quot;320&quot; /&gt;&#10;              &lt;mxPoint x=&quot;960&quot; y=&quot;-160&quot; /&gt;&#10;              &lt;mxPoint x=&quot;304&quot; y=&quot;-160&quot; /&gt;&#10;            &lt;/Array&gt;&#10;          &lt;/mxGeometry&gt;&#10;        &lt;/mxCell&gt;&#10;        &lt;mxCell id=&quot;JE-gUsl_tAw7CFqOJm1K-10&quot; value=&quot;&amp;lt;span style=&amp;quot;font-family: Helvetica; font-size: 12px; font-style: normal; font-variant-ligatures: normal; font-variant-caps: normal; font-weight: 400; letter-spacing: normal; orphans: 2; text-align: center; text-indent: 0px; text-transform: none; widows: 2; word-spacing: 0px; -webkit-text-stroke-width: 0px; white-space: normal; text-decoration-thickness: initial; text-decoration-style: initial; text-decoration-color: initial; float: none; display: inline !important;&amp;quot;&amp;gt;roslaunch opal_stereo_proc opal_stereo_proc.launch&amp;lt;/span&amp;gt;&quot; style=&quot;ellipse;whiteSpace=wrap;html=1;fillColor=#f0a30a;fontColor=#000000;strokeColor=#BD7000;labelBackgroundColor=none;&quot; vertex=&quot;1&quot; parent=&quot;WIyWlLk6GJQsqaUBKTNV-1&quot;&gt;&#10;          &lt;mxGeometry x=&quot;218.75&quot; y=&quot;60&quot; width=&quot;170&quot; height=&quot;60&quot; as=&quot;geometry&quot; /&gt;&#10;        &lt;/mxCell&gt;&#10;        &lt;mxCell id=&quot;JE-gUsl_tAw7CFqOJm1K-11&quot; value=&quot;scripts/run_in_docker.sh&quot; style=&quot;ellipse;whiteSpace=wrap;html=1;fillColor=#f0a30a;fontColor=#000000;strokeColor=#BD7000;&quot; vertex=&quot;1&quot; parent=&quot;WIyWlLk6GJQsqaUBKTNV-1&quot;&gt;&#10;          &lt;mxGeometry x=&quot;627&quot; y=&quot;60&quot; width=&quot;170&quot; height=&quot;60&quot; as=&quot;geometry&quot; /&gt;&#10;        &lt;/mxCell&gt;&#10;        &lt;mxCell id=&quot;JE-gUsl_tAw7CFqOJm1K-12&quot; value=&quot;START HERE&quot; style=&quot;ellipse;whiteSpace=wrap;html=1;fillColor=#f0a30a;fontColor=#000000;strokeColor=#BD7000;&quot; vertex=&quot;1&quot; parent=&quot;WIyWlLk6GJQsqaUBKTNV-1&quot;&gt;&#10;          &lt;mxGeometry x=&quot;414&quot; y=&quot;-120&quot; width=&quot;120&quot; height=&quot;80&quot; as=&quot;geometry&quot; /&gt;&#10;        &lt;/mxCell&gt;&#10;        &lt;mxCell id=&quot;JE-gUsl_tAw7CFqOJm1K-13&quot; value=&quot;&quot; style=&quot;endArrow=classic;html=1;rounded=0;exitX=0;exitY=1;exitDx=0;exitDy=0;entryX=1;entryY=0;entryDx=0;entryDy=0;&quot; edge=&quot;1&quot; parent=&quot;WIyWlLk6GJQsqaUBKTNV-1&quot; source=&quot;JE-gUsl_tAw7CFqOJm1K-12&quot; target=&quot;JE-gUsl_tAw7CFqOJm1K-10&quot;&gt;&#10;          &lt;mxGeometry width=&quot;50&quot; height=&quot;50&quot; relative=&quot;1&quot; as=&quot;geometry&quot;&gt;&#10;            &lt;mxPoint x=&quot;390&quot; y=&quot;260&quot; as=&quot;sourcePoint&quot; /&gt;&#10;            &lt;mxPoint x=&quot;440&quot; y=&quot;210&quot; as=&quot;targetPoint&quot; /&gt;&#10;          &lt;/mxGeometry&gt;&#10;        &lt;/mxCell&gt;&#10;        &lt;mxCell id=&quot;JE-gUsl_tAw7CFqOJm1K-14&quot; value=&quot;&quot; style=&quot;endArrow=classic;html=1;rounded=0;exitX=1;exitY=1;exitDx=0;exitDy=0;entryX=0;entryY=0;entryDx=0;entryDy=0;&quot; edge=&quot;1&quot; parent=&quot;WIyWlLk6GJQsqaUBKTNV-1&quot; source=&quot;JE-gUsl_tAw7CFqOJm1K-12&quot; target=&quot;JE-gUsl_tAw7CFqOJm1K-11&quot;&gt;&#10;          &lt;mxGeometry width=&quot;50&quot; height=&quot;50&quot; relative=&quot;1&quot; as=&quot;geometry&quot;&gt;&#10;            &lt;mxPoint x=&quot;442&quot; y=&quot;-42&quot; as=&quot;sourcePoint&quot; /&gt;&#10;            &lt;mxPoint x=&quot;313&quot; y=&quot;79&quot; as=&quot;targetPoint&quot; /&gt;&#10;          &lt;/mxGeometry&gt;&#10;        &lt;/mxCell&gt;&#10;      &lt;/root&gt;&#10;    &lt;/mxGraphModel&gt;&#10;  &lt;/diagram&gt;&#10;&lt;/mxfile&gt;&#10;"><defs/><g><g><rect x="2.5" y="647" width="400" height="120" rx="18" ry="18" fill="#1ba1e2" stroke="#006eaf" pointer-events="all"/></g><g><g transform="translate(-0.5 -0.5)"><switch><foreignObject pointer-events="none" width="100%" height="100%" requiredFeatures="http://www.w3.org/TR/SVG11/feature#Extensibility" style="overflow: visible; text-align: left;"><div xmlns="http://www.w3.org/1999/xhtml" style="display: flex; align-items: unsafe flex-start; justify-content: unsafe flex-start; width: 398px; height: 1px; padding-top: 654px; margin-left: 5px;"><div data-drawio-colors="color: #ffffff; " style="box-sizing: border-box; font-size: 0px; text-align: left;"><div style="display: inline-block; font-size: 13px; font-family: &quot;Courier New&quot;; color: rgb(255, 255, 255); line-height: 1.2; pointer-events: all; white-space: normal; overflow-wrap: normal;"><u style="font-size: 13px;">stereo_image_proc.launch</u></div></div></div></foreignObject><text x="5" y="667" fill="#ffffff" font-family="Courier New" font-size="13px">stereo_image_proc.launch</text></switch></g></g><g><rect x="440" y="647" width="400" height="120" rx="18" ry="18" fill="#1ba1e2" stroke="#006eaf" pointer-events="all"/></g><g><g transform="translate(-0.5 -0.5)"><switch><foreignObject pointer-events="none" width="100%" height="100%" requiredFeatures="http://www.w3.org/TR/SVG11/feature#Extensibility" style="overflow: visible; text-align: left;"><div xmlns="http://www.w3.org/1999/xhtml" style="display: flex; align-items: unsafe flex-start; justify-content: unsafe flex-start; width: 398px; height: 1px; padding-top: 654px; margin-left: 442px;"><div data-drawio-colors="color: #ffffff; " style="box-sizing: border-box; font-size: 0px; text-align: left;"><div style="display: inline-block; font-size: 13px; font-family: &quot;Courier New&quot;; color: rgb(255, 255, 255); line-height: 1.2; pointer-events: all; white-space: normal; overflow-wrap: normal;"><u style="font-size: 13px;">gpu_stereo_image_proc.launch</u></div></div></div></foreignObject><text x="442" y="667" fill="#ffffff" font-family="Courier New" font-size="13px">gpu_stereo_image_proc.launch</text></switch></g></g><g><rect x="0" y="487" width="400" height="120" rx="18" ry="18" fill="#1ba1e2" stroke="#006eaf" pointer-events="all"/></g><g><g transform="translate(-0.5 -0.5)"><switch><foreignObject pointer-events="none" width="100%" height="100%" requiredFeatures="http://www.w3.org/TR/SVG11/feature#Extensibility" style="overflow: visible; text-align: left;"><div xmlns="http://www.w3.org/1999/xhtml" style="display: flex; align-items: unsafe flex-start; justify-content: unsafe flex-start; width: 398px; height: 1px; padding-top: 494px; margin-left: 2px;"><div data-drawio-colors="color: #ffffff; " style="box-sizing: border-box; font-size: 0px; text-align: left;"><div style="display: inline-block; font-size: 13px; font-family: &quot;Courier New&quot;; color: rgb(255, 255, 255); line-height: 1.2; pointer-events: all; white-space: normal; overflow-wrap: normal;"><u style="font-size: 13px;">opal_stereo_proc_local</u><u style="background-color: initial; font-size: 13px;">.launch</u></div></div></div></foreignObject><text x="2" y="507" fill="#ffffff" font-family="Courier New" font-size="13px">opal_stereo_proc_local.launch</text></switch></g></g><g><rect x="0" y="327" width="400" height="120" rx="18" ry="18" fill="#1ba1e2" stroke="#006eaf" pointer-events="all"/></g><g><g transform="translate(-0.5 -0.5)"><switch><foreignObject pointer-events="none" width="100%" height="100%" requiredFeatures="http://www.w3.org/TR/SVG11/feature#Extensibility" style="overflow: visible; text-align: left;"><div xmlns="http://www.w3.org/1999/xhtml" style="display: flex; align-items: unsafe flex-start; justify-content: unsafe flex-start; width: 398px; height: 1px; padding-top: 334px; margin-left: 2px;"><div data-drawio-colors="color: #ffffff; " style="box-sizing: border-box; font-size: 0px; text-align: left;"><div style="display: inline-block; font-size: 13px; font-family: &quot;Courier New&quot;; color: rgb(255, 255, 255); line-height: 1.2; pointer-events: all; white-space: normal; overflow-wrap: normal;"><u style="font-size: 13px;">opal_stereo_proc.launch</u></div></div></div></foreignObject><text x="2" y="347" fill="#ffffff" font-family="Courier New" font-size="13px">opal_stereo_proc.launch</text></switch></g></g><g><rect x="480" y="327" width="400" height="120" rx="18" ry="18" fill="#1ba1e2" stroke="#006eaf" pointer-events="all"/></g><g><g transform="translate(-0.5 -0.5)"><switch><foreignObject pointer-events="none" width="100%" height="100%" requiredFeatures="http://www.w3.org/TR/SVG11/feature#Extensibility" style="overflow: visible; text-align: left;"><div xmlns="http://www.w3.org/1999/xhtml" style="display: flex; align-items: unsafe flex-start; justify-content: unsafe flex-start; width: 398px; height: 1px; padding-top: 334px; margin-left: 482px;"><div data-drawio-colors="color: #ffffff; " style="box-sizing: border-box; font-size: 0px; text-align: left;"><div style="display: inline-block; font-size: 13px; font-family: &quot;Courier New&quot;; color: rgb(255, 255, 255); line-height: 1.2; pointer-events: all; white-space: normal; overflow-wrap: normal;"><u style="font-size: 13px;">run_in_docker.sh</u></div></div></div></foreignObject><text x="482" y="347" fill="#ffffff" font-family="Courier New" font-size="13px">run_in_docker.sh</text></switch></g></g><g><path d="M 263.75 287 L 263.75 326.88" fill="none" stroke="rgb(240, 240, 240)" stroke-miterlimit="10" pointer-events="stroke"/><path d="M 263.75 335.88 L 259.25 326.88 L 268.25 326.88 Z" fill="none" stroke="rgb(240, 240, 240)" stroke-miterlimit="10" pointer-events="all"/></g><g><path d="M 263.75 417 L 263.75 496.88" fill="none" stroke="rgb(240, 240, 240)" stroke-miterlimit="10" pointer-events="stroke"/><path d="M 263.75 505.88 L 259.25 496.88 L 268.25 496.88 Z" fill="none" stroke="rgb(240, 240, 240)" stroke-miterlimit="10" pointer-events="all"/></g><g><g transform="translate(-0.5 -0.5)"><switch><foreignObject pointer-events="none" width="100%" height="100%" requiredFeatures="http://www.w3.org/TR/SVG11/feature#Extensibility" style="overflow: visible; text-align: left;"><div xmlns="http://www.w3.org/1999/xhtml" style="display: flex; align-items: unsafe center; justify-content: unsafe center; width: 1px; height: 1px; padding-top: 417px; margin-left: 280px;"><div data-drawio-colors="color: rgb(240, 240, 240); " style="box-sizing: border-box; font-size: 0px; text-align: center;"><div style="display: inline-block; font-size: 11px; font-family: Helvetica; color: rgb(240, 240, 240); line-height: 1.2; pointer-events: all; white-space: nowrap;">false</div></div></div></foreignObject><text x="280" y="420" fill="rgb(240, 240, 240)" font-family="Helvetica" font-size="11px" text-anchor="middle">false</text></switch></g></g><g><path d="M 313.75 377 L 440 377 L 440 257 L 576.88 257" fill="none" stroke="rgb(240, 240, 240)" stroke-miterlimit="10" pointer-events="stroke"/><path d="M 585.88 257 L 576.88 261.5 L 576.88 252.5 Z" fill="none" stroke="rgb(240, 240, 240)" stroke-miterlimit="10" pointer-events="all"/></g><g><g transform="translate(-0.5 -0.5)"><switch><foreignObject pointer-events="none" width="100%" height="100%" requiredFeatures="http://www.w3.org/TR/SVG11/feature#Extensibility" style="overflow: visible; text-align: left;"><div xmlns="http://www.w3.org/1999/xhtml" style="display: flex; align-items: unsafe center; justify-content: unsafe flex-end; width: 1px; height: 1px; padding-top: 367px; margin-left: 347px;"><div data-drawio-colors="color: rgb(240, 240, 240); " style="box-sizing: border-box; font-size: 0px; text-align: right;"><div style="display: inline-block; font-size: 11px; font-family: Helvetica; color: rgb(240, 240, 240); line-height: 1.2; pointer-events: all; white-space: nowrap;">true</div></div></div></foreignObject><text x="347" y="370" fill="rgb(240, 240, 240)" font-family="Helvetica" font-size="11px" text-anchor="end">true</text></switch></g></g><g><path d="M 263.75 337 L 313.75 377 L 263.75 417 L 213.75 377 Z" fill="#cdeb8b" stroke="#36393d" stroke-miterlimit="10" pointer-events="all"/></g><g><g transform="translate(-0.5 -0.5)"><switch><foreignObject pointer-events="none" width="100%" height="100%" requiredFeatures="http://www.w3.org/TR/SVG11/feature#Extensibility" style="overflow: visible; text-align: left;"><div xmlns="http://www.w3.org/1999/xhtml" style="display: flex; align-items: unsafe center; justify-content: unsafe center; width: 90px; height: 1px; padding-top: 375px; margin-left: 219px;"><div data-drawio-colors="color: #000000; " style="box-sizing: border-box; font-size: 0px; text-align: center;"><div style="display: inline-block; font-size: 12px; font-family: Helvetica; color: rgb(0, 0, 0); line-height: 1.2; pointer-events: all; white-space: normal; overflow-wrap: normal;">run_docker</div></div></div></foreignObject><text x="264" y="379" fill="#000000" font-family="Helvetica" font-size="12px" text-anchor="middle">run_docker</text></switch></g></g><g><path d="M 263.8 586.96 L 263.8 642 L 263.8 686.88" fill="none" stroke="rgb(240, 240, 240)" stroke-miterlimit="10" pointer-events="stroke"/><path d="M 263.8 695.88 L 259.3 686.88 L 268.3 686.88 Z" fill="none" stroke="rgb(240, 240, 240)" stroke-miterlimit="10" pointer-events="all"/></g><g><g transform="translate(-0.5 -0.5)"><switch><foreignObject pointer-events="none" width="100%" height="100%" requiredFeatures="http://www.w3.org/TR/SVG11/feature#Extensibility" style="overflow: visible; text-align: left;"><div xmlns="http://www.w3.org/1999/xhtml" style="display: flex; align-items: unsafe center; justify-content: unsafe center; width: 1px; height: 1px; padding-top: 587px; margin-left: 280px;"><div data-drawio-colors="color: rgb(240, 240, 240); " style="box-sizing: border-box; font-size: 0px; text-align: center;"><div style="display: inline-block; font-size: 11px; font-family: Helvetica; color: rgb(240, 240, 240); line-height: 1.2; pointer-events: all; white-space: nowrap;">ros</div></div></div></foreignObject><text x="280" y="590" fill="rgb(240, 240, 240)" font-family="Helvetica" font-size="11px" text-anchor="middle">ros</text></switch></g></g><g><path d="M 313.75 547 L 640 547 L 640 686.88" fill="none" stroke="rgb(240, 240, 240)" stroke-miterlimit="10" pointer-events="stroke"/><path d="M 640 695.88 L 635.5 686.88 L 644.5 686.88 Z" fill="none" stroke="rgb(240, 240, 240)" stroke-miterlimit="10" pointer-events="all"/></g><g><g transform="translate(-0.5 -0.5)"><switch><foreignObject pointer-events="none" width="100%" height="100%" requiredFeatures="http://www.w3.org/TR/SVG11/feature#Extensibility" style="overflow: visible; text-align: left;"><div xmlns="http://www.w3.org/1999/xhtml" style="display: flex; align-items: unsafe center; justify-content: unsafe center; width: 1px; height: 1px; padding-top: 537px; margin-left: 320px;"><div data-drawio-colors="color: rgb(240, 240, 240); " style="box-sizing: border-box; font-size: 0px; text-align: center;"><div style="display: inline-block; font-size: 11px; font-family: Helvetica; color: rgb(240, 240, 240); line-height: 1.2; pointer-events: all; white-space: nowrap;">vpi</div></div></div></foreignObject><text x="320" y="540" fill="rgb(240, 240, 240)" font-family="Helvetica" font-size="11px" text-anchor="middle">vpi</text></switch></g></g><g><path d="M 263.75 507 L 313.75 547 L 263.75 587 L 213.75 547 Z" fill="#cdeb8b" stroke="#36393d" stroke-miterlimit="10" pointer-events="all"/></g><g><g transform="translate(-0.5 -0.5)"><switch><foreignObject pointer-events="none" width="100%" height="100%" requiredFeatures="http://www.w3.org/TR/SVG11/feature#Extensibility" style="overflow: visible; text-align: left;"><div xmlns="http://www.w3.org/1999/xhtml" style="display: flex; align-items: unsafe center; justify-content: unsafe center; width: 90px; height: 1px; padding-top: 545px; margin-left: 219px;"><div data-drawio-colors="color: #000000; " style="box-sizing: border-box; font-size: 0px; text-align: center;"><div style="display: inline-block; font-size: 12px; font-family: Helvetica; color: rgb(0, 0, 0); line-height: 1.2; pointer-events: all; white-space: normal; overflow-wrap: normal;">stereo_matcher</div></div></div></foreignObject><text x="264" y="549" fill="#000000" font-family="Helvetica" font-size="12px" text-anchor="middle">stereo_matcher</text></switch></g></g><g><rect x="170" y="697" width="187.5" height="40" rx="6" ry="6" fill="#cdeb8b" stroke="#36393d" pointer-events="all"/></g><g><g transform="translate(-0.5 -0.5)"><switch><foreignObject pointer-events="none" width="100%" height="100%" requiredFeatures="http://www.w3.org/TR/SVG11/feature#Extensibility" style="overflow: visible; text-align: left;"><div xmlns="http://www.w3.org/1999/xhtml" style="display: flex; align-items: unsafe center; justify-content: unsafe center; width: 186px; height: 1px; padding-top: 717px; margin-left: 171px;"><div data-drawio-colors="color: #000000; " style="box-sizing: border-box; font-size: 0px; text-align: center;"><div style="display: inline-block; font-size: 12px; font-family: Helvetica; color: rgb(0, 0, 0); line-height: 1.2; pointer-events: all; white-space: normal; overflow-wrap: normal;">Run ROS stereo_image_proc<div>on CPU</div></div></div></div></foreignObject><text x="264" y="721" fill="#000000" font-family="Helvetica" font-size="12px" text-anchor="middle">Run ROS stereo_image_proc...</text></switch></g></g><g><rect x="545" y="697" width="190" height="40" rx="6" ry="6" fill="#cdeb8b" stroke="#36393d" pointer-events="all"/></g><g><g transform="translate(-0.5 -0.5)"><switch><foreignObject pointer-events="none" width="100%" height="100%" requiredFeatures="http://www.w3.org/TR/SVG11/feature#Extensibility" style="overflow: visible; text-align: left;"><div xmlns="http://www.w3.org/1999/xhtml" style="display: flex; align-items: unsafe center; justify-content: unsafe center; width: 188px; height: 1px; padding-top: 717px; margin-left: 546px;"><div data-drawio-colors="color: #000000; " style="box-sizing: border-box; font-size: 0px; text-align: center;"><div style="display: inline-block; font-size: 12px; font-family: Helvetica; color: rgb(0, 0, 0); line-height: 1.2; pointer-events: all; white-space: normal; overflow-wrap: normal;">Run gpu_stereo_image_proc<div>on GPU</div></div></div></div></foreignObject><text x="640" y="721" fill="#000000" font-family="Helvetica" font-size="12px" text-anchor="middle">Run gpu_stereo_image_proc...</text></switch></g></g><g><rect x="577" y="367" width="190" height="40" rx="6" ry="6" fill="#cdeb8b" stroke="#36393d" pointer-events="all"/></g><g><g transform="translate(-0.5 -0.5)"><switch><foreignObject pointer-events="none" width="100%" height="100%" requiredFeatures="http://www.w3.org/TR/SVG11/feature#Extensibility" style="overflow: visible; text-align: left;"><div xmlns="http://www.w3.org/1999/xhtml" style="display: flex; align-items: unsafe center; justify-content: unsafe center; width: 188px; height: 1px; padding-top: 387px; margin-left: 578px;"><div data-drawio-colors="color: #000000; " style="box-sizing: border-box; font-size: 0px; text-align: center;"><div style="display: inline-block; font-size: 12px; font-family: Helvetica; color: rgb(0, 0, 0); line-height: 1.2; pointer-events: all; white-space: normal; overflow-wrap: normal;">Launch Docker Container<div>Run "roslaunch" in container<br /></div></div></div></div></foreignObject><text x="672" y="391" fill="#000000" font-family="Helvetica" font-size="12px" text-anchor="middle">Launch Docker Container...</text></switch></g></g><g><path d="M 672 287 L 672 360.63" fill="none" stroke="rgb(240, 240, 240)" stroke-miterlimit="10" pointer-events="stroke"/><path d="M 672 365.88 L 668.5 358.88 L 672 360.63 L 675.5 358.88 Z" fill="rgb(240, 240, 240)" stroke="rgb(240, 240, 240)" stroke-miterlimit="10" pointer-events="all"/></g><g><path d="M 672 407 L 672 487 L 920 487 L 920 7 L 263.8 7 L 263.75 220.63" fill="none" stroke="rgb(240, 240, 240)" stroke-miterlimit="10" pointer-events="stroke"/><path d="M 263.75 225.88 L 260.25 218.88 L 263.75 220.63 L 267.25 218.88 Z" fill="rgb(240, 240, 240)" stroke="rgb(240, 240, 240)" stroke-miterlimit="10" pointer-events="all"/></g><g><ellipse cx="263.75" cy="257" rx="85" ry="30" fill="#f0a30a" stroke="#bd7000" pointer-events="all"/></g><g><g transform="translate(-0.5 -0.5)"><switch><foreignObject pointer-events="none" width="100%" height="100%" requiredFeatures="http://www.w3.org/TR/SVG11/feature#Extensibility" style="overflow: visible; text-align: left;"><div xmlns="http://www.w3.org/1999/xhtml" style="display: flex; align-items: unsafe center; justify-content: unsafe center; width: 168px; height: 1px; padding-top: 257px; margin-left: 180px;"><div data-drawio-colors="color: #000000; " style="box-sizing: border-box; font-size: 0px; text-align: center;"><div style="display: inline-block; font-size: 12px; font-family: Helvetica; color: rgb(0, 0, 0); line-height: 1.2; pointer-events: all; white-space: normal; overflow-wrap: normal;"><span style="font-family: Helvetica; font-size: 12px; font-style: normal; font-variant-ligatures: normal; font-variant-caps: normal; font-weight: 400; letter-spacing: normal; orphans: 2; text-align: center; text-indent: 0px; text-transform: none; widows: 2; word-spacing: 0px; -webkit-text-stroke-width: 0px; white-space: normal; text-decoration-thickness: initial; text-decoration-style: initial; text-decoration-color: initial; float: none; display: inline !important;">roslaunch opal_stereo_proc opal_stereo_proc.launch</span></div></div></div></foreignObject><text x="264" y="261" fill="#000000" font-family="Helvetica" font-size="12px" text-anchor="middle">roslaunch opal_stereo_proc o...</text></switch></g></g><g><ellipse cx="672" cy="257" rx="85" ry="30" fill="#f0a30a" stroke="#bd7000" pointer-events="all"/></g><g><g transform="translate(-0.5 -0.5)"><switch><foreignObject pointer-events="none" width="100%" height="100%" requiredFeatures="http://www.w3.org/TR/SVG11/feature#Extensibility" style="overflow: visible; text-align: left;"><div xmlns="http://www.w3.org/1999/xhtml" style="display: flex; align-items: unsafe center; justify-content: unsafe center; width: 168px; height: 1px; padding-top: 257px; margin-left: 588px;"><div data-drawio-colors="color: #000000; " style="box-sizing: border-box; font-size: 0px; text-align: center;"><div style="display: inline-block; font-size: 12px; font-family: Helvetica; color: rgb(0, 0, 0); line-height: 1.2; pointer-events: all; white-space: normal; overflow-wrap: normal;">scripts/run_in_docker.sh</div></div></div></foreignObject><text x="672" y="261" fill="#000000" font-family="Helvetica" font-size="12px" text-anchor="middle">scripts/run_in_docker.sh</text></switch></g></g><g><ellipse cx="434" cy="87" rx="60" ry="40" fill="#f0a30a" stroke="#bd7000" pointer-events="all"/></g><g><g transform="translate(-0.5 -0.5)"><switch><foreignObject pointer-events="none" width="100%" height="100%" requiredFeatures="http://www.w3.org/TR/SVG11/feature#Extensibility" style="overflow: visible; text-align: left;"><div xmlns="http://www.w3.org/1999/xhtml" style="display: flex; align-items: unsafe center; justify-content: unsafe center; width: 118px; height: 1px; padding-top: 87px; margin-left: 375px;"><div data-drawio-colors="color: #000000; " style="box-sizing: border-box; font-size: 0px; text-align: center;"><div style="display: inline-block; font-size: 12px; font-family: Helvetica; color: rgb(0, 0, 0); line-height: 1.2; pointer-events: all; white-space: normal; overflow-wrap: normal;">START HERE</div></div></div></foreignObject><text x="434" y="91" fill="#000000" font-family="Helvetica" font-size="12px" text-anchor="middle">START HERE</text></switch></g></g><g><path d="M 391.57 115.28 L 326.97 230.24" fill="none" stroke="rgb(240, 240, 240)" stroke-miterlimit="10" pointer-events="stroke"/><path d="M 324.4 234.81 L 324.78 227 L 326.97 230.24 L 330.88 230.42 Z" fill="rgb(240, 240, 240)" stroke="rgb(240, 240, 240)" stroke-miterlimit="10" pointer-events="all"/></g><g><path d="M 476.43 115.28 L 607.14 231.55" fill="none" stroke="rgb(240, 240, 240)" stroke-miterlimit="10" pointer-events="stroke"/><path d="M 611.06 235.04 L 603.5 233.01 L 607.14 231.55 L 608.16 227.78 Z" fill="rgb(240, 240, 240)" stroke="rgb(240, 240, 240)" stroke-miterlimit="10" pointer-events="all"/></g></g><switch><g requiredFeatures="http://www.w3.org/TR/SVG11/feature#Extensibility"/><a transform="translate(0,-5)" xlink:href="https://www.drawio.com/doc/faq/svg-export-text-problems" target="_blank"><text text-anchor="middle" font-size="10px" x="50%" y="100%">Text is not SVG - cannot display</text></a></switch></svg>
