[
  7,
  7,
  7,
  7,
  7,
  7,
  7,
  7,
  7,
  7,
  7,
  7,
  7,
  7,
  7,
  7,
  7,
  7,
  7,
  7,
  7,
  7,
  7,
  7,
  7,
  7,
  7,
  7,
  7,
  7,
  -1,
  6,
  -1,
  6,
  -1,
  6,
  -1,
  6,
  -1,
  6,
  -1,
  6,
  -1,
  6,
  -1,
  6,
  4,
  -1,
  6,
  4,
  -1,
  6,
  -1,
  6,
  -1,
  5,
  -1,
  5,
  -1,
  5,
  5,
  -1,
  5,
  -1,
  5,
  -1,
  5,
  -1,
  5,
  -1,
  5,
  -1,
  5,
  -1,
  5,
  -1,
  -1,
  5,
  -1,
  4,
  4,
  -1,
  -1,
  4,
  4,
  -1,
  -1,
  4,
  -1,
  4,
  -1,
  4,
  -1,
  4,
  5,
  -1,
  4,
  5,
  -1,
  4,
  5,
  -1,
  4,
  1,
  3,
  -1,
  3,
  -1,
  3,
  -1,
  3,
  -1,
  3,
  -1,
  3,
  -1,
  3,
  -1,
  3,
  -1,
  -1,
  3,
  3,
  2,
  -1,
  2,
  -1,
  -1,
  2,
  -1,
  2,
  2,
  -1,
  -1,
  2,
  -1,
  2,
  -1,
  2,
  -1,
  2,
  -1,
  -1,
  1,
  1,
  -1,
  -1,
  1,
  1,
  -1,
  -1,
  1,
  1,
  -1,
  1,
  -1,
  1,
  -1,
  0,
  0,
  0,
  0,
  0,
  0,
  0,
  0,
  0,
  0,
  0,
  0,
  0,
  0,
  0,
  0,
  0,
  0,
  0,
  0,
  0,
  0,
  0,
  0,
  0,
  0,
  0,
  0,
  0,
  0,
  0,
  0,
  0,
  0,
  0,
  0,
  0,
  0,
  0,
  0,
  0,
  0,
  0,
  0,
  0,
  0,
  0,
  0,
  0,
  0,
  0,
  0,
  0,
  0,
  0,
  0,
  0,
  0,
  0,
  0,
  0,
  0,
  0,
  0,
  0,
  0,
  0,
  0,
  0,
  0,
  0,
  0,
  0,
  0,
  0,
  0,
  0,
  0,
  0,
  0,
  0,
  0,
  0,
  0,
  0,
  0,
  0,
  0,
  0,
  0,
  0,
  0,
  0,
  0,
  0,
  0,
  0
]