{
    "status": {
        "error_code": 0,
        "message": "OK"
    },
    "header": {
        "total_data": 27666,
        "total_data_no_category": 27666,
        "additional_params": "",
        "process_time": 0.07488246,
        "suggestion_instead": null
    },
    "data": [
        {
            "id": 392280465,
            "name": "anti gores kaca spy samsung s9 plus",
            "uri": "https://www.tokopedia.com/newbenua/anti-gores-kaca-spy-samsung-s9-plus?trkid=f%3DCa0000L000P1W1S1Sh00Co0Po0Fr0Cb0_page%3D1_ob%3D32_q%3Dsamsung_catid%3D76_po%3D1",
            "image_uri": "https://ecs7.tokopedia.net/img/cache/200-square/product-1/2019/1/18/2800797/2800797_254385c4-6d19-4e8d-8531-3bf56dfe1233_355_355.jpg",
            "image_uri_700": "https://ecs7.tokopedia.net/img/cache/700/product-1/2019/1/18/2800797/2800797_254385c4-6d19-4e8d-8531-3bf56dfe1233_355_355.jpg",
            "price": "Rp 55.000",
            "price_range": "",
            "category_breadcrumb": "handphone-tablet/aksesoris-handphone/screen-guard",
            "shop": {
                "id": 2800797,
                "name": "newbenuacell",
                "uri": "https://www.tokopedia.com/newbenua",
                "is_gold": 1,
                "rating": null,
                "location": "Jakarta",
                "reputation_image_uri": "https://inbox.tokopedia.com/reputation/v1/badge/shop/2800797",
                "shop_lucky": "https://clover.tokopedia.com/badges/merchant/v1?shop_id=2800797",
                "city": "Jakarta",
                "is_power_badge": true
            },
            "wholesale_price": [
                {
                    "count_min": 5,
                    "count_max": 10000,
                    "price": "Rp 45.000"
                }
            ],
            "condition": 1,
            "preorder": 0,
            "department_id": 76,
            "rating": 0,
            "is_featured": 0,
            "count_review": 0,
            "count_talk": 0,
            "count_sold": 0,
            "labels": [
                {
                    "title": "Grosir",
                    "color": "#ffffff"
                }
            ],
            "top_label": null,
            "bottom_label": null,
            "badges": [
                {
                    "title": "Power Badge",
                    "image_url": "https://ecs7.tokopedia.net/img/power-badge/power-badge-192.png",
                    "show": true
                }
            ],
            "original_price": "",
            "discount_expired": "",
            "discount_start": "",
            "discount_percentage": 0,
            "stock": 0
        },
        {
            "id": 231572580,
            "name": "Baterai Samsung Galaxy V G313H Ace 3 Double IC Protection",
            "uri": "https://www.tokopedia.com/nzone78/baterai-samsung-galaxy-v-g313h-ace-3-double-ic-protection?trkid=f%3DCa0000L000P1W1S1Sh00Co0Po0Fr0Cb0_page%3D1_ob%3D32_q%3Dsamsung_catid%3D67_po%3D2",
            "image_uri": "https://ecs7.tokopedia.net/img/cache/200-square/product-1/2017/1/26/8315812/8315812_c6ca7d47-7092-4e90-b15b-e83dcb9ace05_1000_1000.jpg",
            "image_uri_700": "https://ecs7.tokopedia.net/img/cache/700/product-1/2017/1/26/8315812/8315812_c6ca7d47-7092-4e90-b15b-e83dcb9ace05_1000_1000.jpg",
            "price": "Rp 57.500",
            "price_range": "",
            "category_breadcrumb": "handphone-tablet/aksesoris-handphone/baterai",
            "shop": {
                "id": 124866,
                "name": "Nzone78",
                "uri": "https://www.tokopedia.com/nzone78",
                "is_gold": 1,
                "rating": null,
                "location": "Kab. Tangerang",
                "reputation_image_uri": "https://inbox.tokopedia.com/reputation/v1/badge/shop/124866",
                "shop_lucky": "https://clover.tokopedia.com/badges/merchant/v1?shop_id=124866",
                "city": "Kab. Tangerang",
                "is_power_badge": true
            },
            "wholesale_price": [
                {
                    "count_min": 2,
                    "count_max": 10000,
                    "price": "Rp 52.500"
                }
            ],
            "condition": 1,
            "preorder": 0,
            "department_id": 67,
            "rating": 97,
            "is_featured": 0,
            "count_review": 24,
            "count_talk": 0,
            "count_sold": 0,
            "labels": [
                {
                    "title": "Cashback 5%",
                    "color": "#42b549"
                },
                {
                    "title": "Grosir",
                    "color": "#ffffff"
                }
            ],
            "top_label": null,
            "bottom_label": null,
            "badges": [
                {
                    "title": "Power Badge",
                    "image_url": "https://ecs7.tokopedia.net/img/power-badge/power-badge-192.png",
                    "show": true
                }
            ],
            "original_price": "",
            "discount_expired": "",
            "discount_start": "",
            "discount_percentage": 0,
            "stock": 13
        },
        {
            "id": 375261810,
            "name": "LCD SAMSUNG S5230 / S5233 / S5232 CORBY ORIGINAL",
            "uri": "https://www.tokopedia.com/asiago/lcd-samsung-s5230-s5233-s5232-corby-original?trkid=f%3DCa0000L000P1W1S1Sh00Co0Po0Fr0Cb0_page%3D1_ob%3D32_q%3Dsamsung_catid%3D75_po%3D3",
            "image_uri": "https://ecs7.tokopedia.net/img/cache/200-square/product-1/2018/12/13/21547905/21547905_dbe3ad6a-6c7b-4bc1-9707-8c7568ecaa00_1000_1000.png",
            "image_uri_700": "https://ecs7.tokopedia.net/img/cache/700/product-1/2018/12/13/21547905/21547905_dbe3ad6a-6c7b-4bc1-9707-8c7568ecaa00_1000_1000.png",
            "price": "Rp 27.000",
            "price_range": "",
            "category_breadcrumb": "handphone-tablet/aksesoris-handphone/spare-part",
            "shop": {
                "id": 2380265,
                "name": "Asiago",
                "uri": "https://www.tokopedia.com/asiago",
                "is_gold": 1,
                "rating": null,
                "location": "Jakarta",
                "reputation_image_uri": "https://inbox.tokopedia.com/reputation/v1/badge/shop/2380265",
                "shop_lucky": "https://clover.tokopedia.com/badges/merchant/v1?shop_id=2380265",
                "city": "Jakarta",
                "is_power_badge": true
            },
            "wholesale_price": [
                {
                    "count_min": 3,
                    "count_max": 10000,
                    "price": "Rp 26.500"
                }
            ],
            "condition": 1,
            "preorder": 0,
            "department_id": 75,
            "rating": 0,
            "is_featured": 0,
            "count_review": 0,
            "count_talk": 0,
            "count_sold": 0,
            "labels": [
                {
                    "title": "Grosir",
                    "color": "#ffffff"
                }
            ],
            "top_label": null,
            "bottom_label": null,
            "badges": [
                {
                    "title": "Power Badge",
                    "image_url": "https://ecs7.tokopedia.net/img/power-badge/power-badge-192.png",
                    "show": true
                }
            ],
            "original_price": "",
            "discount_expired": "",
            "discount_start": "",
            "discount_percentage": 0,
            "stock": 15
        },
        {
            "id": 360385858,
            "name": "Tempered Glass 5D Full Cover SAMSUNG J5 PRIME",
            "uri": "https://www.tokopedia.com/sedayushopping/tempered-glass-5d-full-cover-samsung-j5-prime?trkid=f%3DCa0000L000P1W1S1Sh00Co0Po0Fr0Cb0_page%3D1_ob%3D32_q%3Dsamsung_catid%3D76_po%3D4",
            "image_uri": "https://ecs7.tokopedia.net/img/cache/200-square/attachment/2018/12/2/15437629713059/15437629713059_cfb80e2e-4800-4c44-846b-0194004bd687.png",
            "image_uri_700": "https://ecs7.tokopedia.net/img/cache/700/attachment/2018/12/2/15437629713059/15437629713059_cfb80e2e-4800-4c44-846b-0194004bd687.png",
            "price": "Rp 11.000",
            "price_range": "",
            "category_breadcrumb": "handphone-tablet/aksesoris-handphone/screen-guard",
            "shop": {
                "id": 3958900,
                "name": "sedayu online shopping",
                "uri": "https://www.tokopedia.com/sedayushopping",
                "is_gold": 1,
                "rating": null,
                "location": "Jakarta",
                "reputation_image_uri": "https://inbox.tokopedia.com/reputation/v1/badge/shop/3958900",
                "shop_lucky": "https://clover.tokopedia.com/badges/merchant/v1?shop_id=3958900",
                "city": "Jakarta",
                "is_power_badge": true
            },
            "wholesale_price": [
                {
                    "count_min": 10,
                    "count_max": 19,
                    "price": "Rp 10.000"
                },
                {
                    "count_min": 20,
                    "count_max": 99,
                    "price": "Rp 9.500"
                },
                {
                    "count_min": 100,
                    "count_max": 10000,
                    "price": "Rp 8.500"
                }
            ],
            "condition": 1,
            "preorder": 0,
            "department_id": 76,
            "rating": 0,
            "is_featured": 0,
            "count_review": 0,
            "count_talk": 0,
            "count_sold": 0,
            "labels": [
                {
                    "title": "Cashback 3%",
                    "color": "#42b549"
                },
                {
                    "title": "Grosir",
                    "color": "#ffffff"
                }
            ],
            "top_label": null,
            "bottom_label": null,
            "badges": [
                {
                    "title": "Power Badge",
                    "image_url": "https://ecs7.tokopedia.net/img/power-badge/power-badge-192.png",
                    "show": true
                }
            ],
            "original_price": "",
            "discount_expired": "",
            "discount_start": "",
            "discount_percentage": 0,
            "stock": 0
        },
        {
            "id": 364794774,
            "name": "Headset/Earphone Samsung Galaxy S Stereo With Remote And Mic Original",
            "uri": "https://www.tokopedia.com/r7gemstone/headset-earphone-samsung-galaxy-s-stereo-with-remote-and-mic-original?trkid=f%3DCa0000L000P1W1S1Sh00Co0Po0Fr0Cb0_page%3D1_ob%3D32_q%3Dsamsung_catid%3D563_po%3D5",
            "image_uri": "https://ecs7.tokopedia.net/img/cache/200-square/product-1/2018/11/22/648719/648719_54990c9f-bf48-41ca-85f8-e42255cd9248_1717_1717.jpg",
            "image_uri_700": "https://ecs7.tokopedia.net/img/cache/700/product-1/2018/11/22/648719/648719_54990c9f-bf48-41ca-85f8-e42255cd9248_1717_1717.jpg",
            "price": "Rp 17.500",
            "price_range": "",
            "category_breadcrumb": "elektronik/audio/headset",
            "shop": {
                "id": 1002836,
                "name": "R7 GemStone",
                "uri": "https://www.tokopedia.com/r7gemstone",
                "is_gold": 1,
                "rating": null,
                "location": "Jakarta",
                "reputation_image_uri": "https://inbox.tokopedia.com/reputation/v1/badge/shop/1002836",
                "shop_lucky": "https://clover.tokopedia.com/badges/merchant/v1?shop_id=1002836",
                "city": "Jakarta",
                "is_power_badge": true
            },
            "wholesale_price": [
                {
                    "count_min": 20,
                    "count_max": 39,
                    "price": "Rp 16.500"
                },
                {
                    "count_min": 40,
                    "count_max": 59,
                    "price": "Rp 15.500"
                },
                {
                    "count_min": 60,
                    "count_max": 79,
                    "price": "Rp 14.500"
                },
                {
                    "count_min": 80,
                    "count_max": 99,
                    "price": "Rp 13.500"
                },
                {
                    "count_min": 100,
                    "count_max": 100,
                    "price": "Rp 12.500"
                }
            ],
            "condition": 1,
            "preorder": 0,
            "department_id": 563,
            "rating": 0,
            "is_featured": 0,
            "count_review": 0,
            "count_talk": 0,
            "count_sold": 0,
            "labels": [
                {
                    "title": "Grosir",
                    "color": "#ffffff"
                }
            ],
            "top_label": null,
            "bottom_label": null,
            "badges": [
                {
                    "title": "Power Badge",
                    "image_url": "https://ecs7.tokopedia.net/img/power-badge/power-badge-192.png",
                    "show": true
                }
            ],
            "original_price": "",
            "discount_expired": "",
            "discount_start": "",
            "discount_percentage": 0,
            "stock": 0
        },
        {
            "id": 377440815,
            "name": "Box/Dus/Kotak Samsung Galaxy J3 Pro SEIN (Full Set)",
            "uri": "https://www.tokopedia.com/r7gemstone/box-dus-kotak-samsung-galaxy-j3-pro-sein-full-set?trkid=f%3DCa0000L000P1W1S1Sh00Co0Po0Fr0Cb0_page%3D1_ob%3D32_q%3Dsamsung_catid%3D77_po%3D6",
            "image_uri": "https://ecs7.tokopedia.net/img/cache/200-square/product-1/2018/12/18/648719/648719_7fa9d651-3d89-480e-bcf5-c9f936b401df_1717_1717.jpg",
            "image_uri_700": "https://ecs7.tokopedia.net/img/cache/700/product-1/2018/12/18/648719/648719_7fa9d651-3d89-480e-bcf5-c9f936b401df_1717_1717.jpg",
            "price": "Rp 100.000",
            "price_range": "",
            "category_breadcrumb": "handphone-tablet/aksesoris-handphone/lainnya",
            "shop": {
                "id": 1002836,
                "name": "R7 GemStone",
                "uri": "https://www.tokopedia.com/r7gemstone",
                "is_gold": 1,
                "rating": null,
                "location": "Jakarta",
                "reputation_image_uri": "https://inbox.tokopedia.com/reputation/v1/badge/shop/1002836",
                "shop_lucky": "https://clover.tokopedia.com/badges/merchant/v1?shop_id=1002836",
                "city": "Jakarta",
                "is_power_badge": true
            },
            "wholesale_price": [
                {
                    "count_min": 6,
                    "count_max": 12,
                    "price": "Rp 95.000"
                },
                {
                    "count_min": 13,
                    "count_max": 10000,
                    "price": "Rp 90.000"
                }
            ],
            "condition": 1,
            "preorder": 0,
            "department_id": 77,
            "rating": 0,
            "is_featured": 0,
            "count_review": 0,
            "count_talk": 0,
            "count_sold": 0,
            "labels": [
                {
                    "title": "Cashback 3%",
                    "color": "#42b549"
                },
                {
                    "title": "Grosir",
                    "color": "#ffffff"
                }
            ],
            "top_label": null,
            "bottom_label": null,
            "badges": [
                {
                    "title": "Power Badge",
                    "image_url": "https://ecs7.tokopedia.net/img/power-badge/power-badge-192.png",
                    "show": true
                }
            ],
            "original_price": "",
            "discount_expired": "",
            "discount_start": "",
            "discount_percentage": 0,
            "stock": 0
        },
        {
            "id": 370911800,
            "name": "OTG SAMSUNG S7 - V8 TO USB - MICRO USB WHITE ORIGINAL 100%",
            "uri": "https://www.tokopedia.com/bcaaksesoris/otg-samsung-s7-v8-to-usb-micro-usb-white-original-100?trkid=f%3DCa0000L000P1W1S1Sh00Co0Po0Fr0Cb0_page%3D1_ob%3D32_q%3Dsamsung_catid%3D77_po%3D7",
            "image_uri": "https://ecs7.tokopedia.net/img/cache/200-square/product-1/2018/12/4/15297204/15297204_1d6cf3ed-f18c-488b-9999-e555ce0fe39b_2048_1536.jpg",
            "image_uri_700": "https://ecs7.tokopedia.net/img/cache/700/product-1/2018/12/4/15297204/15297204_1d6cf3ed-f18c-488b-9999-e555ce0fe39b_2048_1536.jpg",
            "price": "Rp 18.000",
            "price_range": "",
            "category_breadcrumb": "handphone-tablet/aksesoris-handphone/lainnya",
            "shop": {
                "id": 1742264,
                "name": "BCA AKSESORIS",
                "uri": "https://www.tokopedia.com/bcaaksesoris",
                "is_gold": 1,
                "rating": null,
                "location": "Jakarta",
                "reputation_image_uri": "https://inbox.tokopedia.com/reputation/v1/badge/shop/1742264",
                "shop_lucky": "https://clover.tokopedia.com/badges/merchant/v1?shop_id=1742264",
                "city": "Jakarta",
                "is_power_badge": true
            },
            "wholesale_price": [
                {
                    "count_min": 2,
                    "count_max": 10000,
                    "price": "Rp 17.000"
                }
            ],
            "condition": 1,
            "preorder": 0,
            "department_id": 77,
            "rating": 100,
            "is_featured": 0,
            "count_review": 1,
            "count_talk": 0,
            "count_sold": 0,
            "labels": [
                {
                    "title": "Grosir",
                    "color": "#ffffff"
                }
            ],
            "top_label": null,
            "bottom_label": null,
            "badges": [
                {
                    "title": "Power Badge",
                    "image_url": "https://ecs7.tokopedia.net/img/power-badge/power-badge-192.png",
                    "show": true
                }
            ],
            "original_price": "",
            "discount_expired": "",
            "discount_start": "",
            "discount_percentage": 0,
            "stock": 0
        },
        {
            "id": 377657387,
            "name": "headset stereo samsung HM-60",
            "uri": "https://www.tokopedia.com/batubatuanalam/headset-stereo-samsung-hm-60?trkid=f%3DCa0000L000P1W1S1Sh00Co0Po0Fr0Cb0_page%3D1_ob%3D32_q%3Dsamsung_catid%3D563_po%3D8",
            "image_uri": "https://ecs7.tokopedia.net/img/cache/200-square/product-1/2018/12/18/384765/384765_cf54131c-a11f-459f-a912-dc5824fb0f79_1152_1152.jpg",
            "image_uri_700": "https://ecs7.tokopedia.net/img/cache/700/product-1/2018/12/18/384765/384765_cf54131c-a11f-459f-a912-dc5824fb0f79_1152_1152.jpg",
            "price": "Rp 15.000",
            "price_range": "",
            "category_breadcrumb": "elektronik/audio/headset",
            "shop": {
                "id": 384765,
                "name": "gem stone shop",
                "uri": "https://www.tokopedia.com/batubatuanalam",
                "is_gold": 1,
                "rating": null,
                "location": "Kota Surabaya",
                "reputation_image_uri": "https://inbox.tokopedia.com/reputation/v1/badge/shop/384765",
                "shop_lucky": "https://clover.tokopedia.com/badges/merchant/v1?shop_id=384765",
                "city": "Kota Surabaya",
                "is_power_badge": true
            },
            "wholesale_price": [
                {
                    "count_min": 5,
                    "count_max": 9,
                    "price": "Rp 11.000"
                },
                {
                    "count_min": 10,
                    "count_max": 10000,
                    "price": "Rp 9.000"
                }
            ],
            "condition": 1,
            "preorder": 0,
            "department_id": 563,
            "rating": 0,
            "is_featured": 0,
            "count_review": 0,
            "count_talk": 0,
            "count_sold": 0,
            "labels": [
                {
                    "title": "Grosir",
                    "color": "#ffffff"
                }
            ],
            "top_label": null,
            "bottom_label": null,
            "badges": [
                {
                    "title": "Power Badge",
                    "image_url": "https://ecs7.tokopedia.net/img/power-badge/power-badge-192.png",
                    "show": true
                }
            ],
            "original_price": "",
            "discount_expired": "",
            "discount_start": "",
            "discount_percentage": 0,
            "stock": 0
        },
        {
            "id": 390281889,
            "name": "Strap 22mm For Samsung Gear S3 / Galaxy Watch 46mm / Amazfit Stratos",
            "uri": "https://www.tokopedia.com/jmcell/strap-22mm-for-samsung-gear-s3-galaxy-watch-46mm-amazfit-stratos?trkid=f%3DCa0000L000P1W1S1Sh00Co0Po0Fr0Cb0_page%3D1_ob%3D32_q%3Dsamsung_catid%3D1874_po%3D9",
            "image_uri": "https://ecs7.tokopedia.net/img/cache/200-square/product-1/2019/1/15/532319/532319_445ef2c1-c69c-4b82-8c5c-6e4b6dc82f5f_500_500.jpg",
            "image_uri_700": "https://ecs7.tokopedia.net/img/cache/700/product-1/2019/1/15/532319/532319_445ef2c1-c69c-4b82-8c5c-6e4b6dc82f5f_500_500.jpg",
            "price": "Rp 50.000",
            "price_range": "",
            "category_breadcrumb": "fashion-pria/jam-tangan/strap-jam-tangan",
            "shop": {
                "id": 121149,
                "name": "JM Cell Surabaya",
                "uri": "https://www.tokopedia.com/jmcell",
                "is_gold": 1,
                "rating": null,
                "location": "Kota Surabaya",
                "reputation_image_uri": "https://inbox.tokopedia.com/reputation/v1/badge/shop/121149",
                "shop_lucky": "https://clover.tokopedia.com/badges/merchant/v1?shop_id=121149",
                "city": "Kota Surabaya",
                "is_power_badge": true
            },
            "wholesale_price": [
                {
                    "count_min": 2,
                    "count_max": 5,
                    "price": "Rp 45.000"
                },
                {
                    "count_min": 6,
                    "count_max": 10000,
                    "price": "Rp 40.000"
                }
            ],
            "condition": 1,
            "preorder": 0,
            "department_id": 1874,
            "rating": 60,
            "is_featured": 0,
            "count_review": 1,
            "count_talk": 0,
            "count_sold": 0,
            "labels": [
                {
                    "title": "Grosir",
                    "color": "#ffffff"
                }
            ],
            "top_label": null,
            "bottom_label": null,
            "badges": [
                {
                    "title": "Power Badge",
                    "image_url": "https://ecs7.tokopedia.net/img/power-badge/power-badge-192.png",
                    "show": true
                }
            ],
            "original_price": "",
            "discount_expired": "",
            "discount_start": "",
            "discount_percentage": 0,
            "stock": 0
        },
        {
            "id": 384513296,
            "name": "Headset Bluetooth Samsung P11 Stereo - Earbud Earphone Wireless HF",
            "uri": "https://www.tokopedia.com/mirai39/headset-bluetooth-samsung-p11-stereo-earbud-earphone-wireless-hf?trkid=f%3DCa0000L000P1W1S1Sh00Co0Po0Fr0Cb0_page%3D1_ob%3D32_q%3Dsamsung_catid%3D72_po%3D10",
            "image_uri": "https://ecs7.tokopedia.net/img/cache/200-square/product-1/2019/1/4/31086028/31086028_78ff590c-d25e-41ca-a4f7-7f9cea22d665_1000_1000.jpg",
            "image_uri_700": "https://ecs7.tokopedia.net/img/cache/700/product-1/2019/1/4/31086028/31086028_78ff590c-d25e-41ca-a4f7-7f9cea22d665_1000_1000.jpg",
            "price": "Rp 17.500",
            "price_range": "",
            "category_breadcrumb": "handphone-tablet/headset-bluetooth",
            "shop": {
                "id": 3300128,
                "name": "Mirai 39",
                "uri": "https://www.tokopedia.com/mirai39",
                "is_gold": 1,
                "rating": null,
                "location": "Jakarta",
                "reputation_image_uri": "https://inbox.tokopedia.com/reputation/v1/badge/shop/3300128",
                "shop_lucky": "https://clover.tokopedia.com/badges/merchant/v1?shop_id=3300128",
                "city": "Jakarta",
                "is_power_badge": true
            },
            "wholesale_price": [
                {
                    "count_min": 12,
                    "count_max": 12,
                    "price": "Rp 17.499"
                }
            ],
            "condition": 1,
            "preorder": 0,
            "department_id": 72,
            "rating": 0,
            "is_featured": 0,
            "count_review": 0,
            "count_talk": 0,
            "count_sold": 0,
            "labels": [
                {
                    "title": "Grosir",
                    "color": "#ffffff"
                }
            ],
            "top_label": null,
            "bottom_label": null,
            "badges": [
                {
                    "title": "Power Badge",
                    "image_url": "https://ecs7.tokopedia.net/img/power-badge/power-badge-192.png",
                    "show": true
                }
            ],
            "original_price": "",
            "discount_expired": "",
            "discount_start": "",
            "discount_percentage": 0,
            "stock": 0
        }
    ],
    "category": {
        "data": {
            "11": {
                "id": 11,
                "name": "Lainnya",
                "total_data": "1",
                "parent_id": 54,
                "child_id": null,
                "level": 2
            },
            "16": {
                "id": 16,
                "name": "Mainan & Hobi Lainnya",
                "total_data": "4",
                "parent_id": 55,
                "child_id": [
                    505,
                    545
                ],
                "level": 2
            },
            "18": {
                "id": 18,
                "name": "Musik",
                "total_data": "3",
                "parent_id": 57,
                "child_id": [
                    1519
                ],
                "level": 2
            },
            "24": {
                "id": 24,
                "name": "Handphone",
                "total_data": "17",
                "parent_id": 65,
                "child_id": null,
                "level": 2
            },
            "25": {
                "id": 25,
                "name": "Audio",
                "total_data": "452",
                "parent_id": 60,
                "child_id": [
                    563,
                    565,
                    564,
                    634
                ],
                "level": 2
            },
            "27": {
                "id": 27,
                "name": "Media Player",
                "total_data": "3",
                "parent_id": 60,
                "child_id": [
                    568
                ],
                "level": 2
            },
            "36": {
                "id": 36,
                "name": "Produk Lainnya",
                "total_data": "14",
                "parent_id": 0,
                "child_id": null,
                "level": 1
            },
            "39": {
                "id": 39,
                "name": "Aksesoris Motor",
                "total_data": "1",
                "parent_id": 63,
                "child_id": [
                    1309
                ],
                "level": 2
            },
            "40": {
                "id": 40,
                "name": "Aksesoris Mobil",
                "total_data": "44",
                "parent_id": 63,
                "child_id": [
                    1300,
                    1299,
                    1295
                ],
                "level": 2
            },
            "50": {
                "id": 50,
                "name": "Perangkat Elektronik Lainnya",
                "total_data": "64",
                "parent_id": 60,
                "child_id": [
                    573,
                    577
                ],
                "level": 2
            },
            "54": {
                "id": 54,
                "name": "Souvenir & Kado",
                "total_data": "1",
                "parent_id": 0,
                "child_id": [
                    11
                ],
                "level": 1
            },
            "55": {
                "id": 55,
                "name": "Mainan & Hobi",
                "total_data": "6",
                "parent_id": 0,
                "child_id": [
                    16,
                    486
                ],
                "level": 1
            },
            "57": {
                "id": 57,
                "name": "Film & Musik",
                "total_data": "3",
                "parent_id": 0,
                "child_id": [
                    18
                ],
                "level": 1
            },
            "60": {
                "id": 60,
                "name": "Elektronik",
                "total_data": "572",
                "parent_id": 0,
                "child_id": [
                    25,
                    50,
                    655,
                    2090,
                    27,
                    548,
                    560,
                    989,
                    990
                ],
                "level": 1
            },
            "63": {
                "id": 63,
                "name": "Otomotif",
                "total_data": "47",
                "parent_id": 0,
                "child_id": [
                    40,
                    39,
                    1316,
                    1322
                ],
                "level": 1
            },
            "65": {
                "id": 65,
                "name": "Handphone & Tablet",
                "total_data": "26.704",
                "parent_id": 0,
                "child_id": [
                    66,
                    71,
                    72,
                    616,
                    277,
                    615,
                    274,
                    24,
                    360,
                    276,
                    1536,
                    1754,
                    275
                ],
                "level": 1
            },
            "66": {
                "id": 66,
                "name": "Aksesoris Handphone",
                "total_data": "25.589",
                "parent_id": 65,
                "child_id": [
                    69,
                    76,
                    67,
                    70,
                    75,
                    77,
                    68,
                    599,
                    600,
                    73,
                    74
                ],
                "level": 2
            },
            "67": {
                "id": 67,
                "name": "Baterai",
                "total_data": "2.325",
                "parent_id": 66,
                "child_id": null,
                "level": 3
            },
            "68": {
                "id": 68,
                "name": "Aksesoris Mobil",
                "total_data": "45",
                "parent_id": 66,
                "child_id": null,
                "level": 3
            },
            "69": {
                "id": 69,
                "name": "Casing & Cover",
                "total_data": "15.366",
                "parent_id": 66,
                "child_id": null,
                "level": 3
            },
            "70": {
                "id": 70,
                "name": "Charger",
                "total_data": "978",
                "parent_id": 66,
                "child_id": null,
                "level": 3
            },
            "71": {
                "id": 71,
                "name": "Kabel Data",
                "total_data": "498",
                "parent_id": 65,
                "child_id": null,
                "level": 2
            },
            "72": {
                "id": 72,
                "name": "Headset Bluetooth",
                "total_data": "171",
                "parent_id": 65,
                "child_id": null,
                "level": 2
            },
            "73": {
                "id": 73,
                "name": "Mount Handphone",
                "total_data": "5",
                "parent_id": 66,
                "child_id": null,
                "level": 3
            },
            "74": {
                "id": 74,
                "name": "Gantungan Handphone",
                "total_data": "3",
                "parent_id": 66,
                "child_id": null,
                "level": 3
            },
            "75": {
                "id": 75,
                "name": "Spare Part",
                "total_data": "900",
                "parent_id": 66,
                "child_id": null,
                "level": 3
            },
            "76": {
                "id": 76,
                "name": "Screen Guard",
                "total_data": "5.509",
                "parent_id": 66,
                "child_id": null,
                "level": 3
            },
            "77": {
                "id": 77,
                "name": "Aksesoris Handphone Lainnya",
                "total_data": "414",
                "parent_id": 66,
                "child_id": null,
                "level": 3
            },
            "274": {
                "id": 274,
                "name": "Memory Card",
                "total_data": "67",
                "parent_id": 65,
                "child_id": [
                    609,
                    606,
                    607,
                    602,
                    603
                ],
                "level": 2
            },
            "275": {
                "id": 275,
                "name": "Nomor Perdana & Voucher",
                "total_data": "1",
                "parent_id": 65,
                "child_id": null,
                "level": 2
            },
            "276": {
                "id": 276,
                "name": "Tablet",
                "total_data": "4",
                "parent_id": 65,
                "child_id": null,
                "level": 2
            },
            "277": {
                "id": 277,
                "name": "Aksesoris Tablet",
                "total_data": "175",
                "parent_id": 65,
                "child_id": [
                    280,
                    286,
                    278,
                    281,
                    285,
                    284,
                    279,
                    282,
                    287
                ],
                "level": 2
            },
            "278": {
                "id": 278,
                "name": "Baterai",
                "total_data": "18",
                "parent_id": 277,
                "child_id": null,
                "level": 3
            },
            "279": {
                "id": 279,
                "name": "Aksesoris Mobil",
                "total_data": "1",
                "parent_id": 277,
                "child_id": null,
                "level": 3
            },
            "280": {
                "id": 280,
                "name": "Casing & Cover",
                "total_data": "68",
                "parent_id": 277,
                "child_id": null,
                "level": 3
            },
            "281": {
                "id": 281,
                "name": "Charger",
                "total_data": "17",
                "parent_id": 277,
                "child_id": null,
                "level": 3
            },
            "282": {
                "id": 282,
                "name": "Mount Tablet",
                "total_data": "1",
                "parent_id": 277,
                "child_id": null,
                "level": 3
            },
            "284": {
                "id": 284,
                "name": "Connection Kit",
                "total_data": "4",
                "parent_id": 277,
                "child_id": null,
                "level": 3
            },
            "285": {
                "id": 285,
                "name": "Spare Part",
                "total_data": "5",
                "parent_id": 277,
                "child_id": null,
                "level": 3
            },
            "286": {
                "id": 286,
                "name": "Screen Guard",
                "total_data": "60",
                "parent_id": 277,
                "child_id": null,
                "level": 3
            },
            "287": {
                "id": 287,
                "name": "Aksesoris Tablet Lainnya",
                "total_data": "1",
                "parent_id": 277,
                "child_id": null,
                "level": 3
            },
            "288": {
                "id": 288,
                "name": "Laptop & Aksesoris",
                "total_data": "18",
                "parent_id": 0,
                "child_id": [
                    290
                ],
                "level": 1
            },
            "290": {
                "id": 290,
                "name": "Aksesoris Laptop",
                "total_data": "18",
                "parent_id": 288,
                "child_id": [
                    294,
                    293,
                    296
                ],
                "level": 2
            },
            "293": {
                "id": 293,
                "name": "Baterai Laptop",
                "total_data": "2",
                "parent_id": 290,
                "child_id": null,
                "level": 3
            },
            "294": {
                "id": 294,
                "name": "Adaptor Laptop",
                "total_data": "15",
                "parent_id": 290,
                "child_id": null,
                "level": 3
            },
            "296": {
                "id": 296,
                "name": "Aksesoris Laptop Lainnya",
                "total_data": "1",
                "parent_id": 290,
                "child_id": null,
                "level": 3
            },
            "297": {
                "id": 297,
                "name": "Komputer & Aksesoris",
                "total_data": "155",
                "parent_id": 0,
                "child_id": [
                    320,
                    338,
                    324,
                    299,
                    332
                ],
                "level": 1
            },
            "299": {
                "id": 299,
                "name": "Komponen Komputer",
                "total_data": "4",
                "parent_id": 297,
                "child_id": [
                    305
                ],
                "level": 2
            },
            "305": {
                "id": 305,
                "name": "Monitor",
                "total_data": "4",
                "parent_id": 299,
                "child_id": null,
                "level": 3
            },
            "320": {
                "id": 320,
                "name": "Harddisk & Flashdisk",
                "total_data": "120",
                "parent_id": 297,
                "child_id": [
                    342,
                    363,
                    321
                ],
                "level": 2
            },
            "321": {
                "id": 321,
                "name": "HDD External",
                "total_data": "4",
                "parent_id": 320,
                "child_id": null,
                "level": 3
            },
            "324": {
                "id": 324,
                "name": "Printer",
                "total_data": "16",
                "parent_id": 297,
                "child_id": [
                    329,
                    354,
                    365
                ],
                "level": 2
            },
            "329": {
                "id": 329,
                "name": "Laser Mono",
                "total_data": "6",
                "parent_id": 324,
                "child_id": null,
                "level": 3
            },
            "332": {
                "id": 332,
                "name": "Networking",
                "total_data": "2",
                "parent_id": 297,
                "child_id": [
                    356
                ],
                "level": 2
            },
            "338": {
                "id": 338,
                "name": "Peripheral & Aksesoris",
                "total_data": "13",
                "parent_id": 297,
                "child_id": [
                    347,
                    344,
                    352
                ],
                "level": 2
            },
            "342": {
                "id": 342,
                "name": "Flash Disk",
                "total_data": "104",
                "parent_id": 320,
                "child_id": null,
                "level": 3
            },
            "344": {
                "id": 344,
                "name": "Kabel & Konektor",
                "total_data": "4",
                "parent_id": 338,
                "child_id": null,
                "level": 3
            },
            "347": {
                "id": 347,
                "name": "Peripheral & Aksesoris Lainnya",
                "total_data": "7",
                "parent_id": 338,
                "child_id": null,
                "level": 3
            },
            "352": {
                "id": 352,
                "name": "Card Readers",
                "total_data": "2",
                "parent_id": 338,
                "child_id": null,
                "level": 3
            },
            "354": {
                "id": 354,
                "name": "Tinta Printer",
                "total_data": "5",
                "parent_id": 324,
                "child_id": null,
                "level": 3
            },
            "356": {
                "id": 356,
                "name": "Networking Lainnya",
                "total_data": "2",
                "parent_id": 332,
                "child_id": null,
                "level": 3
            },
            "360": {
                "id": 360,
                "name": "Stylus",
                "total_data": "14",
                "parent_id": 65,
                "child_id": null,
                "level": 2
            },
            "363": {
                "id": 363,
                "name": "HDD Cases & Docking",
                "total_data": "12",
                "parent_id": 320,
                "child_id": null,
                "level": 3
            },
            "365": {
                "id": 365,
                "name": "Spare Part",
                "total_data": "5",
                "parent_id": 324,
                "child_id": null,
                "level": 3
            },
            "486": {
                "id": 486,
                "name": "Mainan Remote Control",
                "total_data": "2",
                "parent_id": 55,
                "child_id": [
                    518
                ],
                "level": 2
            },
            "505": {
                "id": 505,
                "name": "Lainnya Lainnya",
                "total_data": "2",
                "parent_id": 16,
                "child_id": null,
                "level": 3
            },
            "518": {
                "id": 518,
                "name": "Part RC",
                "total_data": "2",
                "parent_id": 486,
                "child_id": null,
                "level": 3
            },
            "545": {
                "id": 545,
                "name": "Peralatan Camping & Olahraga Outdoor",
                "total_data": "2",
                "parent_id": 16,
                "child_id": null,
                "level": 3
            },
            "548": {
                "id": 548,
                "name": "Kamera Pengintai",
                "total_data": "2",
                "parent_id": 60,
                "child_id": [
                    550
                ],
                "level": 2
            },
            "550": {
                "id": 550,
                "name": "Kamera CCTV",
                "total_data": "2",
                "parent_id": 548,
                "child_id": null,
                "level": 3
            },
            "560": {
                "id": 560,
                "name": "Telepon",
                "total_data": "1",
                "parent_id": 60,
                "child_id": [
                    635
                ],
                "level": 2
            },
            "563": {
                "id": 563,
                "name": "Headset",
                "total_data": "370",
                "parent_id": 25,
                "child_id": null,
                "level": 3
            },
            "564": {
                "id": 564,
                "name": "Headphone",
                "total_data": "5",
                "parent_id": 25,
                "child_id": null,
                "level": 3
            },
            "565": {
                "id": 565,
                "name": "Earphone",
                "total_data": "76",
                "parent_id": 25,
                "child_id": null,
                "level": 3
            },
            "568": {
                "id": 568,
                "name": "DVD Player",
                "total_data": "3",
                "parent_id": 27,
                "child_id": null,
                "level": 3
            },
            "573": {
                "id": 573,
                "name": "Baterai",
                "total_data": "41",
                "parent_id": 50,
                "child_id": null,
                "level": 3
            },
            "577": {
                "id": 577,
                "name": "Perangkat Elektronik Lainnya Lainnya",
                "total_data": "23",
                "parent_id": 50,
                "child_id": null,
                "level": 3
            },
            "578": {
                "id": 578,
                "name": "Kamera",
                "total_data": "14",
                "parent_id": 0,
                "child_id": [
                    2319,
                    686,
                    617,
                    581,
                    2322
                ],
                "level": 1
            },
            "581": {
                "id": 581,
                "name": "Aksesoris Kamera",
                "total_data": "1",
                "parent_id": 578,
                "child_id": [
                    593
                ],
                "level": 2
            },
            "589": {
                "id": 589,
                "name": "Filter",
                "total_data": "2",
                "parent_id": 617,
                "child_id": null,
                "level": 3
            },
            "590": {
                "id": 590,
                "name": "Baterai",
                "total_data": "3",
                "parent_id": 686,
                "child_id": null,
                "level": 3
            },
            "593": {
                "id": 593,
                "name": "Tas & Casing Kamera",
                "total_data": "1",
                "parent_id": 581,
                "child_id": null,
                "level": 3
            },
            "599": {
                "id": 599,
                "name": "Skin Handphone",
                "total_data": "34",
                "parent_id": 66,
                "child_id": null,
                "level": 3
            },
            "600": {
                "id": 600,
                "name": "Docking Handphone",
                "total_data": "10",
                "parent_id": 66,
                "child_id": null,
                "level": 3
            },
            "602": {
                "id": 602,
                "name": "Compact Flash",
                "total_data": "2",
                "parent_id": 274,
                "child_id": null,
                "level": 3
            },
            "603": {
                "id": 603,
                "name": "Memory Stick PRO Duo",
                "total_data": "1",
                "parent_id": 274,
                "child_id": null,
                "level": 3
            },
            "606": {
                "id": 606,
                "name": "MMC",
                "total_data": "5",
                "parent_id": 274,
                "child_id": null,
                "level": 3
            },
            "607": {
                "id": 607,
                "name": "SD Card",
                "total_data": "3",
                "parent_id": 274,
                "child_id": null,
                "level": 3
            },
            "609": {
                "id": 609,
                "name": "microSD Card",
                "total_data": "56",
                "parent_id": 274,
                "child_id": null,
                "level": 3
            },
            "615": {
                "id": 615,
                "name": "Power Bank",
                "total_data": "63",
                "parent_id": 65,
                "child_id": null,
                "level": 2
            },
            "616": {
                "id": 616,
                "name": "Kabel & Konektor",
                "total_data": "100",
                "parent_id": 65,
                "child_id": null,
                "level": 2
            },
            "617": {
                "id": 617,
                "name": "Lensa & Aksesoris",
                "total_data": "2",
                "parent_id": 578,
                "child_id": [
                    589
                ],
                "level": 2
            },
            "634": {
                "id": 634,
                "name": "Audio Lainnya",
                "total_data": "1",
                "parent_id": 25,
                "child_id": null,
                "level": 3
            },
            "635": {
                "id": 635,
                "name": "Telepon Lainnya",
                "total_data": "1",
                "parent_id": 560,
                "child_id": null,
                "level": 3
            },
            "642": {
                "id": 642,
                "name": "Office & Stationery",
                "total_data": "1",
                "parent_id": 0,
                "child_id": [
                    1106
                ],
                "level": 1
            },
            "653": {
                "id": 653,
                "name": "Stiker",
                "total_data": "1",
                "parent_id": 1106,
                "child_id": null,
                "level": 3
            },
            "655": {
                "id": 655,
                "name": "TV",
                "total_data": "36",
                "parent_id": 60,
                "child_id": [
                    659,
                    663,
                    656
                ],
                "level": 2
            },
            "656": {
                "id": 656,
                "name": "LED TV",
                "total_data": "1",
                "parent_id": 655,
                "child_id": null,
                "level": 3
            },
            "659": {
                "id": 659,
                "name": "Remote TV",
                "total_data": "31",
                "parent_id": 655,
                "child_id": null,
                "level": 3
            },
            "663": {
                "id": 663,
                "name": "TV Lainnya",
                "total_data": "4",
                "parent_id": 655,
                "child_id": null,
                "level": 3
            },
            "686": {
                "id": 686,
                "name": "Baterai, Charger & Grip",
                "total_data": "3",
                "parent_id": 578,
                "child_id": [
                    590
                ],
                "level": 2
            },
            "908": {
                "id": 908,
                "name": "Peralatan Masak",
                "total_data": "1",
                "parent_id": 983,
                "child_id": [
                    954
                ],
                "level": 2
            },
            "954": {
                "id": 954,
                "name": "Peralatan Masak Lainnya",
                "total_data": "1",
                "parent_id": 908,
                "child_id": null,
                "level": 3
            },
            "983": {
                "id": 983,
                "name": "Dapur",
                "total_data": "1",
                "parent_id": 0,
                "child_id": [
                    908
                ],
                "level": 1
            },
            "984": {
                "id": 984,
                "name": "Rumah Tangga",
                "total_data": "6",
                "parent_id": 0,
                "child_id": [
                    995,
                    987,
                    994
                ],
                "level": 1
            },
            "987": {
                "id": 987,
                "name": "Laundry",
                "total_data": "2",
                "parent_id": 984,
                "child_id": [
                    1014
                ],
                "level": 2
            },
            "989": {
                "id": 989,
                "name": "Pencahayaan",
                "total_data": "1",
                "parent_id": 60,
                "child_id": [
                    1030
                ],
                "level": 2
            },
            "990": {
                "id": 990,
                "name": "Listrik",
                "total_data": "1",
                "parent_id": 60,
                "child_id": [
                    1031
                ],
                "level": 2
            },
            "994": {
                "id": 994,
                "name": "Alat Pertukangan",
                "total_data": "1",
                "parent_id": 984,
                "child_id": [
                    1057
                ],
                "level": 2
            },
            "995": {
                "id": 995,
                "name": "Rumah Tangga Lainnya",
                "total_data": "3",
                "parent_id": 984,
                "child_id": null,
                "level": 2
            },
            "1014": {
                "id": 1014,
                "name": "Laundry Lainnya",
                "total_data": "2",
                "parent_id": 987,
                "child_id": null,
                "level": 3
            },
            "1030": {
                "id": 1030,
                "name": "Pencahayaan Lainnya",
                "total_data": "1",
                "parent_id": 989,
                "child_id": null,
                "level": 3
            },
            "1031": {
                "id": 1031,
                "name": "Stop Kontak",
                "total_data": "1",
                "parent_id": 990,
                "child_id": null,
                "level": 3
            },
            "1057": {
                "id": 1057,
                "name": "Obeng",
                "total_data": "1",
                "parent_id": 994,
                "child_id": null,
                "level": 3
            },
            "1106": {
                "id": 1106,
                "name": "Pengikat & Perekat",
                "total_data": "1",
                "parent_id": 642,
                "child_id": [
                    653
                ],
                "level": 2
            },
            "1295": {
                "id": 1295,
                "name": "Interior",
                "total_data": "4",
                "parent_id": 40,
                "child_id": null,
                "level": 3
            },
            "1299": {
                "id": 1299,
                "name": "Lampu",
                "total_data": "9",
                "parent_id": 40,
                "child_id": null,
                "level": 3
            },
            "1300": {
                "id": 1300,
                "name": "Aksesoris Mobil Lainnya",
                "total_data": "31",
                "parent_id": 40,
                "child_id": null,
                "level": 3
            },
            "1309": {
                "id": 1309,
                "name": "Aksesoris Motor Lainnya",
                "total_data": "1",
                "parent_id": 39,
                "child_id": null,
                "level": 3
            },
            "1316": {
                "id": 1316,
                "name": "Aksesoris Pengendara Motor",
                "total_data": "1",
                "parent_id": 63,
                "child_id": [
                    1319
                ],
                "level": 2
            },
            "1319": {
                "id": 1319,
                "name": "Sarung Tangan",
                "total_data": "1",
                "parent_id": 1316,
                "child_id": null,
                "level": 3
            },
            "1322": {
                "id": 1322,
                "name": "Oli & Penghemat BBM",
                "total_data": "1",
                "parent_id": 63,
                "child_id": [
                    1326
                ],
                "level": 2
            },
            "1326": {
                "id": 1326,
                "name": "Penghemat BBM",
                "total_data": "1",
                "parent_id": 1322,
                "child_id": null,
                "level": 3
            },
            "1519": {
                "id": 1519,
                "name": "Musik Lainnya",
                "total_data": "3",
                "parent_id": 18,
                "child_id": null,
                "level": 3
            },
            "1536": {
                "id": 1536,
                "name": "Smartwatch",
                "total_data": "3",
                "parent_id": 65,
                "child_id": null,
                "level": 2
            },
            "1754": {
                "id": 1754,
                "name": "Tongsis",
                "total_data": "2",
                "parent_id": 65,
                "child_id": null,
                "level": 2
            },
            "1758": {
                "id": 1758,
                "name": "Fashion Wanita",
                "total_data": "36",
                "parent_id": 0,
                "child_id": [
                    1916,
                    1775,
                    1905
                ],
                "level": 1
            },
            "1759": {
                "id": 1759,
                "name": "Fashion Pria",
                "total_data": "57",
                "parent_id": 0,
                "child_id": [
                    1784,
                    1804,
                    1803
                ],
                "level": 1
            },
            "1775": {
                "id": 1775,
                "name": "Celana",
                "total_data": "4",
                "parent_id": 1758,
                "child_id": [
                    1781
                ],
                "level": 2
            },
            "1781": {
                "id": 1781,
                "name": "Legging",
                "total_data": "4",
                "parent_id": 1775,
                "child_id": null,
                "level": 3
            },
            "1784": {
                "id": 1784,
                "name": "Atasan",
                "total_data": "46",
                "parent_id": 1759,
                "child_id": [
                    1808,
                    1809
                ],
                "level": 2
            },
            "1803": {
                "id": 1803,
                "name": "Aksesoris",
                "total_data": "2",
                "parent_id": 1759,
                "child_id": [
                    1863
                ],
                "level": 2
            },
            "1804": {
                "id": 1804,
                "name": "Jam Tangan",
                "total_data": "9",
                "parent_id": 1759,
                "child_id": [
                    1874
                ],
                "level": 2
            },
            "1808": {
                "id": 1808,
                "name": "Kaos",
                "total_data": "38",
                "parent_id": 1784,
                "child_id": null,
                "level": 3
            },
            "1809": {
                "id": 1809,
                "name": "Polo Shirt",
                "total_data": "8",
                "parent_id": 1784,
                "child_id": null,
                "level": 3
            },
            "1863": {
                "id": 1863,
                "name": "Topi Pria",
                "total_data": "2",
                "parent_id": 1803,
                "child_id": null,
                "level": 3
            },
            "1874": {
                "id": 1874,
                "name": "Strap Jam Tangan",
                "total_data": "9",
                "parent_id": 1804,
                "child_id": null,
                "level": 3
            },
            "1905": {
                "id": 1905,
                "name": "Sepatu",
                "total_data": "4",
                "parent_id": 1758,
                "child_id": [
                    1912,
                    1908
                ],
                "level": 2
            },
            "1908": {
                "id": 1908,
                "name": "Sneakers",
                "total_data": "1",
                "parent_id": 1905,
                "child_id": null,
                "level": 3
            },
            "1912": {
                "id": 1912,
                "name": "Kaos Kaki",
                "total_data": "3",
                "parent_id": 1905,
                "child_id": null,
                "level": 3
            },
            "1916": {
                "id": 1916,
                "name": "Tas",
                "total_data": "28",
                "parent_id": 1758,
                "child_id": [
                    1923
                ],
                "level": 2
            },
            "1923": {
                "id": 1923,
                "name": "Aksesoris Tas",
                "total_data": "28",
                "parent_id": 1916,
                "child_id": null,
                "level": 3
            },
            "2090": {
                "id": 2090,
                "name": "Vaporizer",
                "total_data": "12",
                "parent_id": 60,
                "child_id": [
                    2092
                ],
                "level": 2
            },
            "2092": {
                "id": 2092,
                "name": "Aksesoris Vape",
                "total_data": "12",
                "parent_id": 2090,
                "child_id": null,
                "level": 3
            },
            "2099": {
                "id": 2099,
                "name": "Gaming",
                "total_data": "1",
                "parent_id": 0,
                "child_id": [
                    2117
                ],
                "level": 1
            },
            "2117": {
                "id": 2117,
                "name": "CD Game",
                "total_data": "1",
                "parent_id": 2099,
                "child_id": [
                    2118
                ],
                "level": 2
            },
            "2118": {
                "id": 2118,
                "name": "CD PlayStation",
                "total_data": "1",
                "parent_id": 2117,
                "child_id": null,
                "level": 3
            },
            "2319": {
                "id": 2319,
                "name": "Kamera Digital",
                "total_data": "7",
                "parent_id": 578,
                "child_id": [
                    2325
                ],
                "level": 2
            },
            "2322": {
                "id": 2322,
                "name": "Frame, Album & Roll Film",
                "total_data": "1",
                "parent_id": 578,
                "child_id": [
                    2339
                ],
                "level": 2
            },
            "2325": {
                "id": 2325,
                "name": "Action Camera",
                "total_data": "7",
                "parent_id": 2319,
                "child_id": null,
                "level": 3
            },
            "2339": {
                "id": 2339,
                "name": "Album",
                "total_data": "1",
                "parent_id": 2322,
                "child_id": null,
                "level": 3
            }
        },
        "selected_id": ""
    }
}
